<?xml version="1.0" encoding="UTF-8" standalone="no"?>
<!-- Created with Inkscape (http://www.inkscape.org/) -->

<svg
   xmlns:dc="http://purl.org/dc/elements/1.1/"
   xmlns:cc="http://creativecommons.org/ns#"
   xmlns:rdf="http://www.w3.org/1999/02/22-rdf-syntax-ns#"
   xmlns:svg="http://www.w3.org/2000/svg"
   xmlns="http://www.w3.org/2000/svg"
   xmlns:xlink="http://www.w3.org/1999/xlink"
   xmlns:sodipodi="http://sodipodi.sourceforge.net/DTD/sodipodi-0.dtd"
   xmlns:inkscape="http://www.inkscape.org/namespaces/inkscape"
   width="8.4666662mm"
   height="8.4666662mm"
   viewBox="0 0 8.4666662 8.4666662"
   version="1.1"
   id="svg1609"
   inkscape:version="0.92.5 (2060ec1f9f, 2020-04-08)"
   sodipodi:docname="undo.svg">
  <defs
     id="defs1603">
    <linearGradient
       inkscape:collect="always"
       id="linearGradient4295">
      <stop
         style="stop-color:#000000;stop-opacity:0.16470589"
         offset="0"
         id="stop4297" />
      <stop
         style="stop-color:#000000;stop-opacity:0;"
         offset="1"
         id="stop4299" />
    </linearGradient>
    <linearGradient
       inkscape:collect="always"
       id="linearGradient4254">
      <stop
         style="stop-color:#debb16;stop-opacity:1;"
         offset="0"
         id="stop4256" />
      <stop
         style="stop-color:#ffe984;stop-opacity:1"
         offset="1"
         id="stop4258" />
    </linearGradient>
    <linearGradient
       inkscape:collect="always"
       id="linearGradient4458">
      <stop
         style="stop-color:#000000;stop-opacity:0"
         offset="0"
         id="stop4460" />
      <stop
         id="stop4466"
         offset="0.5"
         style="stop-color:#000000;stop-opacity:1" />
      <stop
         style="stop-color:#000000;stop-opacity:0;"
         offset="1"
         id="stop4462" />
    </linearGradient>
    <linearGradient
       inkscape:collect="always"
       xlink:href="#linearGradient4295"
       id="linearGradient4301"
       x1="113"
       y1="920.36218"
       x2="113"
       y2="912.36218"
       gradientUnits="userSpaceOnUse"
       gradientTransform="translate(-96.000337,32.00039)" />
    <linearGradient
       inkscape:collect="always"
       xlink:href="#linearGradient4254"
       id="linearGradient4260"
       x1="112.28484"
       y1="917.3092"
       x2="118.89701"
       y2="924.20349"
       gradientUnits="userSpaceOnUse"
       spreadMethod="reflect"
       gradientTransform="translate(-96.000337,32.00039)" />
    <linearGradient
       inkscape:collect="always"
       xlink:href="#linearGradient4458"
       id="linearGradient4464"
       x1="118.29453"
       y1="922.34424"
       x2="118.25033"
       y2="909.96979"
       gradientUnits="userSpaceOnUse"
       spreadMethod="pad"
       gradientTransform="matrix(1,0,0,0.89262817,-96.375337,130.16618)" />
  </defs>
  <sodipodi:namedview
     id="base"
     pagecolor="#808080"
     bordercolor="#666666"
     borderopacity="1.0"
     inkscape:pageopacity="0"
     inkscape:pageshadow="2"
     inkscape:zoom="7.919596"
     inkscape:cx="23.737797"
     inkscape:cy="22.263458"
     inkscape:document-units="mm"
     inkscape:current-layer="layer1"
     showgrid="false"
     fit-margin-top="0"
     fit-margin-left="0"
     fit-margin-right="0"
     fit-margin-bottom="0"
     inkscape:window-width="1920"
     inkscape:window-height="1061"
     inkscape:window-x="0"
     inkscape:window-y="0"
     inkscape:window-maximized="1" />
  <metadata
     id="metadata1606">
    <rdf:RDF>
      <cc:Work
         rdf:about="">
        <dc:format>image/svg+xml</dc:format>
        <dc:type
           rdf:resource="http://purl.org/dc/dcmitype/StillImage" />
        <dc:title></dc:title>
      </cc:Work>
    </rdf:RDF>
  </metadata>
  <g
     inkscape:label="Layer 1"
     inkscape:groupmode="layer"
     id="layer1"
     transform="translate(-103.20785,-251.01056)">
    <g
       transform="matrix(0.26458333,0,0,0.26458333,103.20785,5.3813997)"
       id="g2946">
      <rect
         y="928.36218"
         x="0"
         height="32"
         width="32"
         id="rect2930"
         style="opacity:1;vector-effect:none;fill:none;fill-opacity:1;stroke:none;stroke-width:0.8400194;stroke-linecap:round;stroke-linejoin:round;stroke-miterlimit:5;stroke-dasharray:none;stroke-dashoffset:0;stroke-opacity:0.50196078" />
      <g
         id="g4656">
        <path
           sodipodi:nodetypes="ccccsscccsscc"
           inkscape:connector-curvature="0"
           id="path4287"
           d="m 18.557443,950.57371 c -7.20972,0 -13.2634602,-4.41236 -13.2634602,-4.41236 0,0 6.4599902,-5.16979 13.2280502,-5.16979 -1.49596,0.53696 -1.67942,1.83449 -1.67942,2.03952 6.9654,0 10.68059,2.55156 10.68059,5.15834 v 4.1058 c 0,4.49268 -6.22236,6.56998 -20.0540002,6.56998 l 5.0154702,-3.48243 -5.0154702,-2.71911 c 7.4676802,0 17.0301602,-0.0656 17.0301602,-1.73581 v -0.68001 c 0,-1.03133 -3.90552,-1.69217 -7.65675,-1.69217 0,0.20502 -0.0895,1.35221 1.71483,2.01804 z"
           style="color:#000000;clip-rule:nonzero;display:inline;overflow:visible;visibility:visible;opacity:1;isolation:auto;mix-blend-mode:normal;color-interpolation:sRGB;color-interpolation-filters:linearRGB;solid-color:#000000;solid-opacity:1;fill:url(#linearGradient4301);fill-opacity:1;fill-rule:nonzero;stroke:none;stroke-width:0.5;stroke-linecap:round;stroke-linejoin:round;stroke-miterlimit:10;stroke-dasharray:none;stroke-dashoffset:0;stroke-opacity:1;marker:none;color-rendering:auto;image-rendering:auto;shape-rendering:auto;text-rendering:auto;enable-background:accumulate" />
        <path
           style="color:#000000;clip-rule:nonzero;display:inline;overflow:visible;visibility:visible;opacity:1;isolation:auto;mix-blend-mode:normal;color-interpolation:sRGB;color-interpolation-filters:linearRGB;solid-color:#000000;solid-opacity:1;fill:url(#linearGradient4260);fill-opacity:1;fill-rule:nonzero;stroke:#000000;stroke-width:1;stroke-linecap:round;stroke-linejoin:round;stroke-miterlimit:10;stroke-dasharray:none;stroke-dashoffset:0;stroke-opacity:1;marker:none;color-rendering:auto;image-rendering:auto;shape-rendering:auto;text-rendering:auto;enable-background:accumulate"
           d="m 18.557443,945.82917 c -7.20972,0 -13.2634602,-6.41979 -13.2634602,-6.41979 0,0 6.4599902,-7.52182 13.2280502,-7.52182 -1.49596,0.78125 -1.67942,2.66911 -1.67942,2.96741 6.9654,0 10.68059,3.71241 10.68059,7.50516 v 5.97377 c 0,6.53664 -6.22236,9.55902 -20.0540002,9.55902 l 5.0154702,-5.06677 -5.0154702,-3.95619 c 7.4676802,0 17.0301602,-0.0954 17.0301602,-2.52553 v -0.98939 c 0,-1.50054 -3.90552,-2.46203 -7.65675,-2.46203 0,0.2983 -0.0895,1.96741 1.71483,2.93616 z"
           id="path4250"
           inkscape:connector-curvature="0"
           sodipodi:nodetypes="ccccsscccsscc" />
        <path
           style="color:#000000;clip-rule:nonzero;display:inline;overflow:visible;visibility:visible;opacity:1;isolation:auto;mix-blend-mode:normal;color-interpolation:sRGB;color-interpolation-filters:linearRGB;solid-color:#000000;solid-opacity:1;fill:none;fill-opacity:1;fill-rule:nonzero;stroke:url(#linearGradient4464);stroke-width:0.49999997;stroke-linecap:round;stroke-linejoin:round;stroke-miterlimit:10;stroke-dasharray:none;stroke-dashoffset:0;stroke-opacity:0.50196078;marker:none;color-rendering:auto;image-rendering:auto;shape-rendering:auto;text-rendering:auto;enable-background:accumulate"
           d="m 23.249663,953.05411 c 1.71875,-1.16381 2.46875,-2.99248 2.46875,-6.11668 0,-3.1242 -2.84375,-4.35156 -5.84375,-4.35156"
           id="path4456"
           inkscape:connector-curvature="0"
           sodipodi:nodetypes="csc" />
      </g>
    </g>
  </g>
</svg>
