<?xml version="1.0" encoding="UTF-8" standalone="no"?>
<!-- Created with Inkscape (http://www.inkscape.org/) -->

<svg
   xmlns:dc="http://purl.org/dc/elements/1.1/"
   xmlns:cc="http://creativecommons.org/ns#"
   xmlns:rdf="http://www.w3.org/1999/02/22-rdf-syntax-ns#"
   xmlns:svg="http://www.w3.org/2000/svg"
   xmlns="http://www.w3.org/2000/svg"
   xmlns:sodipodi="http://sodipodi.sourceforge.net/DTD/sodipodi-0.dtd"
   xmlns:inkscape="http://www.inkscape.org/namespaces/inkscape"
   width="256"
   height="256"
   viewBox="0 0 67.733334 67.733334"
   version="1.1"
   id="svg1586"
   inkscape:version="0.92.5 (2060ec1f9f, 2020-04-08)"
   sodipodi:docname="fence.svg"
   inkscape:export-filename="/home/frode/Creations/Inkscape/icons/bone.png"
   inkscape:export-xdpi="384.00003"
   inkscape:export-ydpi="384.00003">
  <title
     id="title1810">Bone</title>
  <defs
     id="defs1580" />
  <sodipodi:namedview
     id="base"
     pagecolor="#2d2d2d"
     bordercolor="#000000"
     borderopacity="1"
     inkscape:pageopacity="0"
     inkscape:pageshadow="2"
     inkscape:zoom="1"
     inkscape:cx="457.90693"
     inkscape:cy="134.69511"
     inkscape:document-units="px"
     inkscape:current-layer="layer1"
     showgrid="false"
     fit-margin-top="0"
     fit-margin-left="0"
     fit-margin-right="0"
     fit-margin-bottom="0"
     units="px"
     inkscape:pagecheckerboard="false"
     inkscape:window-width="1920"
     inkscape:window-height="1061"
     inkscape:window-x="0"
     inkscape:window-y="0"
     inkscape:window-maximized="1"
     inkscape:snap-bbox="true"
     inkscape:bbox-nodes="true"
     inkscape:snap-page="true"
     inkscape:snap-global="false"
     inkscape:showpageshadow="false"
     borderlayer="true"
     inkscape:snap-smooth-nodes="true">
    <inkscape:grid
       type="xygrid"
       id="grid1700"
       spacingx="0.13229167"
       spacingy="0.13229167"
       empspacing="2"
       empcolor="#3fd6ff"
       empopacity="0.41176471"
       color="#3f3fff"
       opacity="0.54509804" />
  </sodipodi:namedview>
  <metadata
     id="metadata1583">
    <rdf:RDF>
      <cc:Work
         rdf:about="">
        <dc:format>image/svg+xml</dc:format>
        <dc:type
           rdf:resource="http://purl.org/dc/dcmitype/StillImage" />
        <dc:title>Bone</dc:title>
        <cc:license
           rdf:resource="http://creativecommons.org/licenses/by-nc-sa/4.0/" />
        <dc:creator>
          <cc:Agent>
            <dc:title>魔大农</dc:title>
          </cc:Agent>
        </dc:creator>
        <dc:date>2021</dc:date>
      </cc:Work>
      <cc:License
         rdf:about="http://creativecommons.org/licenses/by-nc-sa/4.0/">
        <cc:permits
           rdf:resource="http://creativecommons.org/ns#Reproduction" />
        <cc:permits
           rdf:resource="http://creativecommons.org/ns#Distribution" />
        <cc:requires
           rdf:resource="http://creativecommons.org/ns#Notice" />
        <cc:requires
           rdf:resource="http://creativecommons.org/ns#Attribution" />
        <cc:prohibits
           rdf:resource="http://creativecommons.org/ns#CommercialUse" />
        <cc:permits
           rdf:resource="http://creativecommons.org/ns#DerivativeWorks" />
        <cc:requires
           rdf:resource="http://creativecommons.org/ns#ShareAlike" />
      </cc:License>
    </rdf:RDF>
  </metadata>
  <g
     inkscape:label="Layer 1"
     inkscape:groupmode="layer"
     id="layer1"
     transform="translate(54.12619,29.571422)">
    <path
       style="opacity:0.55;vector-effect:none;fill:#808b75;fill-opacity:0.13333334;fill-rule:evenodd;stroke:none;stroke-width:1;stroke-linecap:butt;stroke-linejoin:miter;stroke-miterlimit:5.33333349;stroke-dasharray:none;stroke-dashoffset:0;stroke-opacity:1"
       d="m 228.42773,47.607422 -7.35742,5.667969 c -4.04589,3.117323 -9.20294,7.467968 -11.46093,9.667968 l -4.10547,4 0.43554,13 c 0.2399,7.15 1.24208,39.550001 2.22657,72.000001 l 1.78906,59 1.54297,5.82226 c 0.84866,3.20253 1.68517,6.05137 1.85742,6.33008 0.19003,0.30749 6.40676,0.69417 15.81055,0.98242 h 0.002 c 8.52344,0.26124 16.62316,0.44992 17.99805,0.41993 l 2.5,-0.0547 0.12109,-6 c 0.43725,-21.6047 2.12983,-132.564511 2.12891,-139.550782 V 70.34375 L 240.17188,58.976562 Z M 30.716797,62.78125 c -0.04263,0.0052 -0.07697,0.02368 -0.103516,0.05273 -0.306589,0.335582 -3.657386,5.854531 -7.447265,12.263672 L 16.275391,86.75 l 4.15039,63.34766 c 2.282814,34.84086 4.245286,63.4582 4.361328,63.5957 0.116042,0.1375 3.961462,0.61188 8.544922,1.05469 13.119297,1.26748 13.95537,1.21681 20.333985,-1.24024 l 5.5,-2.11719 -0.142578,-2.9746 C 58.425598,195.90361 50.838678,85.476598 50.542969,84.984375 50.335659,84.639297 45.891316,79.377746 40.667969,73.291016 33.88491,65.386765 31.356286,62.702699 30.716797,62.78125 Z M 199.80469,83.310547 c -4.0376,-0.01355 -19.89618,0.673865 -26.5625,1.191406 l -3.92188,0.304688 0.17188,4.402343 c 0.095,2.421482 0.33851,4.567376 0.54101,4.769532 0.2025,0.202156 6.94616,0.0093 14.98633,-0.429688 8.04017,-0.438999 14.7278,-0.690173 14.85938,-0.558594 0.26634,0.266344 1.95736,29.567256 2.00586,34.753906 l 0.0312,3.29883 -15.1211,0.36328 c -8.316,0.19896 -15.21822,0.46041 -15.33984,0.58203 -0.24523,0.24523 1.34702,42.75913 1.61133,43.02344 0.0913,0.0913 6.56358,-0.14762 14.38281,-0.5293 7.81924,-0.38168 14.30999,-0.60278 14.42383,-0.49219 0.22389,0.2175 2.49323,29.74109 2.52343,32.82813 0.0101,1.03125 0.24454,1.875 0.51954,1.875 0.275,0 0.49332,-0.39375 0.48632,-0.875 -0.11996,-8.1305 -4.4612,-124.265901 -4.65234,-124.457032 -0.0331,-0.03309 -0.36851,-0.04885 -0.94531,-0.05078 z m 3.21289,5.449219 0.0254,0.927734 c 0.0143,0.510443 0.24261,7.160655 0.50781,14.77734 0.2652,7.61668 0.48242,14.0297 0.48242,14.25196 v 0.40429 h 0.66407 0.66211 v -0.33203 c 1e-5,-0.3013 -0.70863,-23.317451 -0.86329,-28.041013 l -0.0645,-1.988281 h -0.70703 z m -4.78906,6.080078 c -0.18641,-0.186408 -32.22729,1.400292 -71.20118,3.527344 -38.973887,2.127052 -71.367574,3.859052 -71.986324,3.847652 -1.285161,-0.0236 -1.375745,0.92519 -0.798828,8.33594 l 0.318359,4.10742 4.552734,0.14258 4.552735,0.14258 3.649044,8.41406 3.649115,8.41211 12.311972,-0.30273 c 11.930107,-0.29442 51.767573,-0.89217 95.764873,-1.58594 l 21.375,-0.33789 -0.0234,-1.29883 c -0.0937,-5.33129 -1.89481,-33.135049 -2.16406,-33.404296 z M 15.916016,104.54102 9.8535156,104.8457 c -3.3339814,0.16763 -6.149236,0.39142 -6.2558594,0.49805 -0.1066234,0.10662 -0.021855,2.085 0.1875,4.39648 l 0.3808594,4.20313 5,0.2793 c 2.7499994,0.15299 5.5387534,0.3217 6.1972654,0.375 1.182703,0.0956 1.193768,0.0545 0.878907,-3.2793 -0.175313,-1.85625 -0.320266,-4.14043 -0.322266,-5.07617 z m 91.904294,28.17773 c -6.89438,-0.0139 -12.470134,0.17595 -12.626951,0.42969 -0.154443,0.24989 9.788731,10.15952 22.095701,22.02148 l 22.37696,21.56641 5.25,-0.26367 c 2.8875,-0.1454 8.9625,-0.41305 13.5,-0.59375 4.5375,-0.1807 8.64467,-0.46913 9.12695,-0.64258 0.66909,-0.24063 -4.84001,-5.31288 -23.25,-21.4043 l -24.12695,-21.08789 z m -34.587413,0.47461 0.152652,3.125 c 0.08347,1.71875 0.36327,11.225 0.621823,21.125 0.258553,9.9 0.540234,18.93017 0.627013,20.06641 l 0.157846,2.0664 5.809585,-0.25195 c 3.195103,-0.13777 5.927232,-0.39098 6.071225,-0.56445 0.143994,-0.17347 -0.03647,-9.99141 -0.401556,-21.81641 -0.365085,-11.825 -0.657833,-22.00625 -0.650625,-22.625 0.01295,-1.1121 -0.05878,-1.125 -6.187626,-1.125 z m 132.638193,38.60742 0.0527,0.77344 c 0.0292,0.42537 0.29594,7.87326 0.59179,16.55078 0.29586,8.67753 0.55337,15.82592 0.57227,15.88672 0.0219,0.0706 0.20643,0.11133 0.51367,0.11133 h 0.48047 l -0.0391,-0.86133 c -0.022,-0.47399 -0.23633,-7.24635 -0.47656,-15.04883 -0.24022,-7.80248 -0.464,-14.91163 -0.4961,-15.79883 l -0.0586,-1.61328 h -0.57031 z m -6.47851,4.03906 c -3.81181,0.0251 -19.76054,0.65739 -38.59375,1.54102 -21.52368,1.00985 -49.37032,2.31592 -61.882814,2.90234 -12.512501,0.58641 -26.698192,1.11302 -26.767685,1.16992 -0.18806,0.15386 0.25872,24.29963 0.453901,24.53126 0.141831,0.1683 21.337316,0.42909 89.813788,1.36523 4.8125,0.0658 15.90182,0.17062 24.64453,0.23242 l 15.89648,0.11133 -0.30469,-3.625 c -0.16807,-1.99375 -0.70362,-9.08243 -1.18945,-15.75195 -0.48583,-6.66951 -1.02939,-12.27158 -1.20703,-12.44922 -0.0222,-0.0222 -0.31874,-0.0309 -0.86328,-0.0273 z"
       id="path1860"
       transform="matrix(0.26458334,0,0,0.26458334,-54.12619,-29.571422)"
       inkscape:connector-curvature="0"
       sodipodi:nodetypes="cccccccccccccccccccccccsccccsscscccssccccsssccsccsccssccccccccsscccccccccccscccccccccccccccsccccccscccsscscccccscccccccsssccccccsss" />
  </g>
</svg>
