<?xml version="1.0" encoding="UTF-8" standalone="no"?>
<!-- Created with Inkscape (http://www.inkscape.org/) -->

<svg
   width="31.999998"
   height="31.999998"
   viewBox="0 0 8.4666662 8.4666662"
   version="1.1"
   id="svg1609"
   inkscape:version="1.1.2 (0a00cf5339, 2022-02-04)"
   sodipodi:docname="testin.svg"
   xmlns:inkscape="http://www.inkscape.org/namespaces/inkscape"
   xmlns:sodipodi="http://sodipodi.sourceforge.net/DTD/sodipodi-0.dtd"
   xmlns:xlink="http://www.w3.org/1999/xlink"
   xmlns="http://www.w3.org/2000/svg"
   xmlns:svg="http://www.w3.org/2000/svg"
   xmlns:rdf="http://www.w3.org/1999/02/22-rdf-syntax-ns#"
   xmlns:cc="http://creativecommons.org/ns#"
   xmlns:dc="http://purl.org/dc/elements/1.1/">
  <defs
     id="defs1603">
    <linearGradient
       inkscape:collect="always"
       id="linearGradient1079">
      <stop
         style="stop-color:#595959;stop-opacity:1;"
         offset="0"
         id="stop1075" />
      <stop
         id="stop1083"
         offset="0.7073409"
         style="stop-color:#dcdcdc;stop-opacity:0.71372549;" />
      <stop
         style="stop-color:#e7e7e7;stop-opacity:0.76862746"
         offset="1"
         id="stop1077" />
    </linearGradient>
    <linearGradient
       inkscape:collect="always"
       xlink:href="#linearGradient1079"
       id="linearGradient1081-5"
       x1="112.99744"
       y1="255.64078"
       x2="116.01745"
       y2="253.32556"
       gradientUnits="userSpaceOnUse"
       spreadMethod="reflect"
       gradientTransform="matrix(0,0.46342756,-0.98682096,0,379.44302,203.89336)" />
  </defs>
  <sodipodi:namedview
     id="base"
     pagecolor="#808080"
     bordercolor="#666666"
     borderopacity="1.0"
     inkscape:pageopacity="0"
     inkscape:pageshadow="2"
     inkscape:zoom="1"
     inkscape:cx="22.5"
     inkscape:cy="30"
     inkscape:document-units="px"
     inkscape:current-layer="layer1"
     showgrid="false"
     fit-margin-top="0"
     fit-margin-left="0"
     fit-margin-right="0"
     fit-margin-bottom="0"
     inkscape:window-width="1920"
     inkscape:window-height="1056"
     inkscape:window-x="0"
     inkscape:window-y="0"
     inkscape:window-maximized="1"
     units="px"
     inkscape:snap-global="false"
     inkscape:pagecheckerboard="0">
    <inkscape:grid
       type="xygrid"
       id="grid1059"
       empspacing="4" />
  </sodipodi:namedview>
  <metadata
     id="metadata1606">
    <rdf:RDF>
      <cc:Work
         rdf:about="">
        <dc:format>image/svg+xml</dc:format>
        <dc:type
           rdf:resource="http://purl.org/dc/dcmitype/StillImage" />
      </cc:Work>
    </rdf:RDF>
  </metadata>
  <g
     inkscape:label="Layer 1"
     inkscape:groupmode="layer"
     id="layer1"
     transform="translate(-111.67452,-251.01056)">
    <g
       id="g9287"
       transform="translate(-11.903065,-2.5486301)">
      <path
         style="fill:#000000;fill-opacity:1;stroke:none;stroke-width:0.194344px;stroke-linecap:butt;stroke-linejoin:miter;stroke-opacity:1"
         d="m 124.12265,256.94978 -0.51732,0.51933 -0.0277,0.51201 0.60681,0.51993 h 0.35339 l 0.36336,0.31363 0.35578,-0.31363 h 2.28945 l 1.05649,1.01791 c 0,0.14083 0.36335,0.14083 0.36335,0.14083 h 1.49502 c 1.86371,0 1.75322,-3.68633 0,-3.69597 h -1.49502 c 0,0 -0.36335,0 -0.36335,0.14085 l -1.05649,0.84511 z"
         id="path1061-2"
         inkscape:connector-curvature="0"
         sodipodi:nodetypes="cccccccccccccccc" />
      <path
         id="path901-6"
         style="fill:#797979;stroke-width:0.190013px;stroke-opacity:0.590725;fill-opacity:1"
         transform="translate(0,0.06723407)"
         d="m 123.84766,257.76758 0.004,0.15625 0.4668,0.375 h 0.23828 c 0.0133,-1.3e-4 0.0263,0.004 0.0371,0.0117 l 0.30859,0.21875 0.28125,-0.2168 c 0.0111,-0.009 0.0249,-0.0137 0.0391,-0.0137 h 0.52539 l 0.21289,-0.12891 c 0.0208,-0.0135 0.0476,-0.0135 0.0684,0 l 0.17382,0.11524 0.17579,-0.12696 c 0.0212,-0.0159 0.0502,-0.0167 0.0723,-0.002 l 0.21875,0.14258 h 0.95054 c 0.016,1.5e-4 0.0314,0.006 0.043,0.0176 l 1.16015,1.08007 h 1.51431 c 0.34526,0 0.60509,-0.1647 0.78711,-0.41992 0.0956,-0.13404 0.16647,-0.2946 0.21484,-0.46679 -0.0439,0.0888 -0.0931,0.17416 -0.15234,0.25 -0.19819,0.25383 -0.48716,0.42187 -0.84961,0.42187 h -1.37305 c -0.0161,-1.5e-4 -0.0315,-0.006 -0.043,-0.0176 l -1.15821,-1.08008 h -1.11328 c -0.0118,-1.5e-4 -0.0233,-0.004 -0.0332,-0.01 l -0.19922,-0.12891 -0.17578,0.12696 c -0.0212,0.0159 -0.0502,0.0167 -0.0723,0.002 l -0.17773,-0.11914 -0.19336,0.11914 c -0.01,0.006 -0.0214,0.01 -0.0332,0.01 h -0.52148 l -0.30078,0.23047 c -0.0216,0.0168 -0.0517,0.0176 -0.0742,0.002 l -0.33203,-0.23243 h -0.24023 c -0.0133,1.3e-4 -0.0263,-0.004 -0.0371,-0.0117 z"
         sodipodi:nodetypes="ccccccccccccccccccscccscccccccccccccccccc" />
      <path
         style="fill:url(#linearGradient1081-5);fill-opacity:1;stroke:none;stroke-width:0.181325px;stroke-linecap:butt;stroke-linejoin:miter;stroke-opacity:1"
         d="m 124.22173,257.18786 -0.43772,0.40165 0.50741,0.36908 h 0.26147 l 0.34822,0.22279 0.31793,-0.22279 h 0.54505 l 0.2271,-0.12645 0.21196,0.12645 0.21196,-0.13849 0.23467,0.13849 h 1.1388 l 1.17761,0.99844 h 1.37578 c 0.73212,0 1.12542,-0.64581 1.13738,-1.30546 0.0124,-0.6885 -0.39013,-1.39207 -1.13738,-1.39207 h -1.37578 l -1.17761,0.92836 z"
         id="path1063-7"
         inkscape:connector-curvature="0"
         sodipodi:nodetypes="ccccccccccccccscccc" />
      <path
         style="fill:none;stroke:#000000;stroke-width:0.181611;stroke-linecap:round;stroke-linejoin:round;stroke-miterlimit:4;stroke-dasharray:none;stroke-opacity:0.246231"
         d="m 124.26667,257.39368 h 3.52479"
         id="path893-9"
         inkscape:connector-curvature="0" />
      <path
         id="path6215"
         style="fill:#3eab16;fill-opacity:1;stroke:#020202;stroke-width:0.264583;stroke-linecap:butt;stroke-linejoin:round;stroke-miterlimit:4;stroke-dasharray:none;stroke-opacity:1"
         d="m 129.06061,255.90892 c 0,0 -0.36359,0 -0.36359,0.15015 l -0.2815,0.23988 c 0.62621,0.36808 0.98064,0.62326 0.98064,1.26884 0,0.64558 -0.43221,0.92813 -0.84152,1.15667 -0.0635,0.29554 -0.049,0.46683 -0.0636,0.64406 0,0.13167 0.33617,0.30761 0.56951,0.30761 h 1.49468 c 0.88921,0 1.329,-0.98156 1.3554,-1.8381 0.0289,-0.93871 -0.43866,-1.92374 -1.3554,-1.92911 z"
         sodipodi:nodetypes="ccczcccsscc" />
      <path
         id="path8190"
         style="fill:#79e61f;fill-opacity:0.465316;stroke-width:0.264583;stroke-linejoin:round"
         d="m 130.31453,255.97018 c -0.38651,-0.006 -0.82449,0.0361 -1.21426,0.0103 -0.11681,0.003 -0.28877,0.0719 -0.38162,0.15707 -0.0464,0.0425 -0.0717,0.0871 -0.0732,0.12398 -0.002,0.0369 0.0159,0.0636 0.0655,0.0868 0.004,0.002 0.007,0.004 0.01,0.006 0.0567,0.0362 0.0978,0.0775 0.14842,0.11573 0.006,-0.094 0.0676,-0.18247 0.17924,-0.24902 0.18027,-0.10747 0.46842,-0.16412 0.76903,-0.13122 0.39229,0.004 0.85223,-0.0159 1.2605,0.0259 -0.19814,-0.10917 -0.45703,-0.14101 -0.76325,-0.14568 z m -0.91936,1.01382 c 0.27351,0.59912 0.0156,1.36971 -0.74783,1.84316 0.0146,0.0894 0.15008,0.10765 0.23708,0.13305 0.7616,-0.52309 0.96689,-1.36681 0.51076,-1.97645 z"
         sodipodi:nodetypes="ccscccccccccccccc" />
      <path
         id="path8192"
         style="fill:#276a0e;fill-opacity:1;stroke:none;stroke-width:0.268132;stroke-linecap:butt;stroke-linejoin:round;stroke-miterlimit:4;stroke-dasharray:none;stroke-opacity:1"
         sodipodi:type="inkscape:offset"
         inkscape:radius="-0.59866536"
         inkscape:original="M 31.830078 36.494141 C 31.44092 39.479123 29.773057 42.492188 26.724609 42.492188 L 21 42.492188 C 20.32858 42.492188 19.434285 42.11012 19.03125 41.707031 C 18.824647 42.746594 18.871733 43.375698 18.818359 44.023438 C 18.818359 44.527814 20.106293 45.201172 21 45.201172 L 26.724609 45.201172 C 30.130266 45.201172 31.814913 41.441089 31.916016 38.160156 C 31.933136 37.604197 31.903208 37.044056 31.830078 36.494141 z "
         transform="matrix(0.26109638,0,0,0.26106677,123.5776,247.87563)"
         d="m 30.751953,40.974609 c -0.930018,1.236138 -2.306914,2.117188 -4.027344,2.117188 H 21 c -0.511065,0 -1.006468,-0.146715 -1.462891,-0.359375 -0.03151,0.421627 -0.08821,0.88779 -0.11914,1.291016 0,-0.12869 -0.03793,-0.102021 0.03711,-0.02734 0.07504,0.07468 0.222301,0.182329 0.400391,0.277344 0.35618,0.190029 0.848031,0.328124 1.144531,0.328124 h 5.724609 c 1.482506,0 2.546728,-0.781209 3.330079,-2.011718 0.300513,-0.472056 0.502003,-1.045297 0.697265,-1.615235 z" />
      <ellipse
         style="vector-effect:none;fill:#000000;fill-opacity:1;fill-rule:evenodd;stroke:none;stroke-width:0.181611;stroke-linecap:butt;stroke-linejoin:miter;stroke-miterlimit:10;stroke-dasharray:none;stroke-dashoffset:0;stroke-opacity:0.643216"
         id="path891-0"
         cx="130.79855"
         cy="257.43167"
         rx="0.45691866"
         ry="0.27772444" />
    </g>
  </g>
</svg>
