<?xml version="1.0" encoding="UTF-8" standalone="no"?>
<!-- Created with Inkscape (http://www.inkscape.org/) -->

<svg
   xmlns:dc="http://purl.org/dc/elements/1.1/"
   xmlns:cc="http://creativecommons.org/ns#"
   xmlns:rdf="http://www.w3.org/1999/02/22-rdf-syntax-ns#"
   xmlns:svg="http://www.w3.org/2000/svg"
   xmlns="http://www.w3.org/2000/svg"
   xmlns:xlink="http://www.w3.org/1999/xlink"
   xmlns:sodipodi="http://sodipodi.sourceforge.net/DTD/sodipodi-0.dtd"
   xmlns:inkscape="http://www.inkscape.org/namespaces/inkscape"
   width="1536"
   height="512"
   viewBox="0 0 1536 511.99999"
   id="svg2"
   version="1.1"
   inkscape:version="0.92.3 (2405546, 2018-03-11)"
   sodipodi:docname="banner.svg"
   inkscape:export-filename="/home/frode/Creations/Websites/itch.io/edddybanner.png"
   inkscape:export-xdpi="96.000008"
   inkscape:export-ydpi="96.000008">
  <defs
     id="defs4">
    <linearGradient
       inkscape:collect="always"
       id="linearGradient984">
      <stop
         style="stop-color:#0829fc;stop-opacity:1;"
         offset="0"
         id="stop980" />
      <stop
         style="stop-color:#0829fc;stop-opacity:0"
         offset="1"
         id="stop982" />
    </linearGradient>
    <linearGradient
       inkscape:collect="always"
       id="linearGradient964">
      <stop
         style="stop-color:#130036;stop-opacity:1"
         offset="0"
         id="stop960" />
      <stop
         id="stop1036"
         offset="0.39297068"
         style="stop-color:#130034;stop-opacity:0.38461539" />
      <stop
         style="stop-color:#140033;stop-opacity:0"
         offset="1"
         id="stop962" />
    </linearGradient>
    <linearGradient
       inkscape:collect="always"
       id="linearGradient5878">
      <stop
         style="stop-color:#04ff3c;stop-opacity:0.03846154"
         offset="0"
         id="stop5874" />
      <stop
         id="stop5882"
         offset="0.25641021"
         style="stop-color:#bb04ff;stop-opacity:0.46153846" />
      <stop
         style="stop-color:#ffba67;stop-opacity:0.56862748"
         offset="0.44102558"
         id="stop5884" />
      <stop
         id="stop5886"
         offset="0.68717939"
         style="stop-color:#43b9e9;stop-opacity:0.31764707" />
      <stop
         style="stop-color:#04ff3c;stop-opacity:0.01960784"
         offset="1"
         id="stop5876" />
    </linearGradient>
    <linearGradient
       inkscape:collect="always"
       id="linearGradient5846">
      <stop
         style="stop-color:#ff7bac;stop-opacity:0"
         offset="0"
         id="stop5842" />
      <stop
         id="stop963"
         offset="0.20893909"
         style="stop-color:#fa5a5a;stop-opacity:0.37980768" />
      <stop
         id="stop5850"
         offset="0.58349502"
         style="stop-color:#7020ff;stop-opacity:0.09615385" />
      <stop
         style="stop-color:#f8fd5d;stop-opacity:0.24038461"
         offset="0.74027824"
         id="stop5854" />
      <stop
         style="stop-color:#04ff3c;stop-opacity:0.21634616"
         offset="0.81154341"
         id="stop5852" />
      <stop
         id="stop961"
         offset="0.95755398"
         style="stop-color:#0829fc;stop-opacity:0.17307693" />
      <stop
         style="stop-color:#0207ff;stop-opacity:0"
         offset="1"
         id="stop5844" />
    </linearGradient>
    <linearGradient
       inkscape:collect="always"
       id="linearGradient5711">
      <stop
         style="stop-color:#000000;stop-opacity:1;"
         offset="0"
         id="stop5707" />
      <stop
         style="stop-color:#000000;stop-opacity:0;"
         offset="1"
         id="stop5709" />
    </linearGradient>
    <linearGradient
       inkscape:collect="always"
       id="linearGradient938">
      <stop
         style="stop-color:#ffffff;stop-opacity:0.70383275"
         offset="0"
         id="stop934" />
      <stop
         id="stop5746"
         offset="0.44527671"
         style="stop-color:#893af9;stop-opacity:0.21254355" />
      <stop
         style="stop-color:#0900f8;stop-opacity:0"
         offset="1"
         id="stop936" />
    </linearGradient>
    <inkscape:path-effect
       is_visible="true"
       id="path-effect4327"
       effect="spiro" />
    <inkscape:path-effect
       effect="spiro"
       id="path-effect4323"
       is_visible="true" />
    <inkscape:path-effect
       is_visible="true"
       id="path-effect4319"
       effect="spiro" />
    <inkscape:path-effect
       effect="spiro"
       id="path-effect4291"
       is_visible="true" />
    <linearGradient
       inkscape:collect="always"
       id="linearGradient4269">
      <stop
         style="stop-color:#9c04ff;stop-opacity:1"
         offset="0"
         id="stop4271" />
      <stop
         id="stop4277"
         offset="0.42245531"
         style="stop-color:#9b02ff;stop-opacity:1" />
      <stop
         style="stop-color:#ffffff;stop-opacity:1"
         offset="1"
         id="stop4273" />
    </linearGradient>
    <linearGradient
       inkscape:collect="always"
       id="linearGradient4358-9">
      <stop
         style="stop-color:#2a6254;stop-opacity:1"
         offset="0"
         id="stop4582" />
      <stop
         style="stop-color:#248a78;stop-opacity:1"
         offset="1"
         id="stop4584" />
    </linearGradient>
    <linearGradient
       id="linearGradient4917-0"
       inkscape:collect="always">
      <stop
         id="stop4570"
         offset="0"
         style="stop-color:#4c9e64;stop-opacity:1" />
      <stop
         id="stop4572"
         offset="1"
         style="stop-color:#69d895;stop-opacity:1" />
    </linearGradient>
    <inkscape:path-effect
       effect="spiro"
       id="path-effect4565"
       is_visible="true" />
    <inkscape:path-effect
       is_visible="true"
       id="path-effect4561"
       effect="spiro" />
    <inkscape:path-effect
       effect="spiro"
       id="path-effect4557"
       is_visible="true" />
    <inkscape:path-effect
       is_visible="true"
       id="path-effect4553"
       effect="spiro" />
    <inkscape:path-effect
       effect="spiro"
       id="path-effect4549"
       is_visible="true" />
    <inkscape:path-effect
       effect="spiro"
       id="path-effect4545"
       is_visible="true" />
    <linearGradient
       id="linearGradient4358"
       inkscape:collect="always">
      <stop
         id="stop4537"
         offset="0"
         style="stop-color:#327565;stop-opacity:1" />
      <stop
         id="stop4539"
         offset="1"
         style="stop-color:#4c9e64;stop-opacity:1" />
    </linearGradient>
    <inkscape:path-effect
       effect="spiro"
       id="path-effect5740"
       is_visible="true" />
    <inkscape:path-effect
       is_visible="true"
       id="path-effect5736"
       effect="spiro" />
    <inkscape:path-effect
       effect="spiro"
       id="path-effect5732"
       is_visible="true" />
    <inkscape:path-effect
       is_visible="true"
       id="path-effect5728"
       effect="spiro" />
    <inkscape:path-effect
       effect="spiro"
       id="path-effect5720"
       is_visible="true" />
    <inkscape:path-effect
       is_visible="true"
       id="path-effect5574"
       effect="spiro" />
    <linearGradient
       inkscape:collect="always"
       id="linearGradient5368">
      <stop
         id="stop5372"
         offset="0"
         style="stop-color:#ffffff;stop-opacity:0.53380781" />
      <stop
         style="stop-color:#a8fffe;stop-opacity:0.32941177"
         offset="0.5"
         id="stop5378" />
      <stop
         id="stop5370"
         offset="1"
         style="stop-color:#00bafe;stop-opacity:1" />
    </linearGradient>
    <linearGradient
       inkscape:collect="always"
       id="linearGradient4917">
      <stop
         style="stop-color:#248a78;stop-opacity:1"
         offset="0"
         id="stop4919" />
      <stop
         style="stop-color:#69d895;stop-opacity:1"
         offset="1"
         id="stop4921" />
    </linearGradient>
    <inkscape:path-effect
       effect="spiro"
       id="path-effect4328"
       is_visible="true" />
    <inkscape:path-effect
       effect="spiro"
       id="path-effect4322"
       is_visible="true" />
    <linearGradient
       inkscape:collect="always"
       id="linearGradient4312">
      <stop
         style="stop-color:#000000;stop-opacity:1;"
         offset="0"
         id="stop4314" />
      <stop
         style="stop-color:#000000;stop-opacity:0;"
         offset="1"
         id="stop4316" />
    </linearGradient>
    <inkscape:path-effect
       is_visible="true"
       id="path-effect4271"
       effect="spiro" />
    <inkscape:path-effect
       effect="spiro"
       id="path-effect4218"
       is_visible="true" />
    <inkscape:perspective
       sodipodi:type="inkscape:persp3d"
       inkscape:vp_x="32.348111 : 521.57706 : 1"
       inkscape:vp_y="0 : 999.99996 : 0"
       inkscape:vp_z="1058.8728 : 820.96603 : 1"
       inkscape:persp3d-origin="372.04723 : 350.78739 : 1"
       id="perspective4136" />
    <linearGradient
       inkscape:collect="always"
       xlink:href="#linearGradient4312"
       id="linearGradient4318"
       x1="-282.66406"
       y1="79.62207"
       x2="280.96274"
       y2="79.62207"
       gradientUnits="userSpaceOnUse" />
    <linearGradient
       gradientTransform="translate(279.31678,264.77029)"
       inkscape:collect="always"
       xlink:href="#linearGradient4358"
       id="linearGradient4860-3"
       gradientUnits="userSpaceOnUse"
       x1="-219.93828"
       y1="2.9612882"
       x2="-5.7511587"
       y2="80.973793" />
    <linearGradient
       gradientTransform="translate(509.07506,282.70912)"
       inkscape:collect="always"
       xlink:href="#linearGradient4917"
       id="linearGradient4923-4"
       x1="-201.54285"
       y1="83.67498"
       x2="-201.54285"
       y2="75.700142"
       gradientUnits="userSpaceOnUse" />
    <filter
       inkscape:collect="always"
       style="color-interpolation-filters:sRGB"
       id="filter5364"
       x="-0.17215797"
       width="1.3443159"
       y="-0.10684719"
       height="1.2136945">
      <feGaussianBlur
         inkscape:collect="always"
         stdDeviation="13.582882"
         id="feGaussianBlur5366" />
    </filter>
    <filter
       inkscape:collect="always"
       style="color-interpolation-filters:sRGB"
       id="filter5380"
       x="-0.037802037"
       width="1.0756041"
       y="-0.017580954"
       height="1.0351619">
      <feGaussianBlur
         inkscape:collect="always"
         stdDeviation="4.22375"
         id="feGaussianBlur5382" />
    </filter>
    <radialGradient
       inkscape:collect="always"
       xlink:href="#linearGradient5368"
       id="radialGradient5374-0"
       cx="72.105469"
       cy="81.382812"
       fx="72.105469"
       fy="81.382812"
       r="166.679"
       gradientTransform="matrix(1,0,0,1.9252206,72.111609,141.75206)"
       gradientUnits="userSpaceOnUse" />
    <linearGradient
       inkscape:collect="always"
       xlink:href="#linearGradient4917"
       id="linearGradient3445"
       gradientUnits="userSpaceOnUse"
       gradientTransform="matrix(0.30376845,-0.17475795,0.17288941,0.30268965,-531.2761,897.69601)"
       x1="-201.54285"
       y1="83.67498"
       x2="-201.54285"
       y2="75.700142" />
    <linearGradient
       inkscape:collect="always"
       xlink:href="#linearGradient4358"
       id="linearGradient3447"
       gradientUnits="userSpaceOnUse"
       gradientTransform="matrix(0.29510654,-0.16977476,0.1679595,0.2940585,-534.43242,900.44202)"
       x1="-517.80365"
       y1="12.381151"
       x2="-326.60501"
       y2="23.935141" />
    <radialGradient
       inkscape:collect="always"
       xlink:href="#linearGradient5368"
       id="radialGradient3449"
       gradientUnits="userSpaceOnUse"
       gradientTransform="matrix(1,0,0,0.98118635,-25.944171,0.46687276)"
       cx="-198.66185"
       cy="80.255486"
       fx="-198.66185"
       fy="80.255486"
       r="166.679" />
    <linearGradient
       inkscape:collect="always"
       xlink:href="#linearGradient4917"
       id="linearGradient3605"
       gradientUnits="userSpaceOnUse"
       x1="58.884083"
       y1="83.511658"
       x2="58.884083"
       y2="74.840347"
       gradientTransform="matrix(0.30268965,-0.17475795,0.17475795,0.30268965,-524.69255,893.16206)" />
    <linearGradient
       inkscape:collect="always"
       xlink:href="#linearGradient4358"
       id="linearGradient3607"
       gradientUnits="userSpaceOnUse"
       x1="-219.93828"
       y1="2.9612882"
       x2="-5.7511587"
       y2="80.973793"
       gradientTransform="matrix(0.29722241,-0.17160142,0.17160142,0.29722241,-525.33393,894.12348)" />
    <radialGradient
       inkscape:collect="always"
       xlink:href="#linearGradient5368"
       id="radialGradient3609"
       gradientUnits="userSpaceOnUse"
       gradientTransform="matrix(1,0,0,1.9252206,-2.3221926,-74.573598)"
       cx="72.105469"
       cy="81.382812"
       fx="72.105469"
       fy="81.382812"
       r="166.679" />
    <linearGradient
       inkscape:collect="always"
       xlink:href="#linearGradient4358"
       id="linearGradient3665"
       gradientUnits="userSpaceOnUse"
       x1="37.850914"
       y1="75.490204"
       x2="37.850914"
       y2="83.262871"
       gradientTransform="matrix(0,0.3495159,-0.3495159,0,-391.19629,758.34291)" />
    <linearGradient
       inkscape:collect="always"
       xlink:href="#linearGradient4917"
       id="linearGradient3667"
       gradientUnits="userSpaceOnUse"
       x1="-376.8027"
       y1="18.998316"
       x2="-5.7511587"
       y2="80.973793"
       gradientTransform="matrix(0,0.34568102,-0.34568102,0,-391.50678,757.78988)" />
    <radialGradient
       inkscape:collect="always"
       xlink:href="#linearGradient5368"
       id="radialGradient3669"
       gradientUnits="userSpaceOnUse"
       gradientTransform="matrix(1,0,0,1.9252206,-2.3221926,-74.573598)"
       cx="72.105469"
       cy="81.382812"
       fx="72.105469"
       fy="81.382812"
       r="166.679" />
    <linearGradient
       inkscape:collect="always"
       xlink:href="#linearGradient4917-0"
       id="linearGradient3685"
       gradientUnits="userSpaceOnUse"
       x1="50.727398"
       y1="75.215141"
       x2="50.696262"
       y2="84.91674"
       gradientTransform="matrix(-0.30268962,-0.17475794,0.17475794,-0.30268962,-341.18759,941.36362)" />
    <linearGradient
       inkscape:collect="always"
       xlink:href="#linearGradient4358-9"
       id="linearGradient3687"
       gradientUnits="userSpaceOnUse"
       x1="-267.7475"
       y1="47.974899"
       x2="-6.0086017"
       y2="91.911194"
       gradientTransform="matrix(-0.30268962,-0.17475794,0.17475794,-0.30268962,-341.18759,941.36362)" />
    <radialGradient
       inkscape:collect="always"
       xlink:href="#linearGradient5368"
       id="radialGradient3689"
       gradientUnits="userSpaceOnUse"
       gradientTransform="matrix(1,0,0,1.9252206,-2.3221926,-74.573598)"
       cx="72.105469"
       cy="81.382812"
       fx="72.105469"
       fy="81.382812"
       r="166.679" />
    <filter
       inkscape:collect="always"
       style="color-interpolation-filters:sRGB"
       id="filter4251"
       x="-0.026948983"
       width="1.053898"
       y="-0.02828325"
       height="1.0565665">
      <feGaussianBlur
         inkscape:collect="always"
         stdDeviation="1.6116443"
         id="feGaussianBlur4253" />
    </filter>
    <filter
       inkscape:collect="always"
       style="color-interpolation-filters:sRGB"
       id="filter4265"
       x="-0.15232034"
       width="1.3046407"
       y="-0.15986185"
       height="1.3197237">
      <feGaussianBlur
         inkscape:collect="always"
         stdDeviation="9.1092937"
         id="feGaussianBlur4267" />
    </filter>
    <radialGradient
       inkscape:collect="always"
       xlink:href="#linearGradient4269"
       id="radialGradient4275"
       cx="296.42874"
       cy="239.91524"
       fx="296.42874"
       fy="239.91524"
       r="75.632179"
       gradientTransform="matrix(0.83295542,0,0,0.79567019,49.516811,49.02184)"
       gradientUnits="userSpaceOnUse" />
    <filter
       inkscape:collect="always"
       style="color-interpolation-filters:sRGB"
       id="filter4313"
       x="-0.074133717"
       width="1.1482674"
       y="-0.050392572"
       height="1.1007851">
      <feGaussianBlur
         inkscape:collect="always"
         stdDeviation="0.23165239"
         id="feGaussianBlur4315" />
    </filter>
    <radialGradient
       inkscape:collect="always"
       xlink:href="#linearGradient938"
       id="radialGradient940"
       cx="79.524307"
       cy="858.66791"
       fx="79.524307"
       fy="858.66791"
       r="742.46216"
       gradientTransform="matrix(0.99999998,0,0,0.02938723,688.4757,184.04561)"
       gradientUnits="userSpaceOnUse" />
    <linearGradient
       inkscape:collect="always"
       xlink:href="#linearGradient5711"
       id="linearGradient5713"
       x1="101.83494"
       y1="1110.5975"
       x2="97.140732"
       y2="951.48755"
       gradientUnits="userSpaceOnUse"
       gradientTransform="translate(-6,-14)" />
    <linearGradient
       inkscape:collect="always"
       xlink:href="#linearGradient5878"
       id="linearGradient5880"
       x1="161.25291"
       y1="640.82648"
       x2="161.25291"
       y2="1113.6284"
       gradientUnits="userSpaceOnUse"
       gradientTransform="matrix(2.7749319,0,-0.03575956,1.0555394,-157.80677,-54.108431)" />
    <linearGradient
       inkscape:collect="always"
       xlink:href="#linearGradient5846"
       id="linearGradient973"
       gradientUnits="userSpaceOnUse"
       x1="61.427162"
       y1="1131.3645"
       x2="61.427162"
       y2="621.02539"
       spreadMethod="reflect" />
    <linearGradient
       inkscape:collect="always"
       xlink:href="#linearGradient964"
       id="linearGradient966"
       x1="59.287476"
       y1="879.00073"
       x2="59.287476"
       y2="1066.5299"
       gradientUnits="userSpaceOnUse"
       spreadMethod="reflect"
       gradientTransform="translate(2.0000129,-46.720745)" />
    <linearGradient
       inkscape:collect="always"
       xlink:href="#linearGradient984"
       id="linearGradient986"
       x1="-425.8717"
       y1="897.02539"
       x2="-425.8717"
       y2="689.02539"
       gradientUnits="userSpaceOnUse"
       spreadMethod="reflect"
       gradientTransform="translate(0,-46.720724)" />
    <filter
       inkscape:collect="always"
       style="color-interpolation-filters:sRGB"
       id="filter992"
       x="-0.0037562039"
       width="1.0075124"
       y="-0.013905946"
       height="1.0278119">
      <feGaussianBlur
         inkscape:collect="always"
         stdDeviation="2.1785982"
         id="feGaussianBlur994" />
    </filter>
    <filter
       inkscape:collect="always"
       style="color-interpolation-filters:sRGB"
       id="filter1024"
       x="-0.05957057"
       width="1.1191411"
       y="-0.22931754"
       height="1.4586351">
      <feGaussianBlur
         inkscape:collect="always"
         stdDeviation="10.501723"
         id="feGaussianBlur1026" />
    </filter>
  </defs>
  <sodipodi:namedview
     id="base"
     pagecolor="#414141"
     bordercolor="#666666"
     borderopacity="1.0"
     inkscape:pageopacity="0"
     inkscape:pageshadow="2"
     inkscape:zoom="0.70710678"
     inkscape:cx="692.44891"
     inkscape:cy="159.583"
     inkscape:document-units="px"
     inkscape:current-layer="layer1"
     showgrid="false"
     showborder="true"
     showguides="true"
     inkscape:guide-bbox="true"
     inkscape:snap-global="false"
     inkscape:window-width="1920"
     inkscape:window-height="1061"
     inkscape:window-x="0"
     inkscape:window-y="0"
     inkscape:window-maximized="1"
     fit-margin-top="0"
     fit-margin-left="0"
     fit-margin-right="0"
     fit-margin-bottom="0"
     units="px"
     inkscape:snap-page="true"
     borderlayer="true"
     inkscape:snap-center="true"
     inkscape:snap-object-midpoints="true"
     inkscape:snap-nodes="false" />
  <metadata
     id="metadata7">
    <rdf:RDF>
      <cc:Work
         rdf:about="">
        <dc:format>image/svg+xml</dc:format>
        <dc:type
           rdf:resource="http://purl.org/dc/dcmitype/StillImage" />
        <dc:title />
      </cc:Work>
    </rdf:RDF>
  </metadata>
  <g
     inkscape:label="Layer 1"
     inkscape:groupmode="layer"
     id="layer1"
     transform="translate(715.26372,-621.02537)">
    <rect
       style="color:#000000;clip-rule:nonzero;display:inline;overflow:visible;visibility:visible;opacity:0.42;isolation:auto;mix-blend-mode:normal;color-interpolation:sRGB;color-interpolation-filters:linearRGB;solid-color:#000000;solid-opacity:1;vector-effect:none;fill:url(#linearGradient966);fill-opacity:1;fill-rule:nonzero;stroke:url(#linearGradient986);stroke-width:18.89763832;stroke-linecap:round;stroke-linejoin:round;stroke-miterlimit:23;stroke-dasharray:none;stroke-dashoffset:0;stroke-opacity:0.09019608;marker:none;color-rendering:auto;image-rendering:auto;shape-rendering:auto;text-rendering:auto;enable-background:accumulate;filter:url(#filter992)"
       id="rect958"
       width="1392"
       height="376"
       x="-643.26373"
       y="642.30469"
       ry="188"
       rx="92"
       transform="matrix(0.95135089,0,0,1.0006862,2.5655727,-0.56976326)" />
    <path
       id="rect5788"
       style="color:#000000;clip-rule:nonzero;display:inline;overflow:visible;visibility:visible;opacity:0.3;isolation:auto;mix-blend-mode:normal;color-interpolation:sRGB;color-interpolation-filters:linearRGB;solid-color:#000000;solid-opacity:1;vector-effect:none;fill:none;fill-opacity:0.70383277;fill-rule:nonzero;stroke:url(#linearGradient973);stroke-width:2.29999995;stroke-linecap:round;stroke-linejoin:round;stroke-miterlimit:23;stroke-dasharray:none;stroke-dashoffset:0;stroke-opacity:0.70196078;marker:none;color-rendering:auto;image-rendering:auto;shape-rendering:auto;text-rendering:auto;enable-background:accumulate"
       d="m 127.89966,621.02539 -75.163375,207.99996 -75.16338,303.99995 m 150.326755,0 -75.163375,-303.99995 -75.16338,-207.99996 m 302.964735,0 L 52.736283,829.02535 -175.06508,1133.0253 m 455.60272,0 L 52.736283,829.02535 -175.06508,621.02539 m 913.51671,0 L 52.736309,829.02535 -632.97907,1133.0253 m 1371.4307,0 L 52.736309,829.02535 -632.97907,621.02539 m 1066.15471,0 L 52.736298,829.02535 -327.70308,1133.0253 m 760.87872,0 L 52.736298,829.02535 -327.70308,621.02539 m 913.51671,0 L 52.736307,829.02535 -480.34107,1133.0253 m 1066.1547,0 L 52.736307,829.02535 -480.34107,621.02539" />
    <path
       style="color:#000000;clip-rule:nonzero;display:inline;overflow:visible;visibility:visible;opacity:0.23000004;isolation:auto;mix-blend-mode:normal;color-interpolation:sRGB;color-interpolation-filters:linearRGB;solid-color:#000000;solid-opacity:1;vector-effect:none;fill:url(#linearGradient5713);fill-opacity:1;fill-rule:nonzero;stroke:none;stroke-width:18.89763832;stroke-linecap:round;stroke-linejoin:round;stroke-miterlimit:23;stroke-dasharray:none;stroke-dashoffset:0;stroke-opacity:0.79807691;marker:none;filter:url(#filter1024);color-rendering:auto;image-rendering:auto;shape-rendering:auto;text-rendering:auto;enable-background:accumulate"
       d="m -172.08614,1054.7728 83.64957,43.6433 160.02526,-38.794 80.01263,21.8216 99.40962,-32.7325 -106.6835,-33.9447 C 110.89519,974.28457 59.03217,987.08513 3.69918,1009.9172 Z"
       id="path5705"
       inkscape:connector-curvature="0"
       transform="matrix(1.0217836,0,0,0.70688368,-23.647662,338.57198)"
       sodipodi:nodetypes="cccccccc" />
    <path
       style="color:#000000;clip-rule:nonzero;display:inline;overflow:visible;visibility:visible;opacity:1;isolation:auto;mix-blend-mode:normal;color-interpolation:sRGB;color-interpolation-filters:linearRGB;solid-color:#000000;solid-opacity:1;vector-effect:none;fill:url(#radialGradient940);fill-opacity:1;fill-rule:nonzero;stroke:none;stroke-width:19.90932846;stroke-linecap:round;stroke-linejoin:round;stroke-miterlimit:23;stroke-dasharray:none;stroke-dashoffset:0;stroke-opacity:1;marker:none;color-rendering:auto;image-rendering:auto;shape-rendering:auto;text-rendering:auto;enable-background:accumulate"
       d="M 768 187.46094 A 742.46216 21.818907 0 0 0 265.44531 193.24609 L 282.3418 225.76562 A 742.46216 21.818907 0 0 0 768 231.09766 A 742.46216 21.818907 0 0 0 1510.4629 209.2793 A 742.46216 21.818907 0 0 0 768 187.46094 z M 243.89453 193.8418 A 742.46216 21.818907 0 0 0 222.81055 194.50781 L 238.42773 224.56445 A 742.46216 21.818907 0 0 0 260.16602 225.1582 L 243.89453 193.8418 z M 201.30273 195.18555 A 742.46216 21.818907 0 0 0 180.28906 195.99023 L 194.38086 223.10938 A 742.46216 21.818907 0 0 0 216.18945 223.83789 L 201.30273 195.18555 z M 158.86133 196.81836 A 742.46216 21.818907 0 0 0 25.537109 209.2793 A 742.46216 21.818907 0 0 0 172.07617 222.25391 L 158.86133 196.81836 z "
       transform="translate(-715.26372,621.02537)"
       id="path932" />
    <g
       id="g961"
       transform="translate(474.56783,-18.485281)">
      <path
         sodipodi:nodetypes="ccccccccccccc"
         inkscape:transform-center-y="17.452773"
         inkscape:transform-center-x="40.238105"
         inkscape:connector-curvature="0"
         id="path4543"
         d="m -700.23245,881.93094 163.94413,-84.97274 -2.72652,-95.8229 119.98389,-39.89994 121.32081,39.82446 -3.5539,96.164 84.25729,43.61844 -25.62887,125.93143 -94.94213,83.53171 -81.66753,-50.84977 -160.8545,102.71537 -87.89942,-94.57 z"
         style="color:#000000;clip-rule:nonzero;display:inline;overflow:visible;visibility:visible;opacity:1;isolation:auto;mix-blend-mode:normal;color-interpolation:sRGB;color-interpolation-filters:linearRGB;solid-color:#000000;solid-opacity:1;fill:#000000;fill-opacity:1;fill-rule:evenodd;stroke:#000000;stroke-width:18.32300568;stroke-linecap:butt;stroke-linejoin:round;stroke-miterlimit:23;stroke-dasharray:none;stroke-dashoffset:0;stroke-opacity:1;marker:none;color-rendering:auto;image-rendering:auto;shape-rendering:auto;text-rendering:auto;enable-background:accumulate" />
      <path
         inkscape:connector-curvature="0"
         id="path4243"
         d="m -545.51839,822.7069 6.30648,45.65084 51.80455,35.43848 4.78324,62.6359 37.11049,28.85461 0.16703,-0.10506 -2.98651,-114.00882 -97.18533,-58.46593 z"
         style="color:#000000;clip-rule:nonzero;display:inline;overflow:visible;visibility:visible;opacity:1;isolation:auto;mix-blend-mode:normal;color-interpolation:sRGB;color-interpolation-filters:linearRGB;solid-color:#000000;solid-opacity:1;fill:#a5a5a5;fill-opacity:1;fill-rule:evenodd;stroke:none;stroke-width:6.11046267;stroke-linecap:round;stroke-linejoin:round;stroke-miterlimit:23;stroke-dasharray:none;stroke-dashoffset:0;stroke-opacity:1;marker:none;color-rendering:auto;image-rendering:auto;shape-rendering:auto;text-rendering:auto;enable-background:accumulate" />
      <path
         sodipodi:nodetypes="ccccccc"
         inkscape:connector-curvature="0"
         style="color:#000000;clip-rule:nonzero;display:inline;overflow:visible;visibility:visible;opacity:1;isolation:auto;mix-blend-mode:normal;color-interpolation:sRGB;color-interpolation-filters:linearRGB;solid-color:#000000;solid-opacity:1;fill:url(#linearGradient3605);fill-opacity:1;fill-rule:evenodd;stroke:#000000;stroke-width:2.33987284;stroke-linecap:round;stroke-linejoin:round;stroke-miterlimit:23;stroke-dasharray:none;stroke-dashoffset:0;stroke-opacity:1;marker:none;color-rendering:auto;image-rendering:auto;shape-rendering:auto;text-rendering:auto;enable-background:accumulate"
         d="m -621.04417,840.84223 25.72013,125.2337 95.59517,84.89057 71.64865,-45.71 1.24466,-136.66327 -118.79782,-66.94492 z"
         id="path4227" />
      <path
         inkscape:connector-curvature="0"
         id="path4233"
         d="m -579.10269,841.06891 91.69533,62.72731 8.5599,112.09398 32.07343,-20.46144 -1.58223,-114.1787 -96.25667,-58.10663 z"
         style="color:#000000;clip-rule:nonzero;display:inline;overflow:visible;visibility:visible;opacity:1;isolation:auto;mix-blend-mode:normal;color-interpolation:sRGB;color-interpolation-filters:linearRGB;solid-color:#000000;solid-opacity:1;fill:#c5fffe;fill-opacity:1;fill-rule:evenodd;stroke:#000000;stroke-width:2.33987284;stroke-linecap:round;stroke-linejoin:round;stroke-miterlimit:23;stroke-dasharray:none;stroke-dashoffset:0;stroke-opacity:1;marker:none;color-rendering:auto;image-rendering:auto;shape-rendering:auto;text-rendering:auto;enable-background:accumulate" />
      <path
         sodipodi:nodetypes="cccccc"
         inkscape:connector-curvature="0"
         style="color:#000000;clip-rule:nonzero;display:inline;overflow:visible;visibility:visible;opacity:1;isolation:auto;mix-blend-mode:normal;color-interpolation:sRGB;color-interpolation-filters:linearRGB;solid-color:#000000;solid-opacity:1;fill:url(#linearGradient3607);fill-opacity:1;fill-rule:evenodd;stroke:none;stroke-width:6.69461107;stroke-linecap:round;stroke-linejoin:round;stroke-miterlimit:23;stroke-dasharray:none;stroke-dashoffset:0;stroke-opacity:1;marker:none;color-rendering:auto;image-rendering:auto;shape-rendering:auto;text-rendering:auto;enable-background:accumulate"
         d="m -594.6897,965.72041 93.86851,83.35719 0.16188,-0.1028 -13.78401,-129.74291 -105.30512,-77.7755 z"
         id="path4229" />
      <path
         sodipodi:nodetypes="ccccc"
         inkscape:connector-curvature="0"
         style="color:#000000;clip-rule:nonzero;display:inline;overflow:visible;visibility:visible;opacity:1;isolation:auto;mix-blend-mode:normal;color-interpolation:sRGB;color-interpolation-filters:linearRGB;solid-color:#000000;solid-opacity:1;fill:none;fill-opacity:1;fill-rule:evenodd;stroke:#000000;stroke-width:2.13570356;stroke-linecap:round;stroke-linejoin:round;stroke-miterlimit:23;stroke-dasharray:none;stroke-dashoffset:0;stroke-opacity:0.38790038;marker:none;color-rendering:auto;image-rendering:auto;shape-rendering:auto;text-rendering:auto;enable-background:accumulate"
         d="m -544.57749,823.13142 5.36558,45.22632 51.80455,35.43848 4.78324,62.6359 35.9043,28.92247"
         id="path4248" />
      <path
         transform="matrix(0.30268962,-0.17475794,0.17475794,0.30268962,-524.69251,893.16203)"
         style="color:#000000;clip-rule:nonzero;display:inline;overflow:visible;visibility:visible;opacity:1;isolation:auto;mix-blend-mode:normal;color-interpolation:sRGB;color-interpolation-filters:linearRGB;solid-color:#000000;solid-opacity:1;fill:url(#radialGradient3609);fill-opacity:1;fill-rule:evenodd;stroke:none;stroke-width:6.69461107;stroke-linecap:round;stroke-linejoin:round;stroke-miterlimit:23;stroke-dasharray:none;stroke-dashoffset:0;stroke-opacity:1;marker:none;filter:url(#filter5380);color-rendering:auto;image-rendering:auto;shape-rendering:auto;text-rendering:auto;enable-background:accumulate"
         d="M -62.617113,-206.18866 74.849687,80.410952 -64.296803,370.40118 44.445387,365.58478 203.86336,80.410952 48.484447,-201.26483 Z"
         id="path5252"
         inkscape:connector-curvature="0" />
      <path
         style="color:#000000;clip-rule:nonzero;display:inline;overflow:visible;visibility:visible;opacity:1;isolation:auto;mix-blend-mode:normal;color-interpolation:sRGB;color-interpolation-filters:linearRGB;solid-color:#000000;solid-opacity:1;fill:#a5a5a5;fill-opacity:1;fill-rule:evenodd;stroke:none;stroke-width:6.11046267;stroke-linecap:round;stroke-linejoin:round;stroke-miterlimit:23;stroke-dasharray:none;stroke-dashoffset:0;stroke-opacity:1;marker:none;color-rendering:auto;image-rendering:auto;shape-rendering:auto;text-rendering:auto;enable-background:accumulate"
         d="m -319.76735,775.5347 -42.68804,-17.36383 -56.5929,27.14481 -56.63592,-27.17552 -43.54408,17.7113 0.007,0.19739 100.22778,54.41798 99.22564,-54.93203 z"
         id="path3653"
         inkscape:connector-curvature="0" />
      <path
         id="path3655"
         d="m -297.71014,701.05982 -121.31562,-40.34259 -121.31496,40.34259 3.7618,84.90461 117.7314,69.40949 117.37491,-69.40949 z"
         style="color:#000000;clip-rule:nonzero;display:inline;overflow:visible;visibility:visible;opacity:1;isolation:auto;mix-blend-mode:normal;color-interpolation:sRGB;color-interpolation-filters:linearRGB;solid-color:#000000;solid-opacity:1;fill:url(#linearGradient3665);fill-opacity:1;fill-rule:evenodd;stroke:#000000;stroke-width:2.33987284;stroke-linecap:round;stroke-linejoin:round;stroke-miterlimit:23;stroke-dasharray:none;stroke-dashoffset:0;stroke-opacity:1;marker:none;color-rendering:auto;image-rendering:auto;shape-rendering:auto;text-rendering:auto;enable-background:accumulate"
         inkscape:connector-curvature="0"
         sodipodi:nodetypes="ccccccc" />
      <path
         style="color:#000000;clip-rule:nonzero;display:inline;overflow:visible;visibility:visible;opacity:1;isolation:auto;mix-blend-mode:normal;color-interpolation:sRGB;color-interpolation-filters:linearRGB;solid-color:#000000;solid-opacity:1;fill:#c5fffe;fill-opacity:1;fill-rule:evenodd;stroke:#000000;stroke-width:2.33987284;stroke-linecap:round;stroke-linejoin:round;stroke-miterlimit:23;stroke-dasharray:none;stroke-dashoffset:0;stroke-opacity:1;marker:none;color-rendering:auto;image-rendering:auto;shape-rendering:auto;text-rendering:auto;enable-background:accumulate"
         d="m -318.87717,737.26887 -100.17112,48.04681 -101.3562,-48.63389 1.68339,38.00711 99.67281,55.71913 98.45014,-54.30742 z"
         id="path3657"
         inkscape:connector-curvature="0" />
      <path
         sodipodi:nodetypes="ccccc"
         id="path3659"
         d="m -299.12435,701.76693 -119.8441,-40.15657 -120.17139,40.27494 120.24568,52.75931 z"
         style="color:#000000;clip-rule:nonzero;display:inline;overflow:visible;visibility:visible;opacity:1;isolation:auto;mix-blend-mode:normal;color-interpolation:sRGB;color-interpolation-filters:linearRGB;solid-color:#000000;solid-opacity:1;fill:url(#linearGradient3667);fill-opacity:1;fill-rule:evenodd;stroke:none;stroke-width:6.69461107;stroke-linecap:round;stroke-linejoin:round;stroke-miterlimit:23;stroke-dasharray:none;stroke-dashoffset:0;stroke-opacity:1;marker:none;color-rendering:auto;image-rendering:auto;shape-rendering:auto;text-rendering:auto;enable-background:accumulate"
         inkscape:connector-curvature="0" />
      <path
         id="path3661"
         d="m -320.60547,776.13733 -41.84992,-17.96646 -56.5929,27.14481 -56.63592,-27.17552 -43.19053,16.56225"
         style="color:#000000;clip-rule:nonzero;display:inline;overflow:visible;visibility:visible;opacity:1;isolation:auto;mix-blend-mode:normal;color-interpolation:sRGB;color-interpolation-filters:linearRGB;solid-color:#000000;solid-opacity:1;fill:none;fill-opacity:1;fill-rule:evenodd;stroke:#000000;stroke-width:2.13570356;stroke-linecap:round;stroke-linejoin:round;stroke-miterlimit:23;stroke-dasharray:none;stroke-dashoffset:0;stroke-opacity:0.38790038;marker:none;color-rendering:auto;image-rendering:auto;shape-rendering:auto;text-rendering:auto;enable-background:accumulate"
         inkscape:connector-curvature="0"
         sodipodi:nodetypes="ccccc" />
      <path
         transform="matrix(0,0.34951588,-0.34951588,0,-391.19625,758.34289)"
         inkscape:connector-curvature="0"
         id="path3663"
         d="M -62.617113,-206.18866 74.849687,80.410952 -64.296803,370.40118 44.445387,365.58478 203.86336,80.410952 48.484447,-201.26483 Z"
         style="color:#000000;clip-rule:nonzero;display:inline;overflow:visible;visibility:visible;opacity:1;isolation:auto;mix-blend-mode:normal;color-interpolation:sRGB;color-interpolation-filters:linearRGB;solid-color:#000000;solid-opacity:1;fill:url(#radialGradient3669);fill-opacity:1;fill-rule:evenodd;stroke:none;stroke-width:6.69461107;stroke-linecap:round;stroke-linejoin:round;stroke-miterlimit:23;stroke-dasharray:none;stroke-dashoffset:0;stroke-opacity:1;marker:none;filter:url(#filter5380);color-rendering:auto;image-rendering:auto;shape-rendering:auto;text-rendering:auto;enable-background:accumulate" />
      <path
         inkscape:connector-curvature="0"
         id="path3673"
         d="m -391.79058,994.62695 36.38154,-28.28701 4.78835,-62.5833 51.85266,-35.46036 6.4336,-46.56593 -0.17461,-0.0921 -97.24124,59.5908 -2.0403,113.39794 z"
         style="color:#000000;clip-rule:nonzero;display:inline;overflow:visible;visibility:visible;opacity:1;isolation:auto;mix-blend-mode:normal;color-interpolation:sRGB;color-interpolation-filters:linearRGB;solid-color:#000000;solid-opacity:1;fill:#a5a5a5;fill-opacity:1;fill-rule:evenodd;stroke:none;stroke-width:6.11046267;stroke-linecap:round;stroke-linejoin:round;stroke-miterlimit:23;stroke-dasharray:none;stroke-dashoffset:0;stroke-opacity:1;marker:none;color-rendering:auto;image-rendering:auto;shape-rendering:auto;text-rendering:auto;enable-background:accumulate" />
      <path
         sodipodi:nodetypes="ccccccc"
         inkscape:connector-curvature="0"
         style="color:#000000;clip-rule:nonzero;display:inline;overflow:visible;visibility:visible;opacity:1;isolation:auto;mix-blend-mode:normal;color-interpolation:sRGB;color-interpolation-filters:linearRGB;solid-color:#000000;solid-opacity:1;fill:url(#linearGradient3685);fill-opacity:1;fill-rule:evenodd;stroke:#000000;stroke-width:2.33987284;stroke-linecap:round;stroke-linejoin:round;stroke-miterlimit:23;stroke-dasharray:none;stroke-dashoffset:0;stroke-opacity:1;marker:none;color-rendering:auto;image-rendering:auto;shape-rendering:auto;text-rendering:auto;enable-background:accumulate"
         d="m -338.32205,1050.9665 95.5955,-84.89111 25.7198,-125.23313 -75.41046,-39.19448 -118.97607,67.25363 1.42292,136.35439 z"
         id="path3675" />
      <path
         inkscape:connector-curvature="0"
         id="path3677"
         d="m -359.09648,1014.5308 8.47579,-110.77416 92.79629,-63.46008 -33.75684,-17.54568 -98.09055,58.4596 -2.1935,112.41403 z"
         style="color:#000000;clip-rule:nonzero;display:inline;overflow:visible;visibility:visible;opacity:1;isolation:auto;mix-blend-mode:normal;color-interpolation:sRGB;color-interpolation-filters:linearRGB;solid-color:#000000;solid-opacity:1;fill:#c5fffe;fill-opacity:1;fill-rule:evenodd;stroke:#000000;stroke-width:2.33987284;stroke-linecap:round;stroke-linejoin:round;stroke-miterlimit:23;stroke-dasharray:none;stroke-dashoffset:0;stroke-opacity:1;marker:none;color-rendering:auto;image-rendering:auto;shape-rendering:auto;text-rendering:auto;enable-background:accumulate" />
      <path
         sodipodi:nodetypes="ccccc"
         inkscape:connector-curvature="0"
         style="color:#000000;clip-rule:nonzero;display:inline;overflow:visible;visibility:visible;opacity:1;isolation:auto;mix-blend-mode:normal;color-interpolation:sRGB;color-interpolation-filters:linearRGB;solid-color:#000000;solid-opacity:1;fill:url(#linearGradient3687);fill-opacity:1;fill-rule:evenodd;stroke:none;stroke-width:6.69461107;stroke-linecap:round;stroke-linejoin:round;stroke-miterlimit:23;stroke-dasharray:none;stroke-dashoffset:0;stroke-opacity:1;marker:none;color-rendering:auto;image-rendering:auto;shape-rendering:auto;text-rendering:auto;enable-background:accumulate"
         d="m -338.484,1049.5241 95.75745,-83.44871 24.4698,-124.60813 -106.33194,77.50636 z"
         id="path3679" />
      <path
         sodipodi:nodetypes="ccccc"
         inkscape:connector-curvature="0"
         style="color:#000000;clip-rule:nonzero;display:inline;overflow:visible;visibility:visible;opacity:1;isolation:auto;mix-blend-mode:normal;color-interpolation:sRGB;color-interpolation-filters:linearRGB;solid-color:#000000;solid-opacity:1;fill:none;fill-opacity:1;fill-rule:evenodd;stroke:#000000;stroke-width:2.13570356;stroke-linecap:round;stroke-linejoin:round;stroke-miterlimit:23;stroke-dasharray:none;stroke-dashoffset:0;stroke-opacity:0.38790038;marker:none;color-rendering:auto;image-rendering:auto;shape-rendering:auto;text-rendering:auto;enable-background:accumulate"
         d="m -391.8934,993.59981 36.48436,-27.25987 4.78835,-62.5833 51.85266,-35.46036 7.1836,-45.62843"
         id="path3681" />
      <path
         transform="matrix(-0.30268962,-0.17475794,0.17475794,-0.30268962,-341.18759,941.36362)"
         style="color:#000000;clip-rule:nonzero;display:inline;overflow:visible;visibility:visible;opacity:1;isolation:auto;mix-blend-mode:normal;color-interpolation:sRGB;color-interpolation-filters:linearRGB;solid-color:#000000;solid-opacity:1;fill:url(#radialGradient3689);fill-opacity:1;fill-rule:evenodd;stroke:none;stroke-width:6.69461107;stroke-linecap:round;stroke-linejoin:round;stroke-miterlimit:23;stroke-dasharray:none;stroke-dashoffset:0;stroke-opacity:1;marker:none;filter:url(#filter5380);color-rendering:auto;image-rendering:auto;shape-rendering:auto;text-rendering:auto;enable-background:accumulate"
         d="M -62.617113,-206.18866 74.849687,80.410952 -64.296803,370.40118 44.445387,365.58478 203.86336,80.410952 48.484447,-201.26483 Z"
         id="path3683"
         inkscape:connector-curvature="0" />
      <path
         sodipodi:nodetypes="cccccccc"
         inkscape:connector-curvature="0"
         style="color:#000000;clip-rule:nonzero;display:inline;overflow:visible;visibility:visible;opacity:1;isolation:auto;mix-blend-mode:normal;color-interpolation:sRGB;color-interpolation-filters:linearRGB;solid-color:#000000;solid-opacity:1;fill:#c5fffe;fill-opacity:1;fill-rule:evenodd;stroke:#000000;stroke-width:2.33987284;stroke-linecap:round;stroke-linejoin:round;stroke-miterlimit:23;stroke-dasharray:none;stroke-dashoffset:0;stroke-opacity:1;marker:none;color-rendering:auto;image-rendering:auto;shape-rendering:auto;text-rendering:auto;enable-background:accumulate"
         d="m -620.63566,940.84746 42.89118,-24.6753 -3.91981,-21.51394 -55.68169,32.03368 m 54.21409,91.5068 56.05415,-32.24788 -17.33133,-13.79831 -42.5747,24.49317"
         id="path4191" />
      <path
         sodipodi:nodetypes="ccccccccccccccc"
         inkscape:connector-curvature="0"
         id="path4152"
         d="m -701.52763,881.2686 33.09454,125.3276 88.33331,95.5748 59.04572,-38.4457 -6.02368,-77.77448 -56.05415,32.24788 -3.85188,-21.55302 58.1437,-33.45 -2.60183,-33.59576 -31.29198,-23.05011 -57.8985,33.30899 -16.71036,-14.15555 55.90834,-32.16406 -57.19813,-43.97676 z"
         style="color:#000000;clip-rule:nonzero;display:inline;overflow:visible;visibility:visible;opacity:1;isolation:auto;mix-blend-mode:normal;color-interpolation:sRGB;color-interpolation-filters:linearRGB;solid-color:#000000;solid-opacity:1;fill:url(#linearGradient3445);fill-opacity:1;fill-rule:evenodd;stroke:#000000;stroke-width:2.33987284;stroke-linecap:round;stroke-linejoin:round;stroke-miterlimit:23;stroke-dasharray:none;stroke-dashoffset:0;stroke-opacity:1;marker:none;color-rendering:auto;image-rendering:auto;shape-rendering:auto;text-rendering:auto;enable-background:accumulate" />
      <path
         sodipodi:nodetypes="ccccc"
         inkscape:connector-curvature="0"
         id="path4177"
         d="m -700.19147,881.90859 32.18774,125.39001 88.16912,93.3698 -24.64982,-128.97985 z"
         style="color:#000000;clip-rule:nonzero;display:inline;overflow:visible;visibility:visible;opacity:1;isolation:auto;mix-blend-mode:normal;color-interpolation:sRGB;color-interpolation-filters:linearRGB;solid-color:#000000;solid-opacity:1;fill:url(#linearGradient3447);fill-opacity:1;fill-rule:evenodd;stroke:none;stroke-width:6.69461107;stroke-linecap:round;stroke-linejoin:round;stroke-miterlimit:23;stroke-dasharray:none;stroke-dashoffset:0;stroke-opacity:1;marker:none;color-rendering:auto;image-rendering:auto;shape-rendering:auto;text-rendering:auto;enable-background:accumulate" />
      <path
         id="path4194"
         d="m -579.10607,916.29122 -4.05264,-21.51396 m 55.15014,91.29261 -17.41654,-13.79832"
         style="color:#000000;clip-rule:nonzero;display:inline;overflow:visible;visibility:visible;opacity:1;isolation:auto;mix-blend-mode:normal;color-interpolation:sRGB;color-interpolation-filters:linearRGB;solid-color:#000000;solid-opacity:1;fill:#a5a5a5;fill-opacity:1;fill-rule:evenodd;stroke:#000000;stroke-width:2.72169948;stroke-linecap:butt;stroke-linejoin:round;stroke-miterlimit:23;stroke-dasharray:none;stroke-dashoffset:0;stroke-opacity:1;marker:none;color-rendering:auto;image-rendering:auto;shape-rendering:auto;text-rendering:auto;enable-background:accumulate"
         inkscape:connector-curvature="0"
         sodipodi:nodetypes="cccc" />
      <path
         transform="matrix(0.30376842,-0.17475794,0.1728894,0.30268962,-523.39505,893.16203)"
         id="path5254"
         d="m -308.42835,-20.532234 h 141.19695 l 20.73524,-59.104419 H -329.7993 m 4.82545,305.098493 h 184.52922 l -23.4152,-59.10441 h -140.15513"
         style="color:#000000;clip-rule:nonzero;display:inline;overflow:visible;visibility:visible;opacity:1;isolation:auto;mix-blend-mode:normal;color-interpolation:sRGB;color-interpolation-filters:linearRGB;solid-color:#000000;solid-opacity:1;fill:#00faf6;fill-opacity:0.09608543;fill-rule:evenodd;stroke:none;stroke-width:6.69461107;stroke-linecap:round;stroke-linejoin:round;stroke-miterlimit:23;stroke-dasharray:none;stroke-dashoffset:0;stroke-opacity:1;marker:none;filter:url(#filter5364);color-rendering:auto;image-rendering:auto;shape-rendering:auto;text-rendering:auto;enable-background:accumulate"
         inkscape:connector-curvature="0"
         sodipodi:nodetypes="cccccccc" />
      <path
         transform="matrix(0.30376842,-0.17475794,0.1728894,0.30268962,-523.39505,893.16203)"
         sodipodi:nodetypes="cccccccc"
         inkscape:connector-curvature="0"
         style="color:#000000;clip-rule:nonzero;display:inline;overflow:visible;visibility:visible;opacity:1;isolation:auto;mix-blend-mode:normal;color-interpolation:sRGB;color-interpolation-filters:linearRGB;solid-color:#000000;solid-opacity:1;fill:url(#radialGradient3449);fill-opacity:1;fill-rule:evenodd;stroke:none;stroke-width:6.69461107;stroke-linecap:round;stroke-linejoin:round;stroke-miterlimit:23;stroke-dasharray:none;stroke-dashoffset:0;stroke-opacity:1;marker:none;filter:url(#filter5380);color-rendering:auto;image-rendering:auto;shape-rendering:auto;text-rendering:auto;enable-background:accumulate"
         d="m -308.42835,-20.532234 h 141.19695 l 22.41424,-62.719278 H -328.1203 m 3.14645,308.713352 h 184.52922 l -23.4152,-59.10441 h -140.15513"
         id="path5388" />
      <path
         sodipodi:nodetypes="ccccc"
         inkscape:connector-curvature="0"
         inkscape:original-d="m -700.23245,881.93094 98.84191,88.57831 -3.50998,1.23523 0.37298,3.80861 z"
         inkscape:path-effect="#path-effect4549"
         id="path4547"
         d="m -700.23245,881.93094 98.84191,88.57831 -3.50998,1.23523 0.37298,3.80861 z"
         style="color:#000000;clip-rule:nonzero;display:inline;overflow:visible;visibility:visible;opacity:1;isolation:auto;mix-blend-mode:normal;color-interpolation:sRGB;color-interpolation-filters:linearRGB;solid-color:#000000;solid-opacity:1;fill:#f0ffe9;fill-opacity:0.77906979;fill-rule:evenodd;stroke:none;stroke-width:5;stroke-linecap:butt;stroke-linejoin:round;stroke-miterlimit:23;stroke-dasharray:none;stroke-dashoffset:0;stroke-opacity:1;marker:none;color-rendering:auto;image-rendering:auto;shape-rendering:auto;text-rendering:auto;enable-background:accumulate" />
      <path
         sodipodi:nodetypes="ccccc"
         inkscape:transform-center-y="-38.073788"
         inkscape:transform-center-x="52.125592"
         style="color:#000000;clip-rule:nonzero;display:inline;overflow:visible;visibility:visible;opacity:1;isolation:auto;mix-blend-mode:normal;color-interpolation:sRGB;color-interpolation-filters:linearRGB;solid-color:#000000;solid-opacity:1;fill:#f0ffe9;fill-opacity:0.77906979;fill-rule:evenodd;stroke:none;stroke-width:5;stroke-linecap:butt;stroke-linejoin:round;stroke-miterlimit:23;stroke-dasharray:none;stroke-dashoffset:0;stroke-opacity:1;marker:none;color-rendering:auto;image-rendering:auto;shape-rendering:auto;text-rendering:auto;enable-background:accumulate"
         d="m -619.74844,841.45639 108.47669,76.75117 -3.37891,1.54116 0.73291,3.7584 z"
         id="path4551"
         inkscape:path-effect="#path-effect4553"
         inkscape:original-d="m -619.74844,841.45639 108.47669,76.75117 -3.37891,1.54116 0.73291,3.7584 z"
         inkscape:connector-curvature="0" />
      <path
         sodipodi:nodetypes="ccccc"
         inkscape:connector-curvature="0"
         inkscape:original-d="m -539.13984,701.8853 122.47328,51.78644 -2.1921,1.46311 -0.0553,3.03525 z"
         inkscape:path-effect="#path-effect4557"
         id="path4555"
         d="m -539.13984,701.8853 122.47328,51.78644 -2.1921,1.46311 -0.0553,3.03525 z"
         style="color:#000000;clip-rule:nonzero;display:inline;overflow:visible;visibility:visible;opacity:1;isolation:auto;mix-blend-mode:normal;color-interpolation:sRGB;color-interpolation-filters:linearRGB;solid-color:#000000;solid-opacity:1;fill:#f0ffe9;fill-opacity:0.77906979;fill-rule:evenodd;stroke:none;stroke-width:5;stroke-linecap:butt;stroke-linejoin:round;stroke-miterlimit:23;stroke-dasharray:none;stroke-dashoffset:0;stroke-opacity:1;marker:none;color-rendering:auto;image-rendering:auto;shape-rendering:auto;text-rendering:auto;enable-background:accumulate"
         inkscape:transform-center-x="59.447582"
         inkscape:transform-center-y="-26.141333" />
      <path
         inkscape:connector-curvature="0"
         id="path4559"
         d="m -413.14067,867.08787 22.76175,14.30193 0.49881,-0.88999 z m 62.86018,36.24539 -0.58582,2.88521 25.62317,16.09936 0.32674,-2.36168 1.84252,-0.93652 z"
         style="color:#000000;clip-rule:nonzero;display:inline;overflow:visible;visibility:visible;opacity:1;isolation:auto;mix-blend-mode:normal;color-interpolation:sRGB;color-interpolation-filters:linearRGB;solid-color:#000000;solid-opacity:1;fill:#f0ffe9;fill-opacity:0.77906979;fill-rule:evenodd;stroke:none;stroke-width:5;stroke-linecap:butt;stroke-linejoin:round;stroke-miterlimit:23;stroke-dasharray:none;stroke-dashoffset:0;stroke-opacity:1;marker:none;color-rendering:auto;image-rendering:auto;shape-rendering:auto;text-rendering:auto;enable-background:accumulate" />
      <path
         sodipodi:nodetypes="ccccccccccccccc"
         inkscape:connector-curvature="0"
         id="path4226"
         transform="matrix(0.95663069,0,0,0.95663069,-702.40781,631.43033)"
         d="m 296.67298,171.53649 c -14.71298,0.0319 -29.04779,4.66332 -40.99805,13.24609 l 40.43164,22.60156 41.34375,-22.80664 c -11.91333,-8.4662 -26.16215,-13.02312 -40.77734,-13.04101 z m 71.11373,65.65593 -40.24414,23.98437 -0.91993,47.11719 c 25.26958,-11.38276 41.53257,-36.50773 41.57032,-64.22266 -0.0233,-2.29821 -0.15886,-4.59392 -0.40625,-6.8789 z m -142.7941,-0.14097 c -0.21155,2.18446 -0.32104,4.3776 -0.32812,6.57226 0.0334,27.48633 16.02894,52.45037 40.98633,63.9668 l -0.64258,-46.38281 z"
         style="color:#000000;clip-rule:nonzero;display:inline;overflow:visible;visibility:visible;opacity:1;isolation:auto;mix-blend-mode:normal;color-interpolation:sRGB;color-interpolation-filters:linearRGB;solid-color:#000000;solid-opacity:1;fill:url(#radialGradient4275);fill-opacity:1;fill-rule:evenodd;stroke:#ffffff;stroke-width:2.37808871;stroke-linecap:butt;stroke-linejoin:round;stroke-miterlimit:23;stroke-dasharray:none;stroke-dashoffset:0;stroke-opacity:0.44573645;marker:none;filter:url(#filter4251);color-rendering:auto;image-rendering:auto;shape-rendering:auto;text-rendering:auto;enable-background:accumulate" />
      <path
         transform="matrix(0.96716324,0,0,0.96716324,-705.52996,628.90341)"
         inkscape:connector-curvature="0"
         id="path4255"
         d="m 295.22461,165.55273 c -16.00124,0.86713 -33.70619,4.92202 -44.69019,17.27515 -1.24189,8.12939 8.49065,10.46675 13.98706,13.54321 10.6335,5.48644 20.43161,13.5886 32.14564,16.42762 15.76785,-6.5371 30.58033,-15.6527 45.18249,-24.41394 4.11245,-6.2813 -3.46235,-11.33167 -8.49023,-13.43555 -11.60725,-6.37353 -24.89447,-9.65302 -38.13477,-9.39649 z m -70.44922,65.60547 c -7.83021,1.22947 -5.85917,10.75627 -6.03711,16.42188 1.32807,27.88963 19.25613,54.77028 45.11719,65.63476 7.67889,0.68993 9.30181,-8.98709 7.57812,-14.63672 -1.01148,-13.44856 1.63949,-27.48455 -2.01282,-40.54768 -13.62019,-10.3641 -28.88696,-18.92943 -43.98522,-26.86442 l -0.20508,-0.01 -0.45508,0.002 z m 142.57422,0.125 c -14.94675,7.63759 -29.71385,16.20274 -43.37695,25.94922 -4.54717,6.45983 -1.64786,14.90848 -2.78321,22.23828 0.11573,10.52984 -1.44804,21.37125 0.58203,31.71485 4.98873,6.03389 12.21836,0.21499 17.11719,-2.71094 24.21145,-15.29963 39.44055,-45.62846 34.08594,-74.13867 -1.11386,-1.9577 -3.37216,-3.19905 -5.625,-3.05274 z"
         style="color:#000000;clip-rule:nonzero;display:inline;overflow:visible;visibility:visible;opacity:1;isolation:auto;mix-blend-mode:normal;color-interpolation:sRGB;color-interpolation-filters:linearRGB;solid-color:#000000;solid-opacity:1;fill:#ffffff;fill-opacity:1;fill-rule:evenodd;stroke:none;stroke-width:5;stroke-linecap:butt;stroke-linejoin:round;stroke-miterlimit:23;stroke-dasharray:none;stroke-dashoffset:0;stroke-opacity:1;marker:none;filter:url(#filter4265);color-rendering:auto;image-rendering:auto;shape-rendering:auto;text-rendering:auto;enable-background:accumulate" />
      <path
         transform="matrix(1.2667466,0,0,1.2667466,161.2569,-259.09173)"
         sodipodi:nodetypes="cscsc"
         inkscape:connector-curvature="0"
         inkscape:original-d="m -597.76614,966.59152 c -1.85666,1.81598 -3.84113,3.03183 -4.75976,5.80004 -0.60987,1.83778 -1.11248,5.18285 -1.11248,5.18285 0,0 -1.26995,-1.76454 -1.60013,-3.75064 -0.33019,-1.9861 3.71333,-6.34603 7.47237,-7.23225 z"
         inkscape:path-effect="#path-effect4291"
         id="path4289"
         d="m -597.76614,966.59152 c -2.08552,1.43917 -3.75521,3.47378 -4.75976,5.80004 -0.70502,1.63263 -1.08539,3.4047 -1.11248,5.18285 -0.90457,-1.04398 -1.47251,-2.37519 -1.60013,-3.75064 -0.18364,-1.97921 0.57392,-4.02528 2.00221,-5.40767 1.42829,-1.3824 3.498,-2.07275 5.47016,-1.82458 z"
         style="color:#000000;clip-rule:nonzero;display:inline;overflow:visible;visibility:visible;opacity:1;isolation:auto;mix-blend-mode:normal;color-interpolation:sRGB;color-interpolation-filters:linearRGB;solid-color:#000000;solid-opacity:1;fill:#69d895;fill-opacity:1;fill-rule:evenodd;stroke:none;stroke-width:2.29999995;stroke-linecap:butt;stroke-linejoin:round;stroke-miterlimit:23;stroke-dasharray:none;stroke-dashoffset:0;stroke-opacity:0.44573645;marker:none;filter:url(#filter4313);color-rendering:auto;image-rendering:auto;shape-rendering:auto;text-rendering:auto;enable-background:accumulate" />
      <path
         style="color:#000000;clip-rule:nonzero;display:inline;overflow:visible;visibility:visible;opacity:1;isolation:auto;mix-blend-mode:normal;color-interpolation:sRGB;color-interpolation-filters:linearRGB;solid-color:#000000;solid-opacity:1;fill:#69d895;fill-opacity:1;fill-rule:evenodd;stroke:none;stroke-width:2.29999995;stroke-linecap:butt;stroke-linejoin:round;stroke-miterlimit:23;stroke-dasharray:none;stroke-dashoffset:0;stroke-opacity:0.44573645;marker:none;filter:url(#filter4313);color-rendering:auto;image-rendering:auto;shape-rendering:auto;text-rendering:auto;enable-background:accumulate"
         d="m -597.76614,966.59152 c -2.08552,1.43917 -3.75521,3.47378 -4.75976,5.80004 -0.70502,1.63263 -1.08539,3.4047 -1.11248,5.18285 -0.90457,-1.04398 -1.47251,-2.37519 -1.60013,-3.75064 -0.18364,-1.97921 0.57392,-4.02528 2.00221,-5.40767 1.42829,-1.3824 3.498,-2.07275 5.47016,-1.82458 z"
         id="path4317"
         inkscape:path-effect="#path-effect4319"
         inkscape:original-d="m -597.76614,966.59152 c -1.85666,1.81598 -3.84113,3.03183 -4.75976,5.80004 -0.60987,1.83778 -1.11248,5.18285 -1.11248,5.18285 0,0 -1.26995,-1.76454 -1.60013,-3.75064 -0.33019,-1.9861 3.71333,-6.34603 7.47237,-7.23225 z"
         inkscape:connector-curvature="0"
         sodipodi:nodetypes="cscsc"
         transform="matrix(1.2667466,0,0,1.2667466,251.42931,-311.75337)" />
      <path
         transform="matrix(1.0686774,0,0,1.0686774,319.97398,-118.14432)"
         sodipodi:nodetypes="cscsc"
         inkscape:connector-curvature="0"
         inkscape:original-d="m -597.76614,966.59152 c -1.85666,1.81598 -3.84113,3.03183 -4.75976,5.80004 -0.60987,1.83778 -1.11248,5.18285 -1.11248,5.18285 0,0 -1.26995,-1.76454 -1.60013,-3.75064 -0.33019,-1.9861 3.71333,-6.34603 7.47237,-7.23225 z"
         inkscape:path-effect="#path-effect4323"
         id="path4321"
         d="m -597.76614,966.59152 c -2.08552,1.43917 -3.75521,3.47378 -4.75976,5.80004 -0.70502,1.63263 -1.08539,3.4047 -1.11248,5.18285 -0.90457,-1.04398 -1.47251,-2.37519 -1.60013,-3.75064 -0.18364,-1.97921 0.57392,-4.02528 2.00221,-5.40767 1.42829,-1.3824 3.498,-2.07275 5.47016,-1.82458 z"
         style="color:#000000;clip-rule:nonzero;display:inline;overflow:visible;visibility:visible;opacity:1;isolation:auto;mix-blend-mode:normal;color-interpolation:sRGB;color-interpolation-filters:linearRGB;solid-color:#000000;solid-opacity:1;fill:#69d895;fill-opacity:1;fill-rule:evenodd;stroke:none;stroke-width:2.29999995;stroke-linecap:butt;stroke-linejoin:round;stroke-miterlimit:23;stroke-dasharray:none;stroke-dashoffset:0;stroke-opacity:0.44573645;marker:none;filter:url(#filter4313);color-rendering:auto;image-rendering:auto;shape-rendering:auto;text-rendering:auto;enable-background:accumulate" />
      <path
         style="color:#000000;clip-rule:nonzero;display:inline;overflow:visible;visibility:visible;opacity:1;isolation:auto;mix-blend-mode:normal;color-interpolation:sRGB;color-interpolation-filters:linearRGB;solid-color:#000000;solid-opacity:1;fill:#69d895;fill-opacity:1;fill-rule:evenodd;stroke:none;stroke-width:2.29999995;stroke-linecap:butt;stroke-linejoin:round;stroke-miterlimit:23;stroke-dasharray:none;stroke-dashoffset:0;stroke-opacity:0.44573645;marker:none;filter:url(#filter4313);color-rendering:auto;image-rendering:auto;shape-rendering:auto;text-rendering:auto;enable-background:accumulate"
         d="m -597.76614,966.59152 c -2.08552,1.43917 -3.75521,3.47378 -4.75976,5.80004 -0.70502,1.63263 -1.08539,3.4047 -1.11248,5.18285 -0.90457,-1.04398 -1.47251,-2.37519 -1.60013,-3.75064 -0.18364,-1.97921 0.57392,-4.02528 2.00221,-5.40767 1.42829,-1.3824 3.498,-2.07275 5.47016,-1.82458 z"
         id="path4325"
         inkscape:path-effect="#path-effect4327"
         inkscape:original-d="m -597.76614,966.59152 c -1.85666,1.81598 -3.84113,3.03183 -4.75976,5.80004 -0.60987,1.83778 -1.11248,5.18285 -1.11248,5.18285 0,0 -1.26995,-1.76454 -1.60013,-3.75064 -0.33019,-1.9861 3.71333,-6.34603 7.47237,-7.23225 z"
         inkscape:connector-curvature="0"
         sodipodi:nodetypes="cscsc"
         transform="matrix(0.94879338,0,0,0.94879338,153.87413,-165.97375)" />
    </g>
    <path
       style="color:#000000;clip-rule:nonzero;display:inline;overflow:visible;visibility:visible;opacity:0.07;isolation:auto;mix-blend-mode:normal;color-interpolation:sRGB;color-interpolation-filters:linearRGB;solid-color:#000000;solid-opacity:1;vector-effect:none;fill:none;fill-opacity:0.70383277;fill-rule:nonzero;stroke:url(#linearGradient5880);stroke-width:17;stroke-linecap:round;stroke-linejoin:round;stroke-miterlimit:23;stroke-dasharray:none;stroke-dashoffset:0;stroke-opacity:1;marker:none;color-rendering:auto;image-rendering:auto;shape-rendering:auto;text-rendering:auto;enable-background:accumulate"
       d="m 212.28309,632.54631 c 36.01277,96.10893 18.02173,393.82599 -16.38698,483.70529"
       id="path5856"
       inkscape:connector-curvature="0"
       sodipodi:nodetypes="cc" />
  </g>
</svg>
