<?xml version="1.0" encoding="UTF-8" standalone="no"?>
<!-- Created with Inkscape (http://www.inkscape.org/) -->

<svg
   xmlns:dc="http://purl.org/dc/elements/1.1/"
   xmlns:cc="http://creativecommons.org/ns#"
   xmlns:rdf="http://www.w3.org/1999/02/22-rdf-syntax-ns#"
   xmlns:svg="http://www.w3.org/2000/svg"
   xmlns="http://www.w3.org/2000/svg"
   xmlns:sodipodi="http://sodipodi.sourceforge.net/DTD/sodipodi-0.dtd"
   xmlns:inkscape="http://www.inkscape.org/namespaces/inkscape"
   width="420mm"
   height="235mm"
   viewBox="0 0 420 235"
   version="1.1"
   id="svg8"
   inkscape:version="0.92.5 (2060ec1f9f, 2020-04-08)"
   sodipodi:docname="biircode.svg">
  <defs
     id="defs2" />
  <sodipodi:namedview
     id="base"
     pagecolor="#ffffff"
     bordercolor="#666666"
     borderopacity="1.0"
     inkscape:pageopacity="0.0"
     inkscape:pageshadow="2"
     inkscape:zoom="0.5"
     inkscape:cx="966.7733"
     inkscape:cy="428.99859"
     inkscape:document-units="mm"
     inkscape:current-layer="layer1"
     showgrid="false"
     inkscape:snap-global="false"
     fit-margin-top="0"
     fit-margin-left="0"
     fit-margin-right="0"
     fit-margin-bottom="0"
     inkscape:window-width="1920"
     inkscape:window-height="1061"
     inkscape:window-x="0"
     inkscape:window-y="0"
     inkscape:window-maximized="1" />
  <metadata
     id="metadata5">
    <rdf:RDF>
      <cc:Work
         rdf:about="">
        <dc:format>image/svg+xml</dc:format>
        <dc:type
           rdf:resource="http://purl.org/dc/dcmitype/StillImage" />
        <dc:title></dc:title>
      </cc:Work>
    </rdf:RDF>
  </metadata>
  <g
     inkscape:label="Layer 1"
     inkscape:groupmode="layer"
     id="layer1"
     transform="translate(223.17966,298.65243)">
    <path
       style="opacity:1;vector-effect:none;fill:#000000;fill-opacity:1;stroke:none;stroke-width:0.1813609;stroke-linecap:round;stroke-linejoin:round;stroke-miterlimit:5;stroke-dasharray:none;stroke-dashoffset:0;stroke-opacity:0.50196078"
       d="m -196.06985,-294.65242 c -0.73237,0 -1.32197,0.58995 -1.32197,1.32279 v 81.88214 l -25.78784,25.80365 3.17153,3.17347 h 58.71723 l 0.58994,-0.5903 0.58993,0.5903 h 16.34483 l 0.88285,-0.88339 -7.17837,-7.18226 v -45.37492 h 15.01516 v 30.49888 l -7.17837,7.18227 0.88286,0.88338 h 16.34483 l 0.88285,-0.88338 -7.17836,-7.18278 v -30.49837 h 14.85976 v 45.37492 l -7.17837,7.18226 0.88286,0.88339 h 16.34481 l 0.88286,-0.88339 -7.17837,-7.18278 v -45.3744 h 18.256224 l 1.773378,-1.77448 v 10.08974 a 33.66437,33.685013 0 0 0 -4.148957,16.15485 h 4.148957 v 13.66065 l -13.625192,13.63306 1.67573,1.67675 h 31.023104 46.579138 24.373838 9.9092362 52.0684788 18.885008 l 1.675735,-1.67675 -13.6252,-13.63306 v -13.66065 h 4.148957 a 33.66437,33.685013 0 0 0 -4.148957,-16.15587 v -10.08872 l 1.773378,1.77448 h 18.256223 v 45.37492 l -7.178367,7.18226 0.882854,0.88339 h 16.344822 l 0.882854,-0.88339 -7.178369,-7.18278 v -45.3744 h 14.859757 v 30.49888 l -7.17836,7.18227 0.882854,0.88338 h 16.344826 l 0.88286,-0.88338 -7.17837,-7.18278 v -30.49837 h 15.01516 v 45.37492 l -7.17837,7.18226 0.88285,0.88339 h 16.34483 l 0.58993,-0.5903 0.58994,0.5903 h 58.71723 l 3.17153,-3.17347 -25.78784,-25.80365 v -81.88214 c 0,-0.73284 -0.5896,-1.32279 -1.32197,-1.32279 h -10.84067 c -0.73237,0 -1.32146,0.58995 -1.32146,1.32279 v 81.88163 l -25.49543,25.51106 -4.59677,-4.5996 v -20.90429 h 25.44738 a 4.6080173,4.610843 0 0 1 1.35162,-3.25839 l -20.54797,-20.56057 a 33.66437,33.685013 0 0 0 -6.25103,8.70454 v -10.03142 l 2.49622,-2.49776 -2.49622,-2.49775 v -52.28097 c 0,-0.20398 -0.1642,-0.3683 -0.36807,-0.3683 h -3.01766 c -0.20387,0 -0.36807,0.16432 -0.36807,0.3683 v 48.52487 l -15.01516,-15.02437 v -33.68923 c 0,-0.0996 -0.16421,-0.17957 -0.36808,-0.17957 h -3.01766 c -0.20386,0 -0.36807,0.0799 -0.36807,0.17957 v 29.93313 l -0.76884,-0.76933 v -29.1183 c 0,-0.3578 -0.58961,-0.64604 -1.32198,-0.64604 H 92.002457 c -0.732374,0 -1.321981,0.28824 -1.321981,0.64604 v 29.1178 l -0.606803,0.60716 v -29.58173 c 0,-0.20398 -0.164201,-0.3683 -0.368068,-0.3683 h -3.017657 c -0.203864,0 -0.368069,0.16432 -0.368069,0.3683 v 33.33783 l -20.029601,20.04188 v -53.36948 c 0,-0.38717 -0.311363,-0.69925 -0.698308,-0.69925 h -5.727564 c -0.386945,0 -0.698308,0.31208 -0.698308,0.69925 v 60.00697 l -18.162674,18.17433 -4.265,-4.26763 v -73.39038 c 0,-0.73284 -0.589604,-1.32279 -1.321981,-1.32279 H 24.576301 c -0.192941,0 -0.374883,0.0434 -0.539835,0.11712 -0.286113,0.0426 -0.494339,0.17023 -0.494339,0.32431 v 0.0644 c -0.177716,0.22521 -0.287809,0.50641 -0.287809,0.81692 v 67.60254 l -13.337391,13.34506 1.675737,1.67675 h 10.919381 l -9.66999,9.67593 a 17.786314,17.797221 0 0 0 -4.9086105,-9.33166 l -10.856503,10.86265 a 2.4346109,2.4361038 0 0 1 0.7141561,1.72178 H 9.591289 l -7.1252033,7.12957 -7.1287817,-7.13316 v -96.07274 c 0,-0.38717 -0.3113675,-0.69925 -0.6983086,-0.69925 h -5.7275644 c -0.386946,0 -0.698308,0.31208 -0.698308,0.69925 v 96.07224 l -1.393038,1.39389 -1.392528,-1.39339 v -96.07274 c 0,-0.38717 -0.311362,-0.69925 -0.698308,-0.69925 h -5.727053 c -0.386942,0 -0.69882,0.31208 -0.69882,0.69925 v 96.07274 l -7.128782,7.13316 -7.125201,-7.12957 h 11.800189 a 2.4346109,2.4361038 0 0 1 0.714156,-1.72178 l -10.856502,-10.86265 a 17.786314,17.797221 0 0 0 -4.908612,9.33167 l -9.66999,-9.67593 h 10.919382 l 1.675737,-1.67675 -13.337392,-13.34506 v -67.60254 c 0,-0.31051 -0.110093,-0.59171 -0.28781,-0.81692 v -0.0639 c 0,-0.15411 -0.208225,-0.28216 -0.494337,-0.32483 -0.164952,-0.0738 -0.346894,-0.11712 -0.539835,-0.11712 h -10.840142 c -0.732377,0 -1.321981,0.58995 -1.321981,1.32279 v 73.3909 l -4.264489,4.26711 -18.163185,-18.17433 v -60.00697 c 0,-0.38717 -0.311363,-0.69925 -0.698308,-0.69925 h -5.727564 c -0.386945,0 -0.698308,0.31208 -0.698308,0.69925 v 53.36948 l -20.029602,-20.04188 v -33.33783 c 0,-0.20398 -0.16421,-0.3683 -0.36807,-0.3683 h -3.01765 c -0.20387,0 -0.36807,0.16432 -0.36807,0.3683 v 29.58173 l -0.60681,-0.60716 v -29.1178 c 0,-0.3578 -0.5896,-0.64604 -1.32198,-0.64604 h -10.84015 c -0.73237,0 -1.32198,0.28824 -1.32198,0.64604 v 29.1183 l -0.76884,0.76933 v -29.93313 c 0,-0.0996 -0.16421,-0.17957 -0.36807,-0.17957 h -3.01766 c -0.20387,0 -0.36808,0.0801 -0.36808,0.17957 v 33.68923 l -15.01516,15.02437 v -48.52487 c 0,-0.20398 -0.1642,-0.3683 -0.36807,-0.3683 h -3.01766 c -0.20387,0 -0.36807,0.16432 -0.36807,0.3683 v 52.28097 l -2.49622,2.49775 2.49622,2.49776 v 10.03142 a 33.66437,33.685013 0 0 0 -6.25103,-8.70454 l -20.54797,20.56057 a 4.6080173,4.610843 0 0 1 1.35162,3.25839 h 25.44738 v 20.90429 l -4.59677,4.5996 -25.49492,-25.51055 v -81.88214 c 0,-0.73284 -0.5896,-1.32279 -1.32197,-1.32279 z m 110.544432,83.21159 h 15.815722 l 0.735114,0.73555 h 5.135075 l -5.517968,5.52136 a 17.786314,17.797221 0 0 0 -3.571803,-5.1771 l -10.856503,10.86265 a 2.434611,2.4361039 0 0 1 0.714157,1.72178 h 6.311361 l -4.381043,4.38372 -4.384112,-4.38731 z m 128.876307,0 h 15.815209 v 13.66065 l -4.384623,4.38731 -4.380532,-4.38372 h 6.311361 a 2.434611,2.4361039 0 0 1 0.714157,-1.72178 l -10.856503,-10.86265 a 17.786314,17.797221 0 0 0 -3.571803,5.1771 l -5.517968,-5.52136 h 5.135585 z m -186.776129,14.27601 -5.71989,5.7229 a 1.2827057,1.2834923 0 0 1 0.37625,0.90742 h 8.08832 a 9.370945,9.3766913 0 0 0 -2.74468,-6.63032 z m 20.35576,0 a 9.3709443,9.3766906 0 0 0 -2.74467,6.63032 h 8.08832 a 1.2827056,1.2834922 0 0 1 0.37624,-0.90742 z m 219.779643,0 -5.719896,5.7229 a 1.2827056,1.2834922 0 0 1 0.376248,0.90742 h 8.088315 a 9.3709443,9.3766906 0 0 0 -2.744667,-6.63032 z m 20.356267,0 a 9.370945,9.3766913 0 0 0 -2.74519,6.63032 h 8.08832 a 1.2827057,1.2834923 0 0 1 0.37625,-0.90742 z m -337.07456,17.33033 -3.17153,3.17346 25.78784,25.80366 v 81.882148 c 0,0.732823 0.5896,1.322791 1.32197,1.322791 h 10.84067 c 0.73237,0 1.32197,-0.589968 1.32197,-1.322791 v -81.882148 l 25.49492,-25.51055 4.59677,4.6001 v 20.90379 h -25.44738 a 4.6080173,4.610843 0 0 1 -1.35162,3.25839 l 20.54797,20.56056 a 33.66437,33.685013 0 0 0 6.25103,-8.70403 v 10.03092 l -2.49622,2.49776 2.49622,2.49775 v 52.281484 c 0,0.203988 0.1642,0.367784 0.36807,0.367784 h 3.01766 c 0.20387,0 0.36807,-0.163796 0.36807,-0.367784 v -48.525384 l 15.01516,15.02437 v 33.689253 c 0,0.09959 0.16421,0.179545 0.36808,0.179545 h 3.01766 c 0.20386,0 0.36807,-0.07994 0.36807,-0.179545 v -29.933154 l 0.76884,0.769327 v 29.118302 c 0,0.35779 0.58961,0.646051 1.32198,0.646051 h 10.84015 c 0.73238,0 1.32198,-0.288261 1.32198,-0.646051 v -29.117793 l 0.60681,-0.607173 v 29.582252 c 0,0.203988 0.1642,0.367784 0.36807,0.367784 h 3.01765 c 0.20386,0 0.36807,-0.163796 0.36807,-0.367784 v -33.338344 l 20.029602,-20.04189 v 53.369492 c 0,0.387184 0.311363,0.69925 0.698308,0.69925 h 5.727564 c 0.386945,0 0.698308,-0.312066 0.698308,-0.69925 v -60.006982 l 18.162671,-18.17381 4.265003,4.26761 v 73.389898 c 0,0.732823 0.589604,1.322791 1.321981,1.322791 h 10.840142 c 0.193114,0 0.375281,-0.0433 0.540348,-0.11714 0.285851,-0.04272 0.493824,-0.170305 0.493824,-0.324304 v -0.06445 c 0.177717,-0.225201 0.28781,-0.50639 0.28781,-0.816897 v -67.602038 l 13.337392,-13.34557 -1.675737,-1.67677 h -10.919382 l 9.66999,-9.6759 a 17.786314,17.797221 0 0 0 4.908612,9.33216 l 10.856502,-10.86316 a 2.4346109,2.4361038 0 0 1 -0.714156,-1.72178 h -11.800189 l 7.125201,-7.12957 7.128782,7.13366 v 96.072251 c 0,0.387185 0.311878,0.699251 0.69882,0.699251 h 5.727053 c 0.386946,0 0.698308,-0.312066 0.698308,-0.699251 v -96.072251 l 1.393038,-1.39388 1.392528,1.39337 v 96.072761 c 0,0.387185 0.311362,0.699251 0.698308,0.699251 h 5.7275644 c 0.3869411,0 0.6983086,-0.312066 0.6983086,-0.699251 v -96.072251 l 7.1287817,-7.13366 7.1252033,7.12957 H -2.2089024 a 2.4346109,2.4361038 0 0 1 -0.7141561,1.72178 l 10.856503,10.86316 a 17.786314,17.797221 0 0 0 4.9086105,-9.33216 l 9.66999,9.6759 H 11.592664 l -1.675737,1.67677 13.337391,13.34557 v 67.602038 c 0,0.310507 0.110093,0.591696 0.287809,0.816897 v 0.06445 c 0,0.153999 0.207975,0.281579 0.493826,0.324304 0.165067,0.07385 0.347234,0.11714 0.540348,0.11714 h 10.840142 c 0.732377,0 1.321981,-0.589968 1.321981,-1.322791 v -73.390408 l 4.265,-4.2671 18.162674,18.17381 v 60.006982 c 0,0.387184 0.311363,0.69925 0.698308,0.69925 h 5.727564 c 0.386945,0 0.698308,-0.312066 0.698308,-0.69925 v -53.369492 l 20.029601,20.04189 v 33.338344 c 0,0.203988 0.164205,0.367784 0.368069,0.367784 h 3.017657 c 0.203867,0 0.368068,-0.163796 0.368068,-0.367784 v -29.582252 l 0.606803,0.607173 v 29.117793 c 0,0.35779 0.589607,0.646051 1.321981,0.646051 h 10.840153 c 0.73237,0 1.32198,-0.288261 1.32198,-0.646051 v -29.118302 l 0.76884,-0.769327 v 29.933154 c 0,0.0996 0.16421,0.179545 0.36807,0.179545 h 3.01766 c 0.20387,0 0.36808,-0.07995 0.36808,-0.179545 v -33.689253 l 15.01516,-15.02437 v 48.525384 c 0,0.203988 0.1642,0.367784 0.36807,0.367784 h 3.01766 c 0.20387,0 0.36807,-0.163796 0.36807,-0.367784 v -52.281484 l 2.49622,-2.49775 -2.49622,-2.49776 v -10.03092 a 33.66437,33.685013 0 0 0 6.25103,8.70403 l 20.54797,-20.56056 a 4.6080173,4.610843 0 0 1 -1.35162,-3.25839 H 127.4562 v -20.90379 l 4.59677,-4.6001 25.49543,25.51105 v 81.881648 c 0,0.732823 0.58909,1.322791 1.32146,1.322791 h 10.84067 c 0.73237,0 1.32197,-0.589968 1.32197,-1.322791 v -81.882148 l 25.78784,-25.80366 -3.17153,-3.17346 h -58.71723 l -0.58994,0.59028 -0.58993,-0.59028 h -16.34483 l -0.88285,0.88338 7.17837,7.18277 v 45.37442 h -15.01516 v -30.49838 l 7.17837,-7.18277 -0.88286,-0.88338 H 98.637924 l -0.882854,0.88338 7.17836,7.18227 v 30.49888 H 90.073673 v -45.3739 l 7.178369,-7.18329 -0.882854,-0.88338 H 80.024366 l -0.882854,0.88338 7.178367,7.18277 v 45.37442 H 68.063656 l -1.773378,1.77448 v -10.08821 a 33.66437,33.685013 0 0 0 4.148957,-16.15638 h -4.148957 v -13.66016 l 13.6252,-13.63355 -1.675735,-1.67675 H 59.354735 7.2862562 -2.62298 -26.996818 -73.575956 -104.59906 l -1.67573,1.67675 13.625192,13.63355 v 13.66016 h -4.148957 a 33.66437,33.685013 0 0 0 4.148957,16.15536 v 10.08923 l -1.773378,-1.77448 H -112.6792 v -45.3739 l 7.17837,-7.18329 -0.88286,-0.88338 h -16.34481 l -0.88286,0.88338 7.17837,7.18277 v 45.37442 h -14.85976 v -30.49838 l 7.17836,-7.18277 -0.88285,-0.88338 h -16.34483 l -0.88286,0.88338 7.17837,7.18227 v 30.49888 h -15.01516 v -45.37442 l 7.17837,-7.18277 -0.88285,-0.88338 h -16.34483 l -0.58993,0.59028 -0.58994,-0.59028 z m 71.23925,8.06462 a 1.2827057,1.2834923 0 0 1 -0.37625,0.90693 l 5.71989,5.7234 a 9.370945,9.3766913 0 0 0 2.74468,-6.63033 z m 22.95473,0 a 9.3709443,9.3766906 0 0 0 2.74467,6.63033 l 5.71989,-5.7234 a 1.2827056,1.2834922 0 0 1 -0.37624,-0.90693 z m 217.180665,0 a 1.2827056,1.2834922 0 0 1 -0.376248,0.90693 l 5.719896,5.7234 a 9.3709443,9.3766906 0 0 0 2.744667,-6.63033 z m 22.954725,0 a 9.370945,9.3766913 0 0 0 2.74519,6.63033 l 5.71938,-5.7234 a 1.2827057,1.2834923 0 0 1 -0.37625,-0.90693 z m -195.462035,2.85838 4.380532,4.38321 h -6.311361 a 2.434611,2.4361039 0 0 1 -0.714157,1.72178 l 10.856503,10.86316 a 17.786314,17.797221 0 0 0 3.571803,-5.1776 l 5.517968,5.52134 h -5.135075 l -0.735114,0.73557 h -15.815722 v -13.66016 z m 135.92227,0 4.384623,4.3873 v 13.66016 H 43.350889 l -0.735117,-0.73557 h -5.135585 l 5.517968,-5.52134 a 17.786314,17.797221 0 0 0 3.571803,5.1776 l 10.856503,-10.86316 a 2.434611,2.4361039 0 0 1 -0.714157,-1.72178 h -6.311361 z"
       id="rect840"
       inkscape:connector-curvature="0" />
  </g>
</svg>
