<?xml version="1.0" encoding="UTF-8" standalone="no"?>
<!-- Created with Inkscape (http://www.inkscape.org/) -->

<svg
   xmlns:dc="http://purl.org/dc/elements/1.1/"
   xmlns:cc="http://creativecommons.org/ns#"
   xmlns:rdf="http://www.w3.org/1999/02/22-rdf-syntax-ns#"
   xmlns:svg="http://www.w3.org/2000/svg"
   xmlns="http://www.w3.org/2000/svg"
   xmlns:xlink="http://www.w3.org/1999/xlink"
   xmlns:sodipodi="http://sodipodi.sourceforge.net/DTD/sodipodi-0.dtd"
   xmlns:inkscape="http://www.inkscape.org/namespaces/inkscape"
   width="64"
   height="64"
   viewBox="0 0 16.933333 16.933334"
   version="1.1"
   id="svg8"
   inkscape:version="0.92.5 (2060ec1f9f, 2020-04-08)"
   sodipodi:docname="plasmatrix.svg">
  <defs
     id="defs2" />
  <sodipodi:namedview
     id="base"
     pagecolor="#808080"
     bordercolor="#666666"
     borderopacity="1.0"
     inkscape:pageopacity="0"
     inkscape:pageshadow="2"
     inkscape:zoom="1"
     inkscape:cx="62.595867"
     inkscape:cy="52.011483"
     inkscape:document-units="px"
     inkscape:current-layer="layer1"
     showgrid="true"
     units="px"
     inkscape:snap-bbox="false"
     inkscape:bbox-nodes="false"
     inkscape:snap-page="true"
     inkscape:snap-bbox-midpoints="true"
     inkscape:snap-center="true"
     inkscape:window-width="1920"
     inkscape:window-height="1061"
     inkscape:window-x="0"
     inkscape:window-y="0"
     inkscape:window-maximized="1">
    <inkscape:grid
       type="xygrid"
       id="grid817"
       empspacing="8"
       originx="0.13229167"
       originy="0.13229167" />
  </sodipodi:namedview>
  <metadata
     id="metadata5">
    <rdf:RDF>
      <cc:Work
         rdf:about="">
        <dc:format>image/svg+xml</dc:format>
        <dc:type
           rdf:resource="http://purl.org/dc/dcmitype/StillImage" />
        <dc:title></dc:title>
      </cc:Work>
    </rdf:RDF>
  </metadata>
  <g
     inkscape:label="Layer 1"
     inkscape:groupmode="layer"
     id="layer1"
     transform="translate(0,-280.06665)">
    <path
       id="path1015"
       style="fill:none;stroke:#ec0000;stroke-width:0.26458335;stroke-linecap:square;stroke-linejoin:miter;stroke-opacity:1;font-variant-east_asian:normal;opacity:1;vector-effect:none;fill-opacity:1;stroke-miterlimit:4;stroke-dasharray:none;stroke-dashoffset:0"
       d="M 0.13229161,296.33853 H 4.365625 M 0.13229167,295.80936 H 7.5406251 m -7.40833343,1.05833 H 8.5989584" />
    <path
       style="fill:none;stroke:#ec0000;stroke-width:0.26458335;stroke-linecap:square;stroke-linejoin:miter;stroke-opacity:1;font-variant-east_asian:normal;opacity:0.297;vector-effect:none;fill-opacity:1;stroke-miterlimit:4;stroke-dasharray:none;stroke-dashoffset:0"
       d="M 0.66145835,296.60311 H 1.4552084 m 1.0583333,0 h 0.5291667 m 0.79375,0 h 0.2645833 m 1.8520834,0 h 1.3229166 m -3.175,-0.52917 h 0.5291667 m 0.79375,-0.52916 h 0.5291667 m -4.7625001,0 h 0.5291667"
       id="path1046"
       inkscape:connector-curvature="0" />
    <path
       style="fill:none;stroke:#0110ff;stroke-width:0.26458335px;stroke-linecap:square;stroke-linejoin:miter;stroke-opacity:0.27860695"
       d="m 2.2489584,280.19894 v 7.14375"
       id="path880"
       inkscape:connector-curvature="0" />
    <path
       style="fill:none;stroke:#0110ff;stroke-width:0.26458335px;stroke-linecap:square;stroke-linejoin:miter;stroke-opacity:0.27860695"
       d="m 6.4822918,280.19894 v 5.02709"
       id="path884"
       inkscape:connector-curvature="0" />
    <path
       style="fill:none;stroke:#0110ff;stroke-width:0.26458335px;stroke-linecap:square;stroke-linejoin:miter;stroke-opacity:0.27860695"
       d="m 8.5989586,280.19894 v 6.61459"
       id="path886"
       inkscape:connector-curvature="0" />
    <path
       style="fill:none;stroke:#1600f1;stroke-width:0.26458334;stroke-linecap:square;stroke-linejoin:miter;stroke-opacity:1;stroke-miterlimit:4;stroke-dasharray:none"
       d="m 0.13229167,280.19894 v 16.66875"
       id="path876"
       inkscape:connector-curvature="0" />
    <path
       style="fill:none;stroke:#ec0000;stroke-width:0.26458334;stroke-linecap:square;stroke-linejoin:miter;stroke-opacity:1;stroke-miterlimit:4;stroke-dasharray:none"
       d="M 0.13229167,280.19894 H 16.801042"
       id="path874"
       inkscape:connector-curvature="0" />
    <path
       style="fill:none;stroke:#00fe1e;stroke-width:0.26458335px;stroke-linecap:square;stroke-linejoin:miter;stroke-opacity:1;font-variant-east_asian:normal;opacity:1;vector-effect:none;fill-opacity:1;stroke-miterlimit:4;stroke-dasharray:none;stroke-dashoffset:0"
       d="m 0.13229167,280.19894 2.11666673,2.11667"
       id="path878"
       inkscape:connector-curvature="0" />
    <rect
       style="opacity:1;vector-effect:none;fill:#ffffff;fill-opacity:1;stroke:none;stroke-width:0.22225514;stroke-linecap:round;stroke-linejoin:round;stroke-miterlimit:5;stroke-dasharray:none;stroke-dashoffset:0;stroke-opacity:0.50196078"
       id="rect819"
       width="0.26458335"
       height="0.26458335"
       x="-4.6139528e-09"
       y="280.06665" />
    <circle
       style="opacity:1;vector-effect:none;fill:#000000;fill-opacity:1;stroke:none;stroke-width:0.22225514;stroke-linecap:round;stroke-linejoin:round;stroke-miterlimit:5;stroke-dasharray:none;stroke-dashoffset:0;stroke-opacity:0.50196078"
       id="path821"
       cx="16.801043"
       cy="296.86771"
       r="2.1166668" />
    <path
       style="fill:none;stroke:#fcfcfc;stroke-width:0.26458335px;stroke-linecap:butt;stroke-linejoin:miter;stroke-opacity:1"
       d="m 16.801042,294.75103 v 1.05833"
       id="path823"
       inkscape:connector-curvature="0"
       inkscape:transform-center-y="-1.5874969" />
    <path
       inkscape:transform-center-y="-1.8531252e-06"
       inkscape:connector-curvature="0"
       id="path825"
       d="m 14.68438,296.86769 h 1.05833"
       style="fill:none;stroke:#fcfcfc;stroke-width:0.26458335px;stroke-linecap:butt;stroke-linejoin:miter;stroke-opacity:1"
       inkscape:transform-center-x="1.587497" />
    <path
       inkscape:transform-center-x="1.1225285"
       style="fill:none;stroke:#fefefe;stroke-width:0.26458335px;stroke-linecap:butt;stroke-linejoin:miter;stroke-opacity:0.32338309"
       d="m 15.304337,295.37098 0.748353,0.74836"
       id="path827"
       inkscape:connector-curvature="0"
       inkscape:transform-center-y="-1.1225319" />
    <path
       style="fill:none;stroke:#fefefe;stroke-width:0.26458335px;stroke-linecap:butt;stroke-linejoin:miter;stroke-opacity:0.32338309"
       d="m 15.478125,295.28019 h 1.058334"
       id="path829"
       inkscape:connector-curvature="0"
       inkscape:transform-center-x="-0.79375021"
       inkscape:transform-center-y="-1.814375e-06" />
    <path
       inkscape:transform-center-y="0.79375321"
       inkscape:transform-center-x="-2.1865626e-06"
       inkscape:connector-curvature="0"
       id="path831"
       d="m 15.213544,295.54478 v 1.05833"
       style="fill:none;stroke:#fefefe;stroke-width:0.26458335px;stroke-linecap:butt;stroke-linejoin:miter;stroke-opacity:0.32338309" />
    <path
       style="fill:none;stroke:#fef200;stroke-width:0.26499999;stroke-linecap:square;stroke-linejoin:miter;stroke-miterlimit:4;stroke-dasharray:none;stroke-opacity:0.53731348"
       d="m 14.948958,296.86769 h 1.852084 v -1.85208"
       id="path833"
       inkscape:connector-curvature="0"
       sodipodi:nodetypes="ccc" />
    <use
       x="0"
       y="0"
       xlink:href="#path833"
       id="use839"
       transform="translate(-2.1166667)"
       width="100%"
       height="100%" />
    <use
       height="100%"
       width="100%"
       transform="translate(6.6593752e-7,-2.1166718)"
       id="use841"
       xlink:href="#path833"
       y="0"
       x="0" />
    <g
       id="g849"
       style="opacity:0.366">
      <path
         inkscape:connector-curvature="0"
         id="path843"
         d="m 13.096875,296.60311 1.322917,-1.32292 v 1.32292 z"
         style="fill:#0136ff;stroke:#f60000;stroke-width:0.26458335px;stroke-linecap:butt;stroke-linejoin:miter;stroke-opacity:1;fill-opacity:1" />
      <circle
         r="0.26458335"
         cy="296.33853"
         cx="14.155209"
         id="path845"
         style="opacity:1;vector-effect:none;fill:#01ff27;fill-opacity:1;stroke:none;stroke-width:0.26499999;stroke-linecap:square;stroke-linejoin:round;stroke-miterlimit:4;stroke-dasharray:none;stroke-dashoffset:0;stroke-opacity:1" />
    </g>
    <use
       x="0"
       y="0"
       xlink:href="#g849"
       id="use851"
       transform="translate(2.1166665,-1.5059376e-6)"
       width="100%"
       height="100%" />
    <use
       height="100%"
       width="100%"
       transform="translate(2.1166665,-2.1166682)"
       id="use853"
       xlink:href="#g849"
       y="0"
       x="0" />
    <path
       style="fill:none;stroke:#ec0000;stroke-width:0.26458335;stroke-linecap:square;stroke-linejoin:miter;stroke-opacity:1;font-variant-east_asian:normal;opacity:1;vector-effect:none;fill-opacity:1;stroke-miterlimit:4;stroke-dasharray:none;stroke-dashoffset:0"
       d="m 1.4552084,280.19894 v 2.11667"
       id="path888"
       inkscape:connector-curvature="0" />
    <circle
       style="opacity:0.36600001;vector-effect:none;fill:none;fill-opacity:1;stroke:#ff0101;stroke-width:0.26458335;stroke-linecap:square;stroke-linejoin:round;stroke-miterlimit:4;stroke-dasharray:none;stroke-dashoffset:0;stroke-opacity:0.54726368"
       id="path890"
       cx="1.4552084"
       cy="282.31561"
       r="0.79375005" />
    <path
       inkscape:connector-curvature="0"
       id="path906"
       d="m 5.4239584,280.19893 v 2.64584"
       style="opacity:1;vector-effect:none;fill:none;fill-opacity:1;stroke:#ec0000;stroke-width:0.26458335;stroke-linecap:square;stroke-linejoin:miter;stroke-miterlimit:4;stroke-dasharray:none;stroke-dashoffset:0;stroke-opacity:1" />
    <circle
       r="0.79375005"
       cy="282.5802"
       cx="5.4239583"
       id="circle908"
       style="opacity:0.36600001;vector-effect:none;fill:none;fill-opacity:1;stroke:#ff0101;stroke-width:0.26458335;stroke-linecap:square;stroke-linejoin:round;stroke-miterlimit:4;stroke-dasharray:none;stroke-dashoffset:0;stroke-opacity:0.54726371" />
    <path
       style="opacity:1;vector-effect:none;fill:none;fill-opacity:1;stroke:#ec0000;stroke-width:0.26458335;stroke-linecap:square;stroke-linejoin:miter;stroke-miterlimit:4;stroke-dasharray:none;stroke-dashoffset:0;stroke-opacity:1"
       d="m 7.2760417,280.19894 v 2.11667"
       id="path910"
       inkscape:connector-curvature="0" />
    <circle
       style="opacity:0.36600001;vector-effect:none;fill:none;fill-opacity:1;stroke:#ff0101;stroke-width:0.26458334;stroke-linecap:square;stroke-linejoin:round;stroke-miterlimit:4;stroke-dasharray:none;stroke-dashoffset:0;stroke-opacity:0.54726371"
       id="circle912"
       cx="7.2760415"
       cy="282.31561"
       r="0.54318488" />
    <path
       style="fill:none;stroke:#ec0000;stroke-width:0.26458335;stroke-linecap:square;stroke-linejoin:miter;stroke-opacity:1;font-variant-east_asian:normal;opacity:1;vector-effect:none;fill-opacity:1;stroke-miterlimit:4;stroke-dasharray:none;stroke-dashoffset:0"
       d="M 5.1593751,282.31561 H 5.6885418"
       id="path930"
       inkscape:connector-curvature="0" />
    <path
       id="path948"
       style="opacity:1;vector-effect:none;fill:none;fill-opacity:1;stroke:#1600f1;stroke-width:0.26458335;stroke-linecap:square;stroke-linejoin:miter;stroke-miterlimit:4;stroke-dasharray:none;stroke-dashoffset:0;stroke-opacity:1"
       d="m 1.190625,284.43228 v -0.52917 h 0.5291667 m -1.32291669,0.52917 1.32291669,1.32291 m -1.32291669,0.79375 0.26458333,0.26459 m -0.26458333,0.79375 2.38124999,2.38125 m -2.38124999,-6.87917 3.43958339,3.43958"
       inkscape:connector-curvature="0"
       sodipodi:nodetypes="ccccccccccc" />
    <path
       id="path882"
       style="fill:none;stroke:#0110ff;stroke-width:0.26458335px;stroke-linecap:square;stroke-linejoin:miter;stroke-opacity:0.27860695"
       d="m 4.3656251,280.19894 v 8.73125 M 1.984375,280.19894 v 0.26459 m 0.5291667,-0.26459 v 0.52917 m 1.5875,-0.52917 v 0.26459 m 0.5291667,-0.26459 v 0.79375 m 1.5875,-0.79375 v 0.52917 m 0.5291667,-0.52917 v 0.26459 m 1.5875,-0.26459 v 0.52917 m 0.5291667,-0.52917 v 0.52917" />
    <path
       style="fill:none;stroke:#00fe1e;stroke-width:0.26458335px;stroke-linecap:square;stroke-linejoin:miter;stroke-opacity:1;font-variant-east_asian:normal;opacity:1;vector-effect:none;fill-opacity:1;stroke-miterlimit:4;stroke-dasharray:none;stroke-dashoffset:0"
       d="m 1.190625,284.16769 v 0.26459"
       id="path1056"
       inkscape:connector-curvature="0" />
    <path
       style="fill:none;stroke:#ec0000;stroke-width:0.26458335;stroke-linecap:square;stroke-linejoin:miter;stroke-opacity:1;font-variant-east_asian:normal;opacity:1;vector-effect:none;fill-opacity:1;stroke-miterlimit:4;stroke-dasharray:none;stroke-dashoffset:0"
       d="m 5.1593751,282.84478 v 0.52916 m 0.5291666,-0.52916 v 1.05833"
       id="path1086"
       inkscape:connector-curvature="0" />
  </g>
</svg>
