<?xml version="1.0" encoding="UTF-8" standalone="no"?>
<!-- Created with Inkscape (http://www.inkscape.org/) -->

<svg
   xmlns:dc="http://purl.org/dc/elements/1.1/"
   xmlns:cc="http://creativecommons.org/ns#"
   xmlns:rdf="http://www.w3.org/1999/02/22-rdf-syntax-ns#"
   xmlns:svg="http://www.w3.org/2000/svg"
   xmlns="http://www.w3.org/2000/svg"
   xmlns:sodipodi="http://sodipodi.sourceforge.net/DTD/sodipodi-0.dtd"
   xmlns:inkscape="http://www.inkscape.org/namespaces/inkscape"
   width="128"
   height="128"
   viewBox="0 0 33.866666 33.866668"
   version="1.1"
   id="svg8"
   sodipodi:docname="icon.svg"
   inkscape:version="0.92.5 (2060ec1f9f, 2020-04-08)">
  <defs
     id="defs2" />
  <sodipodi:namedview
     id="base"
     pagecolor="#ffffff"
     bordercolor="#666666"
     borderopacity="1.0"
     inkscape:pageopacity="0.0"
     inkscape:pageshadow="2"
     inkscape:zoom="2.8"
     inkscape:cx="96.217568"
     inkscape:cy="67.041332"
     inkscape:document-units="px"
     inkscape:current-layer="layer1"
     showgrid="false"
     inkscape:snap-global="false"
     units="px"
     inkscape:snap-page="true"
     inkscape:snap-bbox="true"
     inkscape:bbox-nodes="true"
     inkscape:window-width="1920"
     inkscape:window-height="1061"
     inkscape:window-x="0"
     inkscape:window-y="0"
     inkscape:window-maximized="1" />
  <metadata
     id="metadata5">
    <rdf:RDF>
      <cc:Work
         rdf:about="">
        <dc:format>image/svg+xml</dc:format>
        <dc:type
           rdf:resource="http://purl.org/dc/dcmitype/StillImage" />
        <dc:title></dc:title>
      </cc:Work>
    </rdf:RDF>
  </metadata>
  <g
     inkscape:label="Layer 1"
     inkscape:groupmode="layer"
     id="layer1"
     transform="translate(0,-263.13332)">
    <circle
       style="opacity:1;vector-effect:none;fill:none;fill-opacity:0.18085106;stroke:none;stroke-width:2.05977011;stroke-linecap:butt;stroke-linejoin:miter;stroke-miterlimit:4;stroke-dasharray:none;stroke-dashoffset:0;stroke-opacity:1"
       id="path1087"
       cx="16.082888"
       cy="280.53912"
       r="20.372917" />
    <g
       id="g1085"
       transform="matrix(0.25091749,0.04325802,-0.039418,0.27536136,84.752362,272.44432)"
       style="stroke:#000000;stroke-width:2.16317868;stroke-miterlimit:4;stroke-dasharray:none;stroke-opacity:1">
      <path
         inkscape:connector-curvature="0"
         id="path826"
         d="m -296.28711,21.603516 c -3.76399,1.032259 -2.77728,6.002129 -1.37305,8.599609 2.33101,4.309258 8.07464,2.973964 12.07942,3.601884 4.34575,-0.03431 8.64891,0.183406 12.73504,1.605147 2.75613,-0.234994 3.36333,-4.532039 0.70505,-5.461279 -7.25036,-4.373156 -15.56855,-6.911998 -23.85544,-8.353174 z"
         style="fill:#ec0000;fill-opacity:1;stroke:#000000;stroke-width:2.16317868;stroke-linecap:butt;stroke-linejoin:miter;stroke-miterlimit:4;stroke-dasharray:none;stroke-opacity:1" />
      <path
         inkscape:connector-curvature="0"
         id="path828"
         d="m -271.48828,31.066406 c -1.87654,-0.04133 -4.17381,2.54267 -2.05274,3.888672 4.55871,3.005639 6.78054,8.550237 11.73047,11.138672 6.43168,4.160777 13.93759,7.037727 21.45899,8.058594 2.46193,-1.023878 1.45134,-5.004652 -1.03864,-5.209236 -9.83538,-6.032803 -18.44919,-14.80979 -29.8266,-17.882561 z"
         style="opacity:1;vector-effect:none;fill:#ec0000;fill-opacity:1;stroke:#000000;stroke-width:2.16317868;stroke-linecap:butt;stroke-linejoin:miter;stroke-miterlimit:4;stroke-dasharray:none;stroke-dashoffset:0;stroke-opacity:1" />
      <path
         inkscape:connector-curvature="0"
         id="path844"
         d="m -299.10742,22.546875 c -6.44501,1.330097 -12.44869,4.49871 -18.02735,7.757813 -1.05781,2.008837 0.44827,4.501106 0.20899,6.376953 2.08493,1.666074 3.49376,-1.888122 5.08203,-2.572266 4.73216,-1.895485 10.26492,-1.618151 14.74219,-4.224609 1.5757,-1.492773 1.89531,-4.160745 1.35156,-6.171875 -0.60533,-1.251043 -2.2081,-1.095178 -3.35742,-1.166016 z"
         style="opacity:1;vector-effect:none;fill:#ec0000;fill-opacity:1;stroke:#000000;stroke-width:2.16317868;stroke-linecap:butt;stroke-linejoin:miter;stroke-miterlimit:4;stroke-dasharray:none;stroke-dashoffset:0;stroke-opacity:1" />
      <path
         inkscape:connector-curvature="0"
         id="path851"
         d="m -316.23047,29.875 c -5.00658,0.681414 -9.71543,3.245569 -14.71094,3.476562 -1.9292,2.091535 1.23171,4.380979 0.79297,6.669922 0.5133,2.344555 4.19246,1.757631 3.92774,-0.625 1.2131,-3.545631 5.64445,-4.148378 8.80273,-4.791015 1.31049,0.502991 3.08835,0.570245 2.85742,-1.332031 -0.31624,-1.154471 -0.86097,-2.979528 -1.66992,-3.398438 z"
         style="opacity:1;vector-effect:none;fill:#ec0000;fill-opacity:1;stroke:#000000;stroke-width:2.16317868;stroke-linecap:butt;stroke-linejoin:miter;stroke-miterlimit:4;stroke-dasharray:none;stroke-dashoffset:0;stroke-opacity:1" />
      <path
         inkscape:connector-curvature="0"
         id="path864"
         d="m -282.89648,45.724609 c -4.8264,0.615905 -10.638,-0.221058 -14.72852,2.785157 -1.81553,3.532874 0.70097,8.123549 3.9375,9.738281 5.00603,0.47252 9.31247,-2.92035 13.891,-4.411036 2.21364,-1.270808 4.86282,-1.257658 7.18908,-1.72373 2.44669,-1.536017 1.33574,-5.823057 -1.625,-5.853515 -2.83467,-0.670687 -5.77394,-0.557848 -8.66406,-0.535157 z"
         style="fill:#ec0000;fill-opacity:1;stroke:#000000;stroke-width:2.16317868;stroke-linecap:butt;stroke-linejoin:miter;stroke-miterlimit:4;stroke-dasharray:none;stroke-opacity:1" />
      <path
         inkscape:connector-curvature="0"
         id="path866"
         d="m -271.09766,46.830078 c -2.32996,-0.136297 -5.34778,3.507516 -2.65429,4.97461 3.98133,0.900441 6.34809,4.622928 10.23633,5.835937 7.23166,3.025177 15.38928,2.464253 22.89062,1.195313 3.02524,-1.0531 1.52622,-6.225095 -1.625,-5.230469 -9.50817,-2.561676 -18.81122,-6.815305 -28.84766,-6.775391 z"
         style="opacity:1;vector-effect:none;fill:#ec0000;fill-opacity:1;stroke:#000000;stroke-width:2.16317868;stroke-linecap:butt;stroke-linejoin:miter;stroke-miterlimit:4;stroke-dasharray:none;stroke-dashoffset:0;stroke-opacity:1" />
      <path
         inkscape:connector-curvature="0"
         id="path868"
         d="m -296.85156,49.220703 c -5.34658,1.245735 -7.96339,6.768969 -11.52758,10.411127 -2.10525,2.387128 -5.69891,5.53174 -3.30055,8.918951 0.63236,1.285572 0.71771,4.076405 2.67969,2.798828 1.66649,-1.95668 1.64498,-4.992149 4.16797,-6.392578 3.45425,-3.207408 8.76248,-5.276081 10.26953,-10.091797 -0.11177,-1.787075 0.10637,-4.146386 -1.30664,-5.464843 -0.29479,-0.164962 -0.64984,-0.220785 -0.98242,-0.179688 z"
         style="opacity:1;vector-effect:none;fill:#ec0000;fill-opacity:1;stroke:#000000;stroke-width:2.16317868;stroke-linecap:butt;stroke-linejoin:miter;stroke-miterlimit:4;stroke-dasharray:none;stroke-dashoffset:0;stroke-opacity:1" />
      <path
         inkscape:connector-curvature="0"
         id="path870"
         d="m -311.83398,64.542969 c -4.31885,2.512288 -7.31276,7.183259 -11.78321,9.458984 -0.91682,2.626524 2.36442,4.168139 2.68164,6.570313 1.52924,1.982338 4.21396,-0.45302 3.22852,-2.433594 0.004,-3.908054 3.80728,-6.526094 6.4375,-8.710938 1.74905,0.416364 3.00629,-1.433004 1.59765,-2.771484 -0.48787,-0.840423 -1.00662,-2.124077 -2.1621,-2.113281 z"
         style="opacity:1;vector-effect:none;fill:#ec0000;fill-opacity:1;stroke:#000000;stroke-width:2.16317868;stroke-linecap:butt;stroke-linejoin:miter;stroke-miterlimit:4;stroke-dasharray:none;stroke-dashoffset:0;stroke-opacity:1" />
      <path
         inkscape:connector-curvature="0"
         id="path876"
         d="m -240.55664,58.175781 c -3.97072,1.970865 -9.14272,1.440321 -13.59058,2.142586 -5.01864,0.696892 -10.27365,1.587701 -14.60083,4.333977 -1.60784,1.185258 -3.12837,5.037993 -0.25,5.583984 3.80224,-0.410068 7.3531,1.946788 11.26172,1.666016 7.41269,-0.38201 14.13516,-4.597406 19.66602,-9.19336 1.01559,-1.94632 -0.62536,-4.009317 -2.17969,-5.078125 l -0.25951,0.461165 z"
         style="opacity:1;vector-effect:none;fill:#ec0000;fill-opacity:1;stroke:#000000;stroke-width:2.16317868;stroke-linecap:butt;stroke-linejoin:miter;stroke-miterlimit:4;stroke-dasharray:none;stroke-dashoffset:0;stroke-opacity:1" />
      <path
         inkscape:connector-curvature="0"
         id="path945"
         d="m -241.48575,44.485651 c 6.24539,-1.682249 16.19898,-4.065436 20.10234,-1.962623 3.90337,2.10281 17.76033,14.439304 13.66179,17.663613 -4.09853,3.224311 -32.78829,6.308434 -32.39796,2.663561 0.39034,-3.644872 -5.07437,-15.981364 -1.36617,-18.364551 z"
         style="opacity:1;vector-effect:none;fill:#ec0000;fill-opacity:1;stroke:#000000;stroke-width:2.16317868;stroke-linecap:butt;stroke-linejoin:miter;stroke-miterlimit:4;stroke-dasharray:none;stroke-dashoffset:0;stroke-opacity:1" />
      <path
         inkscape:connector-curvature="0"
         id="path884"
         d="m -235.07283,56.985119 c 6.99256,-3.02381 27.40327,-1.889882 31.93899,1.700892 4.53571,3.590774 9.07142,10.016368 10.77232,13.229166 1.70089,3.212799 -2.07887,9.260417 -2.64584,14.363097 -0.56696,5.102677 3.59078,7.370535 3.59078,11.717261 0,4.346725 -3.59078,7.370535 -5.48066,7.937505 -1.88988,0.56696 -3.40178,-2.26786 -2.83482,-3.77976 0.56697,-1.51191 -1.88988,-3.59078 -1.88988,-4.72471 0,-1.133928 0.18899,-2.645834 0,-3.779761 -0.18899,-1.13393 -7.55952,-3.779763 -9.07143,-1.889882 -1.5119,1.889882 1.32292,9.827383 2.07887,10.961313 0.75595,1.13393 0.37798,4.34672 0.37798,4.34672 0,0 -7.18155,0.56697 -10.20536,-2.45684 -3.02381,-3.02381 -5.10268,-8.315478 -5.48066,-9.260419 -0.37797,-0.94494 -6.2366,-2.078868 -8.69345,-2.645833 -2.45684,-0.566965 -10.58333,-11.717261 -10.01637,-20.599701 0.56697,-8.882441 7.55953,-15.119048 7.55953,-15.119048 z"
         style="opacity:1;vector-effect:none;fill:#ec0000;fill-opacity:1;stroke:#000000;stroke-width:2.16317868;stroke-linecap:butt;stroke-linejoin:miter;stroke-miterlimit:4;stroke-dasharray:none;stroke-dashoffset:0;stroke-opacity:1" />
      <path
         inkscape:connector-curvature="0"
         id="path929"
         d="m -224.73633,73.052734 c -2.34804,0.621135 -3.24591,3.701909 -5.14175,5.170418 -3.2399,3.820444 -7.07091,7.608075 -8.96958,12.237786 0.8138,2.346301 2.77084,5.243859 5.42578,5.365234 2.79978,-0.843741 3.45394,-4.427093 5.17496,-6.362912 2.42131,-4.410239 7.16605,-8.55723 6.68247,-13.982791 -0.39892,-1.367061 -1.69929,-2.514243 -3.17188,-2.427735 z"
         style="opacity:1;vector-effect:none;fill:#ec0000;fill-opacity:1;stroke:#000000;stroke-width:2.16317868;stroke-linecap:butt;stroke-linejoin:miter;stroke-miterlimit:4;stroke-dasharray:none;stroke-dashoffset:0;stroke-opacity:1" />
      <path
         inkscape:connector-curvature="0"
         id="path931"
         d="m -235.52344,89.4375 c -6.99688,1.249584 -14.59813,0.726151 -21.16406,3.554688 -1.01112,2.268136 -1.56256,5.721137 0.29297,7.623042 2.62895,1.29391 5.49522,-0.857595 8.14723,-1.113044 4.71818,-1.544258 11.07782,-1.341859 14.41918,-5.633045 0.85344,-1.578321 0.20882,-4.078618 -1.69532,-4.431641 z"
         style="opacity:1;vector-effect:none;fill:#ec0000;fill-opacity:1;stroke:#000000;stroke-width:2.16317868;stroke-linecap:butt;stroke-linejoin:miter;stroke-miterlimit:4;stroke-dasharray:none;stroke-dashoffset:0;stroke-opacity:1" />
      <path
         inkscape:connector-curvature="0"
         id="path933"
         d="m -257.31836,92.974609 c -6.83321,0.762494 -14.61538,1.959524 -19.31836,7.480471 -1.4369,2.87347 2.87434,5.50746 5.09375,3.5332 4.83313,-2.07262 10.08168,-6.106382 15.53516,-3.9668 3.27548,0.12343 4.51951,-4.950733 1.48242,-6.33398 -0.83483,-0.504954 -1.82526,-0.717459 -2.79297,-0.712891 z"
         style="opacity:1;vector-effect:none;fill:#ec0000;fill-opacity:1;stroke:#000000;stroke-width:2.16317868;stroke-linecap:butt;stroke-linejoin:miter;stroke-miterlimit:4;stroke-dasharray:none;stroke-dashoffset:0;stroke-opacity:1" />
      <path
         inkscape:connector-curvature="0"
         id="path874"
         d="m -270.08594,64.789062 c -7.38594,1.61139 -13.84916,6.063576 -19.61133,10.757813 -2.41393,3.642039 1.04861,8.738152 4.75586,9.775391 3.62959,0.103258 5.45168,-3.861091 7.7705,-6.054877 2.70263,-3.260226 5.35088,-6.865506 9.11622,-8.843561 1.62679,-1.788995 0.79837,-5.779744 -2.03125,-5.634766 z"
         style="fill:#ec0000;fill-opacity:1;stroke:#000000;stroke-width:2.16317868;stroke-linecap:butt;stroke-linejoin:miter;stroke-miterlimit:4;stroke-dasharray:none;stroke-opacity:1" />
      <path
         inkscape:connector-curvature="0"
         id="path878"
         d="m -289.01562,77.402344 c -4.24697,2.164145 -4.50863,7.713195 -6.23413,11.592376 -1.135,3.987686 -3.12806,7.997101 -3.17017,12.1459 0.77784,1.82144 2.4419,3.42363 3.21484,4.99219 2.53924,0.29049 1.87883,-3.25074 2.06055,-4.80469 1.03638,-6.631029 6.97596,-11.64448 7.35351,-18.476558 -0.35053,-1.864798 -0.96835,-3.993684 -2.3496,-5.320312 -0.25638,-0.10601 -0.61463,-0.283364 -0.875,-0.128906 z"
         style="opacity:1;vector-effect:none;fill:#ec0000;fill-opacity:1;stroke:#000000;stroke-width:2.16317868;stroke-linecap:butt;stroke-linejoin:miter;stroke-miterlimit:4;stroke-dasharray:none;stroke-dashoffset:0;stroke-opacity:1" />
      <path
         inkscape:connector-curvature="0"
         id="path880"
         d="m -297.83789,99.492188 c -2.14983,1.890252 -2.69345,5.344332 -4.0293,7.847652 -0.77362,2.7484 -2.95544,5.04647 -3.75976,7.60547 0.45144,2.29862 3.25707,2.94704 4.16406,4.98633 2.11481,1.3857 3.70835,-2.07184 2.25977,-3.62695 -1.01506,-4.32349 1.30023,-8.81189 3.71289,-12.32617 2.65206,-1.27647 -0.92283,-4.178033 -2.34766,-4.486332 z"
         style="opacity:1;vector-effect:none;fill:#ec0000;fill-opacity:1;stroke:#000000;stroke-width:2.16317868;stroke-linecap:butt;stroke-linejoin:miter;stroke-miterlimit:4;stroke-dasharray:none;stroke-dashoffset:0;stroke-opacity:1" />
    </g>
  </g>
</svg>
