<?xml version="1.0" encoding="UTF-8" standalone="no"?>
<!-- Created with Inkscape (http://www.inkscape.org/) -->

<svg
   xmlns:dc="http://purl.org/dc/elements/1.1/"
   xmlns:cc="http://creativecommons.org/ns#"
   xmlns:rdf="http://www.w3.org/1999/02/22-rdf-syntax-ns#"
   xmlns:svg="http://www.w3.org/2000/svg"
   xmlns="http://www.w3.org/2000/svg"
   xmlns:xlink="http://www.w3.org/1999/xlink"
   xmlns:sodipodi="http://sodipodi.sourceforge.net/DTD/sodipodi-0.dtd"
   xmlns:inkscape="http://www.inkscape.org/namespaces/inkscape"
   width="64"
   height="64"
   viewBox="0 0 16.933333 16.933334"
   version="1.1"
   id="svg8"
   inkscape:version="0.92.5 (2060ec1f9f, 2020-04-08)"
   sodipodi:docname="mapicon.svg"
   inkscape:export-filename="../carrot_mapicon.png"
   inkscape:export-xdpi="96"
   inkscape:export-ydpi="96">
  <defs
     id="defs2">
    <linearGradient
       inkscape:collect="always"
       id="linearGradient947">
      <stop
         id="stop945"
         offset="0"
         style="stop-color:#f3650c;stop-opacity:0;" />
      <stop
         style="stop-color:#f3650c;stop-opacity:0.32098764"
         offset="0.6257928"
         id="stop956" />
      <stop
         style="stop-color:#f3650c;stop-opacity:0.82716048"
         offset="0.89931262"
         id="stop951" />
      <stop
         id="stop943"
         offset="1"
         style="stop-color:#f3710c;stop-opacity:1" />
    </linearGradient>
    <linearGradient
       inkscape:collect="always"
       id="linearGradient844">
      <stop
         style="stop-color:#ffc342;stop-opacity:1"
         offset="0"
         id="stop840" />
      <stop
         style="stop-color:#da7107;stop-opacity:1"
         offset="1"
         id="stop842" />
    </linearGradient>
    <radialGradient
       inkscape:collect="always"
       xlink:href="#linearGradient844"
       id="radialGradient846"
       cx="72.337021"
       cy="89.69973"
       fx="72.337021"
       fy="89.69973"
       r="40.294758"
       gradientTransform="matrix(0.38302061,0.05203571,-0.02923431,0.21518575,-14.16351,263.94403)"
       gradientUnits="userSpaceOnUse" />
    <filter
       inkscape:collect="always"
       style="color-interpolation-filters:sRGB"
       id="filter939"
       x="-0.0077534448"
       width="1.0155069"
       y="-0.017790349"
       height="1.0355808">
      <feGaussianBlur
         inkscape:collect="always"
         stdDeviation="0.35368781"
         id="feGaussianBlur941" />
    </filter>
    <radialGradient
       inkscape:collect="always"
       xlink:href="#linearGradient947"
       id="radialGradient949"
       cx="67.986328"
       cy="69.019165"
       fx="67.986328"
       fy="69.019165"
       r="55.589081"
       gradientTransform="matrix(0.50766863,0,0,0.22562732,0.80845524,21.52617)"
       gradientUnits="userSpaceOnUse" />
    <linearGradient
       inkscape:collect="always"
       xlink:href="#linearGradient1234"
       id="linearGradient1236"
       x1="75.903618"
       y1="67.186684"
       x2="0.82392293"
       y2="61.186684"
       gradientUnits="userSpaceOnUse" />
    <linearGradient
       inkscape:collect="always"
       id="linearGradient1234">
      <stop
         style="stop-color:#ffef92;stop-opacity:1;"
         offset="0"
         id="stop1230" />
      <stop
         style="stop-color:#ffef92;stop-opacity:0;"
         offset="1"
         id="stop1232" />
    </linearGradient>
    <clipPath
       clipPathUnits="userSpaceOnUse"
       id="clipPath1242">
      <path
         sodipodi:nodetypes="ccscssccsccscccscccccccccccscscscccccccccscccccccsccscccsccccccscscscccccscccccc"
         inkscape:connector-curvature="0"
         id="path1244"
         d="m 59.226131,106.55871 c 7.226155,0.98828 13.112924,0.80399 17.804595,-0.55755 0.414081,-0.12019 3.095285,-0.66187 5.958247,-1.20389 14.237813,-2.6953 26.666397,-9.805008 33.571077,-19.204201 2.55344,-3.475956 4.36883,-6.879156 5.66632,-10.622249 0.41831,-1.20669 1.20071,-3.208932 1.73873,-4.449411 0.90854,-2.094728 0.93033,-2.306306 0.30599,-2.969877 -0.65023,-0.691087 -0.62805,-0.75069 0.67793,-1.821544 2.22503,-1.824453 2.72661,-3.757757 1.05588,-4.06953 -0.4235,-0.07861 -1.23765,-0.429013 -1.80933,-0.777788 l -1.03941,-0.634129 1.61179,-1.142287 c 0.97176,-0.688668 1.56317,-1.406589 1.48935,-1.807975 -0.16188,-0.879798 -1.96142,-2.260308 -5.25665,-4.032491 -2.89818,-1.558639 -3.34234,-2.182602 -1.88299,-2.645065 0.51163,-0.162141 0.99516,-0.64267 1.07448,-1.067792 0.15549,-0.833159 -1.5575,-2.613845 -3.26664,-3.395678 -0.72942,-0.333733 -0.94114,-0.657638 -0.69336,-1.060952 0.28161,-0.458456 0.13829,-0.560503 -0.68102,-0.485064 -0.57069,0.05254 -0.82489,-0.0189 -0.56481,-0.16252 0.61649,-0.336378 1.03386,-1.354431 0.46512,-1.134425 -0.23992,0.09298 -0.48178,-0.176882 -0.53753,-0.599622 -0.11856,-0.898431 -2.13334,-2.907477 -3.58344,-3.573165 -1.29515,-0.594633 -1.34176,-0.751333 -1.01269,-3.405997 0.16184,-1.307943 -0.0136,-3.410532 -0.42744,-5.113134 -0.38653,-1.590463 -0.70012,-3.034583 -0.69688,-3.209197 0.003,-0.174236 -0.0238,-0.370771 -0.0601,-0.435893 -0.0363,-0.06501 -0.0518,-0.689234 -0.0344,-1.386784 0.0439,-1.775546 -1.91677,-7.79879 -3.21898,-9.888982 -0.59784,-0.959585 -1.40648,-1.804347 -1.797,-1.877141 -0.9261,-0.173102 -3.75018,1.96766 -5.391248,4.086274 -0.712917,0.920391 -2.384511,2.950715 -3.714651,4.511811 -1.330126,1.561096 -2.806651,3.674533 -3.281144,4.69663 -1.751116,3.77178 -1.244546,3.57721 -7.195865,2.76412 -8.185122,-1.118173 -12.243972,-1.172069 -17.639183,-0.233953 -0.921279,0.160252 -1.852864,0.12926 -2.070263,-0.06841 -0.219704,-0.199937 -0.314003,-0.14967 -0.212409,0.113008 0.103408,0.267212 -0.351345,0.479622 -1.0464,0.488617 -1.293336,0.01512 -5.658637,1.143383 -8.736718,2.254979 -1.001889,0.361701 -2.656271,0.881197 -3.676415,1.154117 -1.020147,0.272882 -2.260501,0.774274 -2.75636,1.114091 -0.495855,0.33978 -2.169672,1.264139 -3.719584,2.053984 -1.54992,0.789884 -3.815547,2.140952 -5.034735,3.002344 l -2.216685,1.56616 -1.709089,-1.001763 C 33.718647,39.175445 30.635148,38.552617 23.827626,37.931829 17.335387,37.33988 15.24972,37.447974 11.936678,38.54861 c -1.550621,0.515112 -3.4351122,0.884107 -4.1877624,0.819931 -1.8511872,-0.157984 -5.6286834,0.542702 -5.9383441,1.101241 -0.1376784,0.248315 1.6759903,3.358148 4.0305894,6.910261 2.354589,3.552227 4.9994061,7.739301 5.8773831,9.30463 0.877972,1.565405 1.962826,3.320957 2.410789,3.901266 1.225577,1.587703 3.79815,3.840377 4.544739,3.979728 0.546669,0.102425 0.555942,0.413178 0.05364,1.815081 -0.33337,0.930519 -0.986731,2.098658 -1.451774,2.595855 -0.465058,0.497159 -0.976423,1.340069 -1.136373,1.872982 -0.159969,0.532951 -0.559565,1.076599 -0.88807,1.208126 -0.328501,0.131528 -0.422331,0.274394 -0.208475,0.317858 0.213808,0.04346 0.125692,0.259654 -0.195609,0.47966 -1.441145,0.987893 -0.438965,4.13658 1.605372,5.043893 0.983727,0.436725 1.011576,0.549468 0.399281,1.619074 -0.361996,0.632353 -0.875697,1.23394 -1.141571,1.336743 -0.279099,0.108095 -0.326211,0.01512 -0.111394,-0.221858 0.403102,-0.443187 -0.370405,-2.69503 -0.963798,-2.80577 -0.595822,-0.113008 -0.691509,1.424429 -0.130508,2.099225 0.286122,0.344315 0.459789,0.949947 0.385861,1.346117 -0.07392,0.39617 0.0997,1.00199 0.385876,1.346154 0.286171,0.343937 0.541044,0.514507 0.566449,0.378331 0.03432,-0.184063 3.061033,2.086564 3.6268,2.720806 0.04543,0.05065 -0.410107,0.73251 -1.012143,1.514684 -1.071965,1.392793 -1.234802,2.390513 -0.333173,2.041776 0.249581,-0.09638 1.593545,0.280441 2.986441,0.838035 1.942633,0.777486 2.909595,0.970696 4.151136,0.829644 0.89025,-0.101292 1.672609,-0.105449 1.738621,-0.0076 0.066,0.09638 -0.245484,0.748611 -0.692099,1.449675 -0.446652,0.701103 -0.850992,1.527685 -0.898545,1.836888 -0.09669,0.629027 4.678919,3.784706 6.943236,4.588044 1.609561,0.570974 3.567988,2.08929 3.206947,2.48625 -0.645244,0.70938 13.710536,3.90282 23.666272,5.26443 z"
         style="fill:none;fill-opacity:1;stroke:#f70000;stroke-width:0.41750464;stroke-opacity:0.94444442" />
    </clipPath>
    <filter
       inkscape:collect="always"
       style="color-interpolation-filters:sRGB"
       id="filter2084"
       x="-0.12538208"
       width="1.2507642"
       y="-0.16911125"
       height="1.3382225">
      <feGaussianBlur
         inkscape:collect="always"
         stdDeviation="4.5807624"
         id="feGaussianBlur2086" />
    </filter>
  </defs>
  <sodipodi:namedview
     id="base"
     pagecolor="#ffffff"
     bordercolor="#666666"
     borderopacity="1.0"
     inkscape:pageopacity="0.0"
     inkscape:pageshadow="2"
     inkscape:zoom="1"
     inkscape:cx="-8.6230415"
     inkscape:cy="63.075646"
     inkscape:document-units="px"
     inkscape:current-layer="layer1"
     showgrid="false"
     inkscape:snap-global="false"
     inkscape:window-width="1920"
     inkscape:window-height="1061"
     inkscape:window-x="0"
     inkscape:window-y="0"
     inkscape:window-maximized="1"
     units="px"
     inkscape:pagecheckerboard="true" />
  <metadata
     id="metadata5">
    <rdf:RDF>
      <cc:Work
         rdf:about="">
        <dc:format>image/svg+xml</dc:format>
        <dc:type
           rdf:resource="http://purl.org/dc/dcmitype/StillImage" />
        <dc:title />
      </cc:Work>
    </rdf:RDF>
  </metadata>
  <g
     inkscape:label="Layer 1"
     inkscape:groupmode="layer"
     id="layer1"
     transform="translate(0,-280.06666)">
    <path
       style="fill:url(#radialGradient846);fill-opacity:1;stroke-width:0.05497118"
       d="m 7.9117786,294.35432 c 0.9514391,0.13011 1.7265267,0.10585 2.3442604,-0.0734 0.05452,-0.0158 0.407545,-0.0871 0.784499,-0.1585 1.874636,-0.35488 3.511059,-1.29099 4.42017,-2.52855 0.336203,-0.45766 0.575227,-0.90574 0.746062,-1.39858 0.05508,-0.15888 0.158094,-0.42251 0.228933,-0.58584 0.119623,-0.2758 0.122492,-0.30366 0.04029,-0.39103 -0.08561,-0.091 -0.08269,-0.0989 0.08926,-0.23983 0.29296,-0.24022 0.359003,-0.49478 0.139022,-0.53583 -0.05576,-0.0104 -0.162954,-0.0564 -0.238226,-0.1024 l -0.136855,-0.0835 0.212219,-0.15039 c 0.127947,-0.0907 0.205815,-0.18521 0.196095,-0.23806 -0.02131,-0.11584 -0.258252,-0.2976 -0.692121,-0.53094 -0.381592,-0.20522 -0.440074,-0.28737 -0.247927,-0.34827 0.06737,-0.0213 0.13103,-0.0846 0.141473,-0.14058 0.02048,-0.10971 -0.20507,-0.34417 -0.430106,-0.4471 -0.09604,-0.044 -0.123915,-0.0866 -0.09129,-0.13969 0.03708,-0.0603 0.01821,-0.0738 -0.08966,-0.0639 -0.07515,0.007 -0.10861,-0.002 -0.07436,-0.0214 0.08117,-0.0444 0.136124,-0.17833 0.06124,-0.14937 -0.03159,0.0122 -0.06344,-0.0233 -0.07077,-0.079 -0.01562,-0.11829 -0.280889,-0.38281 -0.471819,-0.47045 -0.170526,-0.0783 -0.176663,-0.0989 -0.133335,-0.44847 0.0213,-0.17221 -0.0017,-0.44905 -0.05628,-0.67321 -0.05089,-0.20942 -0.09218,-0.39956 -0.09176,-0.42255 4.34e-4,-0.023 -0.0031,-0.0487 -0.0079,-0.0574 -0.0048,-0.008 -0.0068,-0.0908 -0.0046,-0.18259 0.0058,-0.23378 -0.252373,-1.02683 -0.42383,-1.30204 -0.07872,-0.12634 -0.185185,-0.23757 -0.236603,-0.24715 -0.121937,-0.0228 -0.493772,0.25907 -0.709844,0.53802 -0.09387,0.12118 -0.31396,0.38851 -0.489095,0.59405 -0.175131,0.20555 -0.36954,0.48381 -0.432015,0.61838 -0.230563,0.49663 -0.163863,0.471 -0.947451,0.36395 -1.07771,-0.14723 -1.6121218,-0.15432 -2.3224882,-0.0308 -0.1213009,0.0211 -0.2439592,0.0171 -0.2725831,-0.009 -0.028927,-0.0264 -0.041344,-0.0197 -0.027967,0.0149 0.013616,0.0351 -0.046259,0.0632 -0.1377758,0.0644 -0.1702882,0.002 -0.7450499,0.15056 -1.1503289,0.29691 -0.1319146,0.0476 -0.3497405,0.11603 -0.4840584,0.15195 -0.134319,0.0359 -0.2976319,0.10195 -0.3629197,0.1467 -0.065287,0.0447 -0.2856722,0.16644 -0.4897428,0.27043 -0.2040717,0.104 -0.5023777,0.2819 -0.6629036,0.39531 l -0.2918621,0.20621 -0.225029,-0.1319 c -0.258536,-0.15154 -0.6645282,-0.23354 -1.5608476,-0.31528 -0.8548074,-0.078 -1.1294189,-0.0637 -1.565634,0.0812 -0.2041641,0.0678 -0.4522877,0.1164 -0.5513861,0.10795 -0.24373854,-0.0208 -0.74110653,0.0715 -0.78187833,0.145 -0.0181276,0.0327 0.220671,0.44215 0.53069173,0.90984 0.3100195,0.46771 0.658252,1.01901 0.7738519,1.22511 0.115599,0.20611 0.2584374,0.43725 0.3174189,0.51367 0.1613668,0.20903 0.5000875,0.50563 0.5983877,0.52398 0.071978,0.0135 0.073198,0.0544 0.00707,0.23899 -0.043893,0.12252 -0.1299191,0.27632 -0.1911493,0.34179 -0.061233,0.0655 -0.1285619,0.17644 -0.1496218,0.24661 -0.021062,0.0702 -0.073676,0.14175 -0.1169286,0.15906 -0.043252,0.0173 -0.055607,0.0361 -0.02745,0.0418 0.028151,0.006 0.01655,0.0342 -0.025755,0.0632 -0.1897499,0.13008 -0.057797,0.54465 0.2113729,0.66411 0.1295235,0.0575 0.1331903,0.0724 0.052572,0.21318 -0.047663,0.0833 -0.1152995,0.16246 -0.1503061,0.176 -0.036748,0.0142 -0.042951,0.002 -0.014667,-0.0292 0.053075,-0.0584 -0.04877,-0.35484 -0.1268995,-0.36942 -0.07845,-0.0149 -0.091048,0.18755 -0.017184,0.27639 0.037673,0.0453 0.060538,0.12508 0.050804,0.17724 -0.00974,0.0522 0.013127,0.13193 0.050807,0.17725 0.037679,0.0453 0.071237,0.0677 0.074582,0.0497 0.00452,-0.0242 0.4030339,0.27472 0.4775263,0.35823 0.00598,0.007 -0.053997,0.0965 -0.133265,0.19943 -0.1411412,0.18339 -0.1625813,0.31475 -0.043867,0.26884 0.032861,-0.0127 0.2098157,0.0369 0.3932127,0.11034 0.2557788,0.10236 0.3830948,0.12781 0.5465637,0.10924 0.1172156,-0.0133 0.2202258,-0.0138 0.2289174,-0.001 0.00869,0.0127 -0.032322,0.0986 -0.091126,0.19087 -0.058809,0.0923 -0.1120468,0.20114 -0.1183078,0.24185 -0.012731,0.0829 0.6160546,0.49832 0.9141884,0.6041 0.2119245,0.0751 0.469783,0.27508 0.4222461,0.32735 -0.084957,0.0934 1.8052122,0.51386 3.1160446,0.69314 z"
       id="path830"
       inkscape:connector-curvature="0"
       sodipodi:nodetypes="ccscssccsccscccscccccccccccscscscccccccccscccccccsccscccsccccccscscscccccscccccc" />
    <path
       style="opacity:0.75;vector-effect:none;fill:url(#linearGradient1236);fill-opacity:1;fill-rule:evenodd;stroke:none;stroke-width:0.37508082px;stroke-linecap:butt;stroke-linejoin:miter;stroke-miterlimit:4;stroke-dasharray:none;stroke-dashoffset:0;stroke-opacity:1;marker:none;filter:url(#filter2084)"
       d="M 81.275391,31.962891 A 33.444078,48.200723 73.198531 0 0 62.5625,34.144531 33.444078,48.200723 73.198531 0 0 23.205078,79.080078 33.444078,48.200723 73.198531 0 0 38.195312,96.941406 33.444078,48.200723 73.198531 0 1 32.144531,85.666016 33.444078,48.200723 73.198531 0 1 71.501953,40.730469 33.444078,48.200723 73.198531 0 1 110.33008,43.341797 33.444078,48.200723 73.198531 0 0 81.275391,31.962891 Z M 83.25,59.5 A 13.5,9.5000001 0 0 0 69.75,69 13.5,9.5000001 0 0 0 70.789062,72.632812 8.2500008,9.5000002 0 0 1 78.5,66.5 8.2500008,9.5000002 0 0 1 83.962891,68.894531 8.2500008,9.5000002 0 0 1 91.75,62.5 8.2500008,9.5000002 0 0 1 93.302734,62.677734 13.5,9.5000001 0 0 0 83.25,59.5 Z"
       transform="matrix(0.13229131,0,0,0.13229131,-0.03267437,280.6327)"
       id="path838"
       inkscape:connector-curvature="0"
       clip-path="url(#clipPath1242)" />
    <path
       style="opacity:1;vector-effect:none;fill:#f3820c;fill-opacity:1;stroke:none;stroke-width:0.05589408px;stroke-linecap:butt;stroke-linejoin:miter;stroke-miterlimit:4;stroke-dasharray:none;stroke-dashoffset:0;stroke-opacity:1"
       d="m 6.4277322,284.90549 1.806056,0.41014 -0.6827508,-0.74885 0.762532,-0.16841 1.3416728,0.74385 -0.8054575,-0.97279 1.0076943,-0.013 0.753401,0.76203 -0.11214,-0.7703 c 0,0 -2.4437684,-0.12703 -4.0710078,0.75734 z"
       id="path854"
       inkscape:connector-curvature="0" />
    <ellipse
       style="opacity:1;vector-effect:none;fill:#ffe8cb;fill-opacity:1;fill-rule:evenodd;stroke:none;stroke-width:2.22233844;stroke-linecap:butt;stroke-linejoin:miter;stroke-miterlimit:4;stroke-dasharray:none;stroke-dashoffset:0;stroke-opacity:0.95061729;marker:none"
       id="path848"
       cx="79.38295"
       cy="281.75394"
       rx="1.3528734"
       ry="1.3647405"
       transform="matrix(0.98303071,0.18344108,-0.24782448,0.96880495,0,0)" />
    <ellipse
       ry="1.1988348"
       rx="1.1781747"
       cy="282.9628"
       cx="23.250963"
       id="ellipse850"
       style="opacity:1;vector-effect:none;fill:#ffe8cb;fill-opacity:1;fill-rule:evenodd;stroke:none;stroke-width:1.94375288;stroke-linecap:butt;stroke-linejoin:miter;stroke-miterlimit:4;stroke-dasharray:none;stroke-dashoffset:0;stroke-opacity:0.95061729;marker:none"
       transform="matrix(0.98303071,0.18344108,-0.0375943,0.99929308,0,0)" />
    <path
       style="fill:#413118;fill-opacity:1;stroke-width:0.05589427"
       d="m 13.718837,282.00664 c -0.838183,0.49898 -1.443492,1.35623 -1.907726,2.19974 -1.056044,-0.0322 -2.155056,-0.28514 -3.245812,-0.0437 -1.3653414,0.13866 -2.6116501,0.82787 -3.7747996,1.4883 -0.9635672,-0.44662 -2.0916605,-0.49075 -3.1337677,-0.4105 -0.3576067,-0.0163 -0.6157698,0.46315 -0.1289004,0.38868 0.9331419,0.12213 1.9907898,0.0873 2.8338263,0.4353 -0.2193763,0.36542 -0.7632999,-0.1844 -1.1172429,-0.13622 -0.5684115,-0.10446 -1.1483678,-0.26325 -1.6818794,-0.0546 0.079727,0.48024 0.6779864,0.0778 0.9479138,0.36587 0.2055572,0.21079 0.6468081,0.19855 0.7962081,0.33167 -0.5343351,0.52179 -0.057293,1.35993 -0.6687949,1.8413 -0.4413212,0.17185 -0.7351624,-0.54961 -0.9533673,-0.86413 -0.02541,-0.37623 -0.5047267,-0.72121 -0.70647358,-1.09814 -0.14187843,-0.3123 -0.67561491,-0.61076 -0.17748601,-0.74117 0.0517886,-0.36799 -0.54100521,-0.18593 -0.76249557,-0.17699 -0.20574039,0.51232 0.48208539,0.9872 0.65392176,1.43475 0.4807636,0.69868 0.860612,1.629 1.5735767,2.07431 -0.1031278,0.46187 -0.511688,0.78739 -0.6742483,1.19084 0.058017,0.28162 0.3301647,0.37436 0.00198,0.51065 0.024933,0.23145 0.1354244,0.38178 0.1412946,0.61426 0.3941564,0.27658 0.7764319,0.45464 0.2118022,0.84174 0.061608,0.14724 0.6761288,0.2033 0.9750734,0.36546 0.1723169,0.0769 0.4956747,-0.12069 0.2731696,0.18591 -0.1492303,0.52156 0.5949869,0.63232 0.9127142,0.86513 0.3319689,0.0315 0.4065296,0.21857 0.5398945,0.42239 0.812972,0.20642 1.6617386,0.44063 2.4743922,0.52502 0.2870399,-0.0673 0.3288267,-0.0487 0.5765817,0.0356 0.3153399,-0.19954 -0.1351577,-0.51931 -0.2513559,-0.29746 -0.6415728,-0.31028 -1.3581699,-0.5354 -2.0277498,-0.78477 -0.3640843,-0.17189 -1.2336013,-0.0662 -1.2740841,-0.52605 0.00433,-0.15841 0.040721,-0.64656 -0.2736655,-0.45165 0.2495233,-0.25415 0.1894117,-0.67398 -0.2245843,-0.59542 -0.2639754,-0.0236 -0.6758083,0.12186 -0.3024202,-0.1993 0.3918256,-0.53284 -0.5149704,-0.43895 -0.8011657,-0.52997 0.166817,-0.23473 0.8846425,-0.5881 0.3187808,-0.73524 -0.2215435,-0.0715 -0.5895212,-0.26155 -0.4848641,-0.46305 0.2424224,0.28826 0.6086248,-0.33912 0.9454351,-0.30985 0.1973804,-0.29712 1.1064319,-0.15492 0.9251085,-0.65492 -0.4045095,-0.0959 -0.9162648,0.30218 -1.1997654,0.35498 0.2087361,-0.11433 0.032829,-0.41747 -0.169058,-0.29895 0.2658241,-0.51264 0.6920323,-1.03611 0.6737527,-1.61225 0.2206585,-0.12665 0.4872011,-0.35231 0.6197134,-0.54187 0.3519145,-0.19486 0.5675356,-0.62884 1.004709,-0.83799 0.4507204,-0.31078 1.0383829,-0.73054 1.5068661,-0.82434 0.4858414,0.2362 1.0959576,0.31591 1.638027,0.28755 0.151872,-0.4233 -0.9763692,-0.68488 -0.274657,-0.80017 0.2575119,0.0606 0.4457077,-0.25384 0.5215509,0.0659 0.00264,0.30044 0.4478414,0.34182 0.6330994,0.45858 0.2178918,0.32164 0.7360255,0.0246 0.3852138,-0.27466 -0.128858,-0.15976 -0.6934708,-0.53737 -0.1650913,-0.45908 0.4512657,-0.11491 0.9051372,-0.0226 0.9142012,0.51907 0.176323,0.34584 0.764593,0.13169 0.442724,-0.23598 -0.314729,-0.4792 0.657348,-0.0817 0.974163,-0.0906 0.328245,0.07 0.647444,0.21036 0.965292,0.15651 0.373704,0.19053 0.946512,0.005 1.099124,0.45611 0.303654,0.41541 1.196155,0.67828 1.075327,1.19679 -0.276164,0.0734 -0.934484,0.52091 -0.371828,0.67574 0.286357,0.007 0.765548,-0.18721 0.852726,0.18938 0.172852,0.27044 0.711696,0.43217 0.797695,0.59543 -0.203827,-0.0329 -0.77825,0.11759 -0.579556,-0.20724 -0.144114,-0.33896 -0.615476,-0.0209 -0.912218,-0.0521 -0.214511,0.0508 -0.680209,0.28654 -0.290522,0.46752 0.310357,0.14256 0.754586,-0.30772 0.931554,-0.21616 -0.440379,0.10001 -0.02375,0.45071 0.247885,0.34704 0.0446,0.34712 0.474652,0.37132 0.712918,0.48387 -0.363253,0.47372 -0.983679,-0.089 -1.462028,0.19534 -0.650294,0.006 0.175248,0.40067 0.442723,0.50519 0.435456,0.20203 0.836901,0.51488 0.367367,0.9608 -0.621279,1.54098 -2.067253,2.56505 -3.564593,3.15112 -0.34072,0.15469 -0.991421,0.22117 -1.055,0.60336 0.513419,0.2536 1.183459,-0.20447 1.707007,-0.37685 1.781717,-0.69397 3.220097,-2.17081 3.769278,-4.0132 0.207012,-0.20962 0.145545,-0.50504 0.07486,-0.67922 0.399971,-0.1631 0.588356,-0.83646 -0.01041,-0.83686 0.116724,-0.12277 0.526369,-0.42343 0.177486,-0.62318 -0.217488,-0.26204 -0.73661,-0.41182 -0.869582,-0.59889 0.504447,-0.31148 -0.240762,-0.67454 -0.371333,-0.90527 -0.195551,-0.11412 -0.109571,-0.17873 -0.234995,-0.3753 -0.09862,-0.32596 -0.728906,-0.3575 -0.536424,-0.83489 -0.161532,-1.01141 -0.132268,-2.21989 -0.87454,-3.00933 -0.03799,-0.0185 -0.08201,-0.0189 -0.122455,-0.0102 z m -0.01092,0.62319 c -0.433097,0.42454 -0.751298,1.07437 -0.952871,1.57704 -0.225938,0.0792 0.05048,0.42602 -0.217148,0.1765 -0.245805,-0.0868 -0.407012,-0.12704 -0.11254,-0.33961 0.411635,-0.46957 0.78757,-1.07788 1.282559,-1.41393 z m 0.06643,0.83784 c 0.157921,0.43835 0.388249,1.08782 0.250861,1.4888 -0.357328,-0.0765 -0.668268,-0.40156 -0.937007,-0.51807 -0.155907,-0.27402 -0.01931,-0.34964 0.189384,-0.60138 0.128478,-0.0657 0.407038,-0.62999 0.496762,-0.36935 z m -0.973198,1.00939 c -0.383272,0.0923 0.223008,-0.3724 0,0 z m -0.851238,1.24043 c -0.467129,0.0511 -0.157614,0.54077 0.192854,0.50122 0.734977,0.25314 1.260971,1.18107 0.813561,1.88145 0.163702,0.43628 0.578482,-0.1681 0.572119,-0.38274 -0.03754,-0.90806 -0.566924,-1.93045 -1.578534,-1.99993 z m -4.6309963,0.79173 c -0.9167339,0.23495 -0.9744918,1.63336 -0.355963,2.23495 0.1962712,0.30269 0.6183393,0.54345 0.9370065,0.38372 0.1690526,0.20291 0.3285027,-0.0848 0.5408859,0.0114 0.2662894,-0.10143 1.1578134,-0.24638 0.7991831,-0.6331 -0.264903,-0.027 -0.04635,-0.53659 -0.2558183,-0.7382 -0.074946,-0.41422 -0.698383,-0.49558 -0.6896171,0.004 -0.068715,0.3291 0.065073,0.71954 0.2389617,0.94147 -0.2173924,0.24025 -0.4686355,0.14906 -0.670282,0.15022 -0.725524,-0.34885 -1.1344251,-1.44891 -0.5468352,-2.06191 0.3905027,0.14562 0.3566011,-0.36542 0.00249,-0.29251 z m 4.5804273,0.43629 c -0.593882,0.22738 -0.120709,1.02893 0.136213,1.36438 0.178711,0.31558 0.728472,0.38355 1.062561,0.2677 0.116003,-0.50117 -0.868575,-0.24566 -0.625167,-0.74614 0.04731,-0.36514 -0.164627,-0.85486 -0.573607,-0.88594 z m -0.656401,1.16457 c -0.521371,-0.0452 -0.669499,0.57163 -0.205249,0.75605 0.308732,0.36054 0.805979,-0.0811 0.627646,-0.48686 -0.04139,-0.19082 -0.236363,-0.29312 -0.422397,-0.26919 z m -8.5148643,1.27413 c 0.2933839,0.0754 -0.2818945,0.42192 -0.060483,0.0947 l 0.054535,-0.10312 c 0.00314,-0.004 0.00446,-0.0143 0.00595,0.008 z m 9.8856713,0.0654 c -0.422448,0.0639 -0.146998,1.04117 -0.714901,0.80116 -0.387107,-0.0468 -0.229137,-0.33668 -0.229543,-0.65045 -0.457692,-0.21041 -0.640051,0.68037 -1.004431,0.87404 -0.493189,0.33375 -1.0267666,0.0288 -1.4699613,-0.2107 -0.489856,0.12476 0.183873,0.47234 0.2845727,0.70598 0.6729806,0.41121 1.4451566,0.0768 1.9672186,-0.41447 0.653671,0.53193 1.686133,-0.34639 1.365353,-1.04607 -0.05272,-0.0494 -0.127538,-0.0683 -0.198308,-0.0595 z m 3.324144,0.0387 c 0.02226,0.0162 -0.02614,-0.0146 0,0 z m -11.3873617,0.46256 c -0.4318758,0.23396 -1.1658804,0.0121 -1.4501296,0.49279 0.1155039,0.42233 0.7149289,0.14167 0.9702234,-0.003 0.3231338,-0.16537 0.1962368,-0.0975 0.02132,0.10461 -0.2495725,0.11593 -0.1969669,0.47305 -0.5334496,0.49181 -0.4108535,0.15353 0.033539,0.55636 0.2305334,0.18988 0.1985686,-0.18374 0.4218969,-0.29348 0.5904632,-0.46305 0.235155,-0.28433 0.9941491,-0.22595 0.9295705,-0.65789 C 5.1187238,289.979 4.7933482,289.99849 4.55054,289.95126 Z m -2.5661099,0.79967 c 0.2090457,0.0293 -0.1156649,0.0868 0,0 z"
       id="path828"
       inkscape:connector-curvature="0" />
    <path
       inkscape:connector-curvature="0"
       id="path870"
       transform="matrix(0.26458333,0,0,0.26458333,0,279.8328)"
       d="m 39.390625,16.851562 c -0.359374,-0.0078 -0.828126,-0.0077 -1.265625,0.02344 0.9375,1.187528 1.812484,2.999862 2.0625,2.9375 C 40.437501,19.749987 40,16.875 40,16.875 c 0,0 -0.250001,-0.01564 -0.609375,-0.02344 z M 33.9375,17.3125 32.125,17.625 c 0.5625,0.937512 3.999999,3.562487 3.6875,2.5625 -0.3125,-1.000025 -1.875,-2.875 -1.875,-2.875 z M 27.75,18.625 25.125,19.25 c 1,0.624983 3.625,2 4.5,2 0.875,0 -1.875,-2.625 -1.875,-2.625 z m 31.035156,6.361328 -3.464844,1.910156 3.783204,0.08398 z m 3.558594,4.25586 c 0,0 -5.45605,0.364709 -7.173828,1.425781 -1.717773,1.061053 6.882812,0.86914 6.882812,0.86914 0,0 2.17798,-0.561186 0.291016,-2.294921 z m -45.427734,5.361328 c -4.308234,0.0139 -7.2734379,1.189453 -7.2734379,1.189453 l -2.109375,2.927734 c 0,0 2.1901915,1.872823 2.6093749,2.244141 0.419186,0.371298 -2.1347655,0.970703 -2.1347655,0.970703 l 3.2519535,2.462891 -1.8027348,1.8125 4.9394528,0.236328 c 0,0 1.573718,-1.567111 1.597657,-1.171875 0.02394,0.395254 3.892578,-2.646485 3.892578,-2.646485 -3.402044,0.937344 -6.330684,1.018409 -6.822266,1.142578 0.784468,-1.810586 2.959157,-2.922766 6.886719,-5.001953 -4.051073,-0.946655 -6.089132,0.523375 -8.705078,1.521485 -1.020864,-0.288178 4.994453,-4.427355 7.59375,-5.617188 -0.665589,-0.05224 -1.308366,-0.0723 -1.923828,-0.07031 z m 41.548828,0.160156 c -0.766118,-0.01142 -1.379575,0.02667 -1.523438,0.103516 -0.353469,0.188643 4.120019,1.804991 4.601563,2.394531 0.09846,-0.510219 0.572265,-1.982422 0.572265,-1.982422 -0.670356,-0.340974 -2.373522,-0.496594 -3.65039,-0.515625 z m 3.078125,2.498047 c -0.03056,0.15846 -0.02907,0.230787 0.03906,0.128906 0.02259,-0.03377 0.002,-0.07865 -0.03906,-0.128906 z"
       style="opacity:0.72100004;vector-effect:none;fill:url(#radialGradient949);fill-opacity:1;stroke:none;stroke-width:0.21125321px;stroke-linecap:butt;stroke-linejoin:miter;stroke-miterlimit:4;stroke-dasharray:none;stroke-dashoffset:0;stroke-opacity:1;filter:url(#filter939)" />
  </g>
</svg>
