<?xml version="1.0" encoding="UTF-8" standalone="no"?>
<!-- Created with Inkscape (http://www.inkscape.org/) -->

<svg
   xmlns:dc="http://purl.org/dc/elements/1.1/"
   xmlns:cc="http://creativecommons.org/ns#"
   xmlns:rdf="http://www.w3.org/1999/02/22-rdf-syntax-ns#"
   xmlns:svg="http://www.w3.org/2000/svg"
   xmlns="http://www.w3.org/2000/svg"
   xmlns:xlink="http://www.w3.org/1999/xlink"
   xmlns:sodipodi="http://sodipodi.sourceforge.net/DTD/sodipodi-0.dtd"
   xmlns:inkscape="http://www.inkscape.org/namespaces/inkscape"
   width="128"
   height="128"
   viewBox="0 0 33.866666 33.866668"
   version="1.1"
   id="svg8"
   inkscape:version="0.92.5 (2060ec1f9f, 2020-04-08)"
   sodipodi:docname="icon.svg"
   inkscape:export-filename="../carrot_icon.png"
   inkscape:export-xdpi="96"
   inkscape:export-ydpi="96">
  <defs
     id="defs2">
    <linearGradient
       inkscape:collect="always"
       id="linearGradient1234">
      <stop
         style="stop-color:#ffef92;stop-opacity:1;"
         offset="0"
         id="stop1230" />
      <stop
         style="stop-color:#ffef92;stop-opacity:0;"
         offset="1"
         id="stop1232" />
    </linearGradient>
    <linearGradient
       inkscape:collect="always"
       id="linearGradient947">
      <stop
         id="stop945"
         offset="0"
         style="stop-color:#f3650c;stop-opacity:0;" />
      <stop
         style="stop-color:#f3650c;stop-opacity:0.32098764"
         offset="0.6257928"
         id="stop956" />
      <stop
         style="stop-color:#f3650c;stop-opacity:0.82716048"
         offset="0.89931262"
         id="stop951" />
      <stop
         id="stop943"
         offset="1"
         style="stop-color:#f3710c;stop-opacity:1" />
    </linearGradient>
    <linearGradient
       inkscape:collect="always"
       id="linearGradient844">
      <stop
         style="stop-color:#ffc342;stop-opacity:1"
         offset="0"
         id="stop840" />
      <stop
         style="stop-color:#da7107;stop-opacity:1"
         offset="1"
         id="stop842" />
    </linearGradient>
    <radialGradient
       inkscape:collect="always"
       xlink:href="#linearGradient844"
       id="radialGradient846"
       cx="72.337021"
       cy="89.699738"
       fx="72.337021"
       fy="89.699738"
       r="40.294758"
       gradientTransform="matrix(0.73612964,0.08026258,-0.04141664,0.37985342,-27.949868,236.49189)"
       gradientUnits="userSpaceOnUse" />
    <filter
       inkscape:collect="always"
       style="color-interpolation-filters:sRGB"
       id="filter939"
       x="-0.0077534447"
       width="1.0155069"
       y="-0.017790349"
       height="1.0355807">
      <feGaussianBlur
         inkscape:collect="always"
         stdDeviation="0.35368781"
         id="feGaussianBlur941" />
    </filter>
    <radialGradient
       inkscape:collect="always"
       xlink:href="#linearGradient947"
       id="radialGradient949"
       cx="67.986326"
       cy="69.019168"
       fx="67.986326"
       fy="69.019168"
       r="55.589082"
       gradientTransform="matrix(0.99999999,0,0,0.44443817,7.9380021e-7,38.344409)"
       gradientUnits="userSpaceOnUse" />
    <filter
       inkscape:collect="always"
       style="color-interpolation-filters:sRGB"
       id="filter1226"
       x="-0.12538208"
       width="1.2507642"
       y="-0.16911125"
       height="1.3382225">
      <feGaussianBlur
         inkscape:collect="always"
         stdDeviation="4.5807624"
         id="feGaussianBlur1228" />
    </filter>
    <linearGradient
       inkscape:collect="always"
       xlink:href="#linearGradient1234"
       id="linearGradient1236"
       x1="75.903618"
       y1="67.186684"
       x2="0.82392293"
       y2="61.186684"
       gradientUnits="userSpaceOnUse" />
    <clipPath
       clipPathUnits="userSpaceOnUse"
       id="clipPath1242">
      <path
         sodipodi:nodetypes="ccscssccsccscccscccccccccccscscscccccccccscccccccsccscccsccccccscscscccccscccccc"
         inkscape:connector-curvature="0"
         id="path1244"
         d="m 59.226131,106.55871 c 7.226155,0.98828 13.112924,0.80399 17.804595,-0.55755 0.414081,-0.12019 3.095285,-0.66187 5.958247,-1.20389 14.237813,-2.6953 26.666397,-9.805008 33.571077,-19.204201 2.55344,-3.475956 4.36883,-6.879156 5.66632,-10.622249 0.41831,-1.20669 1.20071,-3.208932 1.73873,-4.449411 0.90854,-2.094728 0.93033,-2.306306 0.30599,-2.969877 -0.65023,-0.691087 -0.62805,-0.75069 0.67793,-1.821544 2.22503,-1.824453 2.72661,-3.757757 1.05588,-4.06953 -0.4235,-0.07861 -1.23765,-0.429013 -1.80933,-0.777788 l -1.03941,-0.634129 1.61179,-1.142287 c 0.97176,-0.688668 1.56317,-1.406589 1.48935,-1.807975 -0.16188,-0.879798 -1.96142,-2.260308 -5.25665,-4.032491 -2.89818,-1.558639 -3.34234,-2.182602 -1.88299,-2.645065 0.51163,-0.162141 0.99516,-0.64267 1.07448,-1.067792 0.15549,-0.833159 -1.5575,-2.613845 -3.26664,-3.395678 -0.72942,-0.333733 -0.94114,-0.657638 -0.69336,-1.060952 0.28161,-0.458456 0.13829,-0.560503 -0.68102,-0.485064 -0.57069,0.05254 -0.82489,-0.0189 -0.56481,-0.16252 0.61649,-0.336378 1.03386,-1.354431 0.46512,-1.134425 -0.23992,0.09298 -0.48178,-0.176882 -0.53753,-0.599622 -0.11856,-0.898431 -2.13334,-2.907477 -3.58344,-3.573165 -1.29515,-0.594633 -1.34176,-0.751333 -1.01269,-3.405997 0.16184,-1.307943 -0.0136,-3.410532 -0.42744,-5.113134 -0.38653,-1.590463 -0.70012,-3.034583 -0.69688,-3.209197 0.003,-0.174236 -0.0238,-0.370771 -0.0601,-0.435893 -0.0363,-0.06501 -0.0518,-0.689234 -0.0344,-1.386784 0.0439,-1.775546 -1.91677,-7.79879 -3.21898,-9.888982 -0.59784,-0.959585 -1.40648,-1.804347 -1.797,-1.877141 -0.9261,-0.173102 -3.75018,1.96766 -5.391248,4.086274 -0.712917,0.920391 -2.384511,2.950715 -3.714651,4.511811 -1.330126,1.561096 -2.806651,3.674533 -3.281144,4.69663 -1.751116,3.77178 -1.244546,3.57721 -7.195865,2.76412 -8.185122,-1.118173 -12.243972,-1.172069 -17.639183,-0.233953 -0.921279,0.160252 -1.852864,0.12926 -2.070263,-0.06841 -0.219704,-0.199937 -0.314003,-0.14967 -0.212409,0.113008 0.103408,0.267212 -0.351345,0.479622 -1.0464,0.488617 -1.293336,0.01512 -5.658637,1.143383 -8.736718,2.254979 -1.001889,0.361701 -2.656271,0.881197 -3.676415,1.154117 -1.020147,0.272882 -2.260501,0.774274 -2.75636,1.114091 -0.495855,0.33978 -2.169672,1.264139 -3.719584,2.053984 -1.54992,0.789884 -3.815547,2.140952 -5.034735,3.002344 l -2.216685,1.56616 -1.709089,-1.001763 C 33.718647,39.175445 30.635148,38.552617 23.827626,37.931829 17.335387,37.33988 15.24972,37.447974 11.936678,38.54861 c -1.550621,0.515112 -3.4351122,0.884107 -4.1877624,0.819931 -1.8511872,-0.157984 -5.6286834,0.542702 -5.9383441,1.101241 -0.1376784,0.248315 1.6759903,3.358148 4.0305894,6.910261 2.354589,3.552227 4.9994061,7.739301 5.8773831,9.30463 0.877972,1.565405 1.962826,3.320957 2.410789,3.901266 1.225577,1.587703 3.79815,3.840377 4.544739,3.979728 0.546669,0.102425 0.555942,0.413178 0.05364,1.815081 -0.33337,0.930519 -0.986731,2.098658 -1.451774,2.595855 -0.465058,0.497159 -0.976423,1.340069 -1.136373,1.872982 -0.159969,0.532951 -0.559565,1.076599 -0.88807,1.208126 -0.328501,0.131528 -0.422331,0.274394 -0.208475,0.317858 0.213808,0.04346 0.125692,0.259654 -0.195609,0.47966 -1.441145,0.987893 -0.438965,4.13658 1.605372,5.043893 0.983727,0.436725 1.011576,0.549468 0.399281,1.619074 -0.361996,0.632353 -0.875697,1.23394 -1.141571,1.336743 -0.279099,0.108095 -0.326211,0.01512 -0.111394,-0.221858 0.403102,-0.443187 -0.370405,-2.69503 -0.963798,-2.80577 -0.595822,-0.113008 -0.691509,1.424429 -0.130508,2.099225 0.286122,0.344315 0.459789,0.949947 0.385861,1.346117 -0.07392,0.39617 0.0997,1.00199 0.385876,1.346154 0.286171,0.343937 0.541044,0.514507 0.566449,0.378331 0.03432,-0.184063 3.061033,2.086564 3.6268,2.720806 0.04543,0.05065 -0.410107,0.73251 -1.012143,1.514684 -1.071965,1.392793 -1.234802,2.390513 -0.333173,2.041776 0.249581,-0.09638 1.593545,0.280441 2.986441,0.838035 1.942633,0.777486 2.909595,0.970696 4.151136,0.829644 0.89025,-0.101292 1.672609,-0.105449 1.738621,-0.0076 0.066,0.09638 -0.245484,0.748611 -0.692099,1.449675 -0.446652,0.701103 -0.850992,1.527685 -0.898545,1.836888 -0.09669,0.629027 4.678919,3.784706 6.943236,4.588044 1.609561,0.570974 3.567988,2.08929 3.206947,2.48625 -0.645244,0.70938 13.710536,3.90282 23.666272,5.26443 z"
         style="fill:none;fill-opacity:1;stroke:#f70000;stroke-width:0.41750464;stroke-opacity:0.94444442" />
    </clipPath>
    <radialGradient
       inkscape:collect="always"
       xlink:href="#linearGradient844-6"
       id="radialGradient846-3"
       cx="72.337021"
       cy="89.699738"
       fx="72.337021"
       fy="89.699738"
       r="40.294758"
       gradientTransform="matrix(1.3862178,0.24931547,-0.14528715,0.80781047,-47.2943,-72.099222)"
       gradientUnits="userSpaceOnUse" />
    <linearGradient
       inkscape:collect="always"
       id="linearGradient844-6">
      <stop
         style="stop-color:#ffc342;stop-opacity:1"
         offset="0"
         id="stop840-7" />
      <stop
         style="stop-color:#da7107;stop-opacity:1"
         offset="1"
         id="stop842-5" />
    </linearGradient>
    <radialGradient
       inkscape:collect="always"
       xlink:href="#linearGradient844-6"
       id="radialGradient846-5"
       cx="72.337021"
       cy="89.699738"
       fx="72.337021"
       fy="89.699738"
       r="40.294758"
       gradientTransform="matrix(1.3862178,0.24931547,-0.14528715,0.80781047,-47.2943,-72.099222)"
       gradientUnits="userSpaceOnUse" />
  </defs>
  <sodipodi:namedview
     id="base"
     pagecolor="#ffffff"
     bordercolor="#666666"
     borderopacity="1.0"
     inkscape:pageopacity="0.0"
     inkscape:pageshadow="2"
     inkscape:zoom="1"
     inkscape:cx="41.222991"
     inkscape:cy="81.915052"
     inkscape:document-units="px"
     inkscape:current-layer="layer1"
     showgrid="false"
     inkscape:snap-global="false"
     inkscape:window-width="1920"
     inkscape:window-height="1061"
     inkscape:window-x="0"
     inkscape:window-y="0"
     inkscape:window-maximized="1"
     units="px"
     inkscape:pagecheckerboard="true" />
  <metadata
     id="metadata5">
    <rdf:RDF>
      <cc:Work
         rdf:about="">
        <dc:format>image/svg+xml</dc:format>
        <dc:type
           rdf:resource="http://purl.org/dc/dcmitype/StillImage" />
        <dc:title />
      </cc:Work>
    </rdf:RDF>
  </metadata>
  <g
     inkscape:label="Layer 1"
     inkscape:groupmode="layer"
     id="layer1"
     transform="translate(0,-263.13333)">
    <path
       style="fill:url(#radialGradient846);fill-opacity:1;stroke-width:0.05497118;font-variant-east_asian:normal;opacity:1;vector-effect:none;stroke-linecap:butt;stroke-linejoin:miter;stroke-miterlimit:4;stroke-dasharray:none;stroke-dashoffset:0;stroke-opacity:1"
       d="m 15.537956,291.12855 c 1.91192,0.26148 3.469461,0.21272 4.710799,-0.14752 0.109559,-0.0318 0.818961,-0.17512 1.576453,-0.31853 3.767088,-0.71313 7.055484,-2.59424 8.882347,-5.08111 0.675599,-0.91968 1.155919,-1.82011 1.499214,-2.81047 0.110678,-0.31927 0.317689,-0.84903 0.460038,-1.17724 0.240386,-0.55423 0.246152,-0.61021 0.08096,-0.78578 -0.172038,-0.18285 -0.166171,-0.19862 0.17937,-0.48195 0.588705,-0.48272 0.721416,-0.99424 0.279367,-1.07673 -0.112049,-0.0208 -0.32746,-0.11351 -0.478718,-0.20579 l -0.27501,-0.16778 0.426454,-0.30223 c 0.257111,-0.18221 0.413588,-0.37216 0.394055,-0.47836 -0.04283,-0.23278 -0.518958,-0.59804 -1.39082,-1.06693 -0.76681,-0.41239 -0.884329,-0.57748 -0.49821,-0.69984 0.135371,-0.0429 0.263305,-0.17004 0.284292,-0.28252 0.04114,-0.22044 -0.412091,-0.69158 -0.864301,-0.89844 -0.192991,-0.0883 -0.249009,-0.174 -0.183451,-0.28071 0.07451,-0.1213 0.03659,-0.1483 -0.180186,-0.12834 -0.150996,0.0139 -0.218252,-0.005 -0.149438,-0.043 0.163112,-0.089 0.27354,-0.35836 0.123062,-0.30015 -0.06348,0.0246 -0.127471,-0.0468 -0.142221,-0.15865 -0.03137,-0.23771 -0.564448,-0.76927 -0.94812,-0.9454 -0.342675,-0.15733 -0.355006,-0.19879 -0.26794,-0.90117 0.04282,-0.34606 -0.0036,-0.90237 -0.113094,-1.35285 -0.102268,-0.42081 -0.185239,-0.8029 -0.184382,-0.8491 8.73e-4,-0.0461 -0.0063,-0.0981 -0.01589,-0.11533 -0.0096,-0.0172 -0.01371,-0.18236 -0.0091,-0.36692 0.01161,-0.46978 -0.507146,-2.06343 -0.851689,-2.61646 -0.158179,-0.25389 -0.37213,-0.4774 -0.475455,-0.49666 -0.245032,-0.0458 -0.992237,0.52061 -1.426435,1.08116 -0.188626,0.24352 -0.630902,0.78071 -0.982835,1.19375 -0.351929,0.41304 -0.742593,0.97222 -0.868136,1.24265 -0.463316,0.99795 -0.329286,0.94647 -1.903906,0.73134 -2.16566,-0.29585 -3.239564,-0.31011 -4.667047,-0.0619 -0.243755,0.0424 -0.490237,0.0342 -0.547757,-0.0181 -0.05813,-0.0529 -0.08308,-0.0396 -0.0562,0.0299 0.02736,0.0707 -0.09296,0.1269 -0.27686,0.12928 -0.342195,0.004 -1.497181,0.30252 -2.31159,0.59663 -0.265083,0.0957 -0.702805,0.23315 -0.972718,0.30536 -0.269914,0.0722 -0.598091,0.20486 -0.729287,0.29477 -0.131195,0.0899 -0.574059,0.33447 -0.98414,0.54345 -0.410083,0.20899 -1.00953,0.56646 -1.332107,0.79437 l -0.5864979,0.41438 -0.4521965,-0.26505 c -0.519529,-0.30452 -1.3353716,-0.46931 -3.1365285,-0.63356 -1.7177382,-0.15662 -2.269571,-0.12802 -3.1461466,0.16319 -0.4102684,0.13629 -0.9088735,0.23392 -1.1080122,0.21694 -0.4897933,-0.0418 -1.48925585,0.14359 -1.57118692,0.29137 -0.0364274,0.0657 0.4434391,0.88851 1.06642682,1.82834 0.622985,0.93986 1.3227594,2.04769 1.5550577,2.46185 0.2322967,0.41418 0.5193309,0.87867 0.6378544,1.03221 0.3242673,0.42008 1.0049274,1.0161 1.2024622,1.05297 0.1446396,0.0271 0.1470932,0.10932 0.014192,0.48024 -0.088204,0.2462 -0.2610725,0.55527 -0.3841151,0.68682 -0.1230467,0.13154 -0.2583453,0.35456 -0.3006655,0.49556 -0.042325,0.14101 -0.1480515,0.28485 -0.2349684,0.31965 -0.086916,0.0348 -0.1117417,0.0726 -0.055159,0.0841 0.05657,0.0115 0.033256,0.0687 -0.051755,0.12691 -0.3813029,0.26138 -0.1161428,1.09447 0.4247547,1.33453 0.2602779,0.11555 0.2676463,0.14538 0.1056431,0.42838 -0.095778,0.16731 -0.2316947,0.32648 -0.3020406,0.35368 -0.073845,0.0286 -0.08631,0.004 -0.029473,-0.0587 0.106654,-0.11726 -0.098003,-0.71306 -0.255005,-0.74236 -0.1576444,-0.0299 -0.1829615,0.37688 -0.03453,0.55542 0.075703,0.0911 0.1216525,0.25134 0.1020922,0.35616 -0.019557,0.10482 0.02638,0.26511 0.1020964,0.35617 0.075716,0.091 0.1431512,0.13613 0.1498731,0.1001 0.00908,-0.0487 0.8098981,0.55207 0.9595907,0.71988 0.012019,0.0134 -0.1085075,0.19381 -0.2677962,0.40076 -0.2836239,0.36851 -0.326708,0.63249 -0.088152,0.54022 0.066035,-0.0255 0.4216256,0.0742 0.7901625,0.22173 0.5139883,0.20571 0.7698303,0.25683 1.0983216,0.21951 0.2355451,-0.0268 0.4425443,-0.0279 0.4600101,-0.002 0.017462,0.0255 -0.064951,0.19807 -0.1831179,0.38356 -0.1181767,0.1855 -0.2251583,0.4042 -0.2377401,0.48601 -0.025583,0.16643 1.2379639,1.00137 1.8370647,1.21392 0.4258631,0.15107 0.9440303,0.55279 0.8485048,0.65782 -0.1707207,0.18769 3.6275794,1.03262 6.2617014,1.39288 z"
       id="path830"
       inkscape:connector-curvature="0"
       sodipodi:nodetypes="ccscssccsccscccscccccccccccscscscccccccccscccccccsccscccsccccccscscscccccscccccc" />
    <path
       style="opacity:0.75;vector-effect:none;fill:url(#linearGradient1236);fill-opacity:1;fill-rule:evenodd;stroke:none;stroke-width:0.37508082px;stroke-linecap:butt;stroke-linejoin:miter;stroke-miterlimit:4;stroke-dasharray:none;stroke-dashoffset:0;stroke-opacity:1;marker:none;filter:url(#filter1226)"
       d="M 81.275391,31.962891 A 33.444078,48.200723 73.198531 0 0 62.5625,34.144531 33.444078,48.200723 73.198531 0 0 23.205078,79.080078 33.444078,48.200723 73.198531 0 0 38.195312,96.941406 33.444078,48.200723 73.198531 0 1 32.144531,85.666016 33.444078,48.200723 73.198531 0 1 71.501953,40.730469 33.444078,48.200723 73.198531 0 1 110.33008,43.341797 33.444078,48.200723 73.198531 0 0 81.275391,31.962891 Z M 83.25,59.5 A 13.5,9.5000001 0 0 0 69.75,69 13.5,9.5000001 0 0 0 70.789062,72.632812 8.2500008,9.5000002 0 0 1 78.5,66.5 8.2500008,9.5000002 0 0 1 83.962891,68.894531 8.2500008,9.5000002 0 0 1 91.75,62.5 8.2500008,9.5000002 0 0 1 93.302734,62.677734 13.5,9.5000001 0 0 0 83.25,59.5 Z"
       transform="matrix(0.26458334,0,0,0.26458334,-0.13229167,262.93489)"
       id="path838"
       inkscape:connector-curvature="0"
       clip-path="url(#clipPath1242)" />
    <ellipse
       style="opacity:1;vector-effect:none;fill:#ffe8cb;fill-opacity:1;fill-rule:evenodd;stroke:none;stroke-width:4.46579599;stroke-linecap:butt;stroke-linejoin:miter;stroke-miterlimit:4;stroke-dasharray:none;stroke-dashoffset:0;stroke-opacity:0.95061729;marker:none"
       id="path848"
       cx="84.566963"
       cy="270.32825"
       rx="2.7186034"
       ry="2.7424502"
       transform="matrix(0.98303071,0.18344108,-0.24782447,0.96880495,0,0)" />
    <ellipse
       ry="2.4090626"
       rx="2.3675458"
       cy="270.18726"
       cx="34.943027"
       id="ellipse850"
       style="opacity:1;vector-effect:none;fill:#ffe8cb;fill-opacity:1;fill-rule:evenodd;stroke:none;stroke-width:3.90597796;stroke-linecap:butt;stroke-linejoin:miter;stroke-miterlimit:4;stroke-dasharray:none;stroke-dashoffset:0;stroke-opacity:0.95061729;marker:none"
       transform="matrix(0.98303071,0.18344108,-0.0375943,0.99929308,0,0)" />
    <path
       inkscape:connector-curvature="0"
       id="path828"
       d="m 27.636193,266.16067 c -0.926824,0.27335 -1.500999,1.22384 -2.166372,1.87611 -0.701534,0.75747 -1.230178,1.65162 -1.727662,2.54003 -1.744183,0.1303 -3.488145,-0.58201 -5.233713,-0.20514 -1.571272,0.0602 -3.133417,0.34741 -4.581561,0.9854 -1.58278,0.39047 -2.873594,1.46945 -4.3179734,2.14407 -1.5669584,-0.84251 -3.3992573,-0.7212 -5.1169496,-0.9261 -0.6440725,-0.0104 -1.4346908,-0.003 -1.932419,0.43057 0.086291,0.38983 0.7878076,0.0628 1.1072286,0.21399 1.6684597,0.22197 3.4220851,0.24112 5.0245511,0.77725 0.5024314,0.16045 -0.1610552,0.42561 -0.072723,0.77649 -0.1752304,0.27996 0.1062977,0.87093 0.3738297,0.43753 1.2844676,-1.16312 2.7765726,-2.16505 4.3978516,-2.79046 0.199941,-0.0112 0.11454,0.34597 0.428775,0.29786 0.883559,0.15749 1.796085,0.4518 2.693726,0.37077 0.109282,-0.49716 -0.688885,-0.69239 -0.942728,-1.04485 0.0072,-0.4595 -1.15355,-0.0368 -0.446511,-0.30068 0.517446,-0.25959 1.130815,-0.21995 1.645033,-0.39015 0.105662,-0.15165 0.851077,-0.34641 0.411112,-0.0791 -0.267662,0.4682 0.693892,0.52481 0.707061,0.61983 -0.289127,-0.21048 -0.649462,0.16341 -0.244124,0.30604 0.237889,0.23555 0.836528,0.24095 0.581546,-0.0981 0.235461,0.26155 0.349371,0.70305 0.814712,0.71585 0.573328,-0.0736 0.02944,-0.75463 -0.212556,-0.91783 -0.130528,-0.27791 -0.826512,-0.29658 -0.514251,-0.6022 -0.214618,-0.14404 -0.628074,-0.31537 -0.03114,-0.25449 0.706846,0.0623 1.562813,-0.18824 2.144488,0.10199 0.248405,0.35121 0.272359,0.81178 0.515039,1.14691 0.251729,0.26792 0.914256,0.20063 0.637852,-0.27124 -0.08205,-0.29356 -0.442731,-0.66484 -0.430093,-0.89243 1.293089,0.0438 2.600723,0.31249 3.84026,0.6558 0.57654,-0.24998 1.148807,0.2498 1.750473,0.25719 0.243602,0.0323 1.073378,0.31417 0.852795,-0.1295 -0.376457,-0.16955 -0.696308,-0.39984 -0.963479,-0.66639 -0.362251,0.004 -0.620862,-0.31603 -0.998639,-0.0967 -0.434186,-0.032 -0.822636,-0.43227 -1.269737,-0.5007 0.610296,-0.93268 1.424336,-1.79049 2.147834,-2.65955 0.331834,-0.23568 0.642406,-0.9491 1.055675,-0.81235 0.325458,0.19204 -0.305052,0.37003 -0.356492,0.61975 -0.546965,0.79137 -1.224217,1.59074 -1.339176,2.57684 0.58934,-0.54234 1.069806,-1.4195 1.714424,-1.81126 0.488182,1.09793 0.909042,2.40111 0.697962,3.57802 -0.265961,-0.16074 -0.878205,-0.16008 -0.683902,0.30042 0.493248,0.74975 1.331493,1.14267 1.996265,1.6878 0.262807,0.25256 0.462535,0.51551 0.430206,0.84919 0.22542,0.2137 0.225818,0.2717 -0.0987,0.34766 -0.351102,0.26077 -1.122926,0.40544 -1.130706,0.9109 0.187938,0.2896 0.662068,0.20698 0.826707,0.0732 0.358319,0.20922 0.885613,-0.0703 1.186881,0.15703 0.160429,0.88157 1.261623,1.12018 1.897584,1.58193 0.219291,0.19478 -0.581861,0.32172 -0.805785,0.2392 -0.47574,-0.0518 -1.11894,-0.22169 -1.483471,0.1734 0.20345,0.41078 0.989677,-0.10402 0.991748,0.50765 0.27894,0.54699 1.028024,0.49556 1.502201,0.76539 -0.368676,0.52451 -0.95447,0.79665 -1.563249,0.49939 -0.642298,-0.15966 -1.294134,0.0175 -1.922775,0.14873 0.807476,0.63348 1.9544,0.88856 2.570381,1.71599 -0.895814,1.81247 -1.736694,3.79968 -3.467493,4.9829 -1.541674,1.2202 -3.245758,2.2796 -5.153984,2.79918 -0.380171,0.25364 -0.932499,0.30702 -1.21658,0.66737 0.269531,0.41289 0.932919,0.0228 1.326201,-0.009 2.889001,-0.96541 5.794332,-2.44744 7.586441,-5.00401 1.047981,-1.33022 1.55665,-2.96703 2.18182,-4.50896 0.0138,-0.26214 -0.46478,-0.47132 -0.05383,-0.6854 0.360462,-0.23242 1.018284,-0.92378 0.445041,-1.25939 -0.286743,-0.13363 -1.102512,-0.16785 -0.454288,-0.49532 0.313899,-0.2035 0.805955,-0.63523 0.282088,-0.92414 -0.553817,-0.54921 -1.30984,-0.81633 -1.922416,-1.24819 0.261225,-0.18174 0.734856,-0.55735 0.318738,-0.90831 -0.264957,-0.41276 -0.961498,-0.51467 -0.975278,-1.04205 -0.163144,-0.1695 -0.414401,0.27052 -0.384139,-0.16984 0.367615,-0.3292 -0.307712,-0.46035 -0.230175,-0.80598 -0.419535,-0.26707 -1.159462,-0.51955 -0.914621,-1.1822 0.04554,-1.17928 -0.372508,-2.31689 -0.439822,-3.48778 -0.28166,-0.90614 -0.501465,-1.96914 -1.215667,-2.63636 -0.02373,-0.003 -0.04431,-0.0224 -0.06935,-0.0196 z m -1.791472,4.40404 c -0.437588,-0.15394 -0.440541,0.55902 5.95e-4,0.49993 0.389058,0.0136 0.2946,-0.54134 -5.95e-4,-0.49993 z m -11.483192,1.68077 c 0.310902,0.16707 0.691496,0.13602 1.003795,0.30757 -0.22708,-0.0736 -1.133684,-0.0511 -1.003795,-0.30757 z m 9.805062,1.38535 c -0.325628,-0.15807 -0.887303,0.31781 -0.409728,0.51524 1.485783,0.33123 2.811819,1.6736 2.711306,3.25557 -0.0179,0.33124 -0.682747,0.94868 -0.137145,1.06928 0.4317,-0.0813 0.337742,-0.64658 0.679536,-0.76765 -0.10504,-1.22349 -0.405732,-2.60863 -1.44933,-3.40407 -0.417042,-0.30178 -0.876971,-0.58945 -1.394682,-0.66838 z m 6.399875,2.15767 c -0.181368,0.17165 -0.935429,0.23407 -0.338749,0.0679 0.09292,-0.0196 0.303177,-0.11015 0.338749,-0.0679 z m -6.671956,0.30354 c -0.696202,0.0891 -0.506684,1.09466 -0.263072,1.52957 0.38888,0.63345 0.653722,1.57936 1.557313,1.49579 0.259,0.0336 1.097879,0.31482 0.918725,-0.20497 -0.344389,-0.3837 -1.123374,-0.2842 -1.312444,-0.6383 0.203001,-0.80882 0.06505,-1.96692 -0.900518,-2.18209 z M 1.1621027,273.15559 c -0.21730198,-0.0263 -0.57665222,-0.0173 -0.66210481,0.14889 -0.23228594,-0.35403 -0.67292478,0.0516 -0.42819698,0.36399 0.84087508,1.66906 2.01948249,3.13717 2.92560159,4.77112 0.4193036,0.6482 0.9566744,1.2764 1.648173,1.60905 -0.1483644,0.73074 -0.6170837,1.39367 -1.0326523,2.01242 -0.6663475,0.32419 -0.167255,1.1083 0.2678713,1.38768 0.2256974,0.13019 0.8445176,-0.12014 0.3948455,0.18029 -0.2529452,0.0976 -0.3233202,0.55113 -0.4618709,0.59493 0.1850188,-0.19058 -0.190115,-1.05257 -0.5351453,-0.62705 -0.1420332,0.26709 0.2716758,0.56192 0.3119097,0.65372 -0.4433282,0.41942 0.3412924,0.84952 0.6461411,1.01214 1.1329271,0.26074 -0.3155476,1.02437 -0.1296554,1.33521 0.9040741,0.0356 1.7388124,0.83191 2.6446354,0.44799 -0.1521134,0.35518 -0.6307153,1.14473 0.013861,1.33038 0.6855076,0.54781 1.5590285,0.89814 2.3252447,1.20173 0.2381533,0.16919 -0.069193,0.37471 0.2365145,0.5071 0.9133492,0.40007 1.9282952,0.33777 2.8432142,0.70559 0.865379,0.10991 1.834847,0.56709 2.64754,0.19991 -0.05158,-0.50685 -0.908378,-0.43321 -1.254236,-0.67718 -0.872838,-0.22923 -1.680066,-0.63896 -2.502502,-0.96491 -0.870678,-0.21234 -1.802729,-0.33836 -2.6286926,-0.66857 -0.1966504,-0.26057 -0.616513,-0.43197 -0.2627386,-0.68753 0.044754,-0.21936 -0.2739885,-0.22205 -0.052162,-0.4247 0.1423851,-0.3096 -0.3007368,-0.44078 -0.3876235,-0.16627 -0.3551516,-0.13433 -0.1571434,0.49966 -0.4648715,0.36372 0.1209577,-0.48579 0.7962863,-1.02605 0.5729231,-1.52633 -0.6747065,-0.20762 -1.4550257,-0.1183 -2.0945338,0.10468 -0.4258011,-0.15344 0.3932856,-0.18304 0.4680173,-0.41863 0.1970573,-0.23398 0.8564779,-0.84433 0.2944189,-1.03015 -0.5399062,-0.12096 -1.2466331,-0.0196 -1.6511481,-0.34483 0.3017649,-0.41323 0.8474772,-0.76927 1.1786954,-1.12439 -0.2111108,-0.3382 -0.8115215,-0.30614 -1.1196057,-0.6068 -0.3614184,-0.0451 -0.2149061,-0.23727 -0.3383134,-0.4515 -0.3899126,-0.17793 0.3536072,-0.5923 0.3964036,-0.85995 0.5179074,-1.31433 1.4906036,-2.48485 1.9463975,-3.86132 -0.093171,-0.31993 -0.050021,-0.78815 0.3111067,-0.91533 0.4806447,-0.0259 0.7283467,-0.56541 0.9033892,-0.90689 0.4490925,0.16029 0.6682326,-0.37453 0.4193413,-0.70055 0.061037,-0.27039 0.084984,-0.6351 -0.3303861,-0.57769 -0.6701103,-0.0626 -1.2366688,-0.51004 -1.9380541,-0.52761 -0.7132851,-0.0322 -1.5017165,-0.45046 -2.1873106,-0.24389 -0.1222968,0.18195 -0.8939687,-0.22795 -0.8381874,0.26118 0.2356248,0.22915 0.7355658,0.17791 0.9047307,0.0226 0.4750385,0.26663 1.0249094,0.36842 1.4528288,0.68905 0.3633049,0.16133 0.9919991,0.1186 1.1888184,0.35787 -0.4271892,0.52547 -0.7518057,1.12653 -0.678109,1.82739 -0.1210757,0.25499 -0.0021,0.67362 -0.00213,0.81738 -0.4215395,0.43394 -0.4978656,1.47018 -1.2753452,1.41399 -0.7540624,-0.44029 -1.2924141,-1.24826 -1.6679093,-2.01503 0.1968006,-0.39735 -0.455304,-0.58761 -0.5526584,-0.961 -0.6241409,-0.87496 -1.2773731,-1.76528 -1.90082649,-2.61693 0.28186149,0.14416 1.05123069,-0.1842 0.52446779,-0.40421 z m 13.6252413,2.04859 c -0.467042,0.0449 -0.994945,0.30543 -1.183718,0.83568 -0.579401,1.06184 -0.457948,2.40515 0.335489,3.32291 0.379475,0.53969 1.122615,1.24389 1.796111,0.8098 -0.02991,-0.51125 -0.836193,-0.63378 -1.073084,-1.07342 -0.806711,-0.82414 -0.830216,-2.15538 -0.47382,-3.17011 0.237881,-0.35271 0.425934,-0.45674 0.799547,-0.36578 0.260434,-0.13096 -0.02777,-0.35721 -0.200525,-0.35908 z m 16.129194,2.30914 c -0.226709,0.11826 -0.407114,0.13817 -0.708582,0.1197 -0.380341,0.0276 -0.901958,0.0811 -1.107883,0.34714 -0.384621,-0.11984 -0.608826,0.42113 -0.148332,0.4659 0.60553,0.17392 1.013202,-0.47421 1.6154,-0.46745 0.191756,-0.21043 0.471629,0.25189 0.564401,-0.16316 0.03699,-0.13971 -0.07295,-0.28867 -0.215001,-0.30213 z m -6.738584,-0.2915 c 0.194449,0.12796 0.08507,0.65516 -0.01939,0.35652 0.02283,-0.11566 0.01624,-0.30001 0.01939,-0.35652 z M 7.1160238,275.69001 c -0.2027163,0.44885 0.011658,-0.13921 0,0 z m 10.1371672,1.32979 c -0.679576,0.0761 -0.554087,1.0509 -0.47928,1.53705 0.0096,0.39238 0.368496,0.66289 0.490707,0.95968 -0.137303,0.25841 -1.027472,0.42365 -0.590875,0.7395 0.652674,-0.14954 1.477556,-0.29227 1.923185,-0.82201 0.07273,-0.4088 -0.666464,-0.0303 -0.488374,-0.40371 0.06268,-0.67733 -0.154869,-1.73513 -0.855363,-2.01051 z m 5.432815,1.41087 c -0.439073,0.009 -1.33528,0.26085 -0.941494,0.84056 0.05948,0.34724 0.519033,0.39058 0.664294,0.52373 0.343842,0.45887 0.988875,-0.14529 0.884411,-0.61519 0.01656,-0.36599 -0.201685,-0.75492 -0.607211,-0.7491 z m -5.266494,-0.0696 c 0.05737,0.36323 -0.0862,-0.36767 0,0 z m 5.28462,0.73574 c 0.03944,0.37321 -0.366811,0.0566 -0.08263,-0.018 -0.0062,0.039 0.269454,-0.19826 0.08263,0.018 z m 8.996956,1.7666 c 0.319421,-0.11422 0.612956,0.44972 0.237734,0.35369 -0.04761,-0.14676 -1.074892,-0.5019 -0.237734,-0.35369 z M 16.198244,279.9078 c -0.489659,-0.0474 -0.228479,0.80332 0.119953,0.34454 0.123912,-0.11584 0.05453,-0.33644 -0.119953,-0.34454 z m 9.17415,1.21445 c -0.655463,-0.004 -0.29546,0.88587 -0.638666,1.23261 -0.175571,0.53561 -0.808905,0.55619 -1.169012,0.23759 -0.23623,-0.0308 -0.538226,-0.0155 -0.389729,-0.34657 -0.0054,-0.27572 0.313486,-1.11237 -0.197013,-0.8982 -0.845915,0.77148 -1.315207,2.31229 -2.717631,2.10769 -0.391814,-0.0759 -0.764463,0.0653 -1.028353,-0.28799 -0.277234,-0.11343 -0.916073,-0.6954 -1.07459,-0.22846 0.223438,0.35327 0.724315,0.46705 0.782224,0.89918 0.936639,0.62351 2.281529,0.60381 3.132044,-0.18242 0.475816,-0.37542 0.945078,-0.76182 1.518577,-0.33828 1.009585,0.36243 1.98794,-0.72194 2.112778,-1.66169 0.04627,-0.23335 -0.05013,-0.53143 -0.330629,-0.53346 z M 8.2434472,280.25388 c -0.5606318,0.1475 -1.1181677,0.36054 -1.6532267,0.56459 -0.2086143,0.29695 -0.3948465,0.24281 -0.7077615,0.27518 -0.3824604,0.22586 -1.0367872,0.56955 -1.0149373,1.04872 0.4204516,0.17348 0.7048368,-0.57694 1.1714406,-0.56815 0.185476,-0.22004 0.3868895,-0.0855 0.5495143,-0.24557 0.5075947,-0.47301 1.4396594,-0.2815 1.8640928,-0.86241 0.013568,-0.12284 -0.093024,-0.21059 -0.2091222,-0.21236 z m -2.2875242,0.14234 c -0.3799332,-0.11408 -0.6259724,0.64048 -0.137393,0.50152 0.2016902,-0.0639 0.4927421,-0.41746 0.137393,-0.50152 z m 3.2180812,1.73518 c -0.2029822,0.0786 -0.3048395,0.11417 -0.5334438,0.15714 -0.670039,0.12282 -1.4371244,0.18881 -2.1024212,0.41542 -0.3718628,0.17832 -0.2492081,0.66488 0.1825237,0.58554 0.2536923,0.12942 0.4068409,-0.10584 0.554875,-0.15183 0.4454385,0.0896 0.6117527,-0.28781 0.9779985,-0.35757 0.2155733,-0.21329 0.3333918,-0.20325 0.5936931,-0.0909 0.4225918,-0.0859 -0.2939227,0.26035 -0.3923384,0.36665 -0.3869416,0.17098 -0.1470473,0.72894 0.2227626,0.45452 0.5633773,-0.40189 1.265586,-0.56686 1.8261583,-0.9262 0.135313,-0.29104 -0.263323,-0.31467 -0.399109,-0.28244 -0.2933416,-0.11616 -0.6237543,-0.11347 -0.9306935,-0.17033 z m -1.0439723,1.30189 c -0.4466119,0.0499 -0.3493068,0.88639 0.1277157,0.49692 0.2298086,-0.12235 0.1019998,-0.47304 -0.1277157,-0.49692 z m -0.7576815,0.77304 c -0.3114297,-0.0234 -0.7945703,0.56206 -0.2551386,0.52135 0.1829121,-0.0683 0.7657511,-0.62167 0.2551386,-0.52135 z m 0.3821745,3.6434 c -0.012198,0.32126 -0.2823868,0.14347 0,0 z m 7.4834381,2.8518 c -0.554701,0.14433 0.191582,0.86097 0.247359,0.27769 -0.02776,-0.11909 -0.108674,-0.27994 -0.247359,-0.27769 z"
       style="fill:#000000;stroke-width:0.11231958" />
    <path
       sodipodi:nodetypes="sccccsccccccccccccccccccscccccccccccccsscccsccc"
       inkscape:connector-curvature="0"
       id="path870"
       transform="matrix(0.2699178,0,0,0.2699178,0.06905129,263.04273)"
       d="m 74.509381,27.848614 c -1.124778,0.0084 -3.511935,0.225693 -5.091412,0.313495 l 2.376953,-0.03125 c 3.124434,1.622424 7.249619,4.147883 7.111977,6.469324 l -2.33854,-6.529871 c 0,0 -0.164043,-0.235915 -2.058978,-0.221698 z m -9.931256,0.723652 c 1.736539,-0.197699 3.365783,-0.328215 4.839844,-0.410157 m -9.735906,1.239202 c 3.666301,0.586146 7.175784,2.897294 10.606999,6.069392 -1.823224,-2.30484 -0.704341,-4.805821 -5.710937,-6.898437 -1.907288,0.09284 -3.688954,0.269421 -4.896062,0.829045 z m -10.768694,4.482497 c 6.188173,1.522374 8.127088,2.294629 10.793662,2.877911 -1.978402,-1.858724 -5.029203,-3.717448 -5.083984,-5.576172 -2.6472,0.816756 -5.146392,1.649958 -5.709678,2.698261 z m 65.287801,11.278301 -6.82422,3.759766 7.45313,0.166016 z m 7.00977,8.382813 c 0,0 -10.7472,0.716553 -14.13086,2.80664 -3.38365,2.090051 13.55859,1.712891 13.55859,1.712891 0,0 4.28919,-1.104439 0.57227,-4.519531 z m -89.482424,10.55664 c -8.48631,0.02738 -14.326172,2.34375 -14.326172,2.34375 l -4.15625,5.767579 c 0,0 4.314922,3.690457 5.140625,4.421875 0.825707,0.73138 -4.205078,1.910156 -4.205078,1.910156 l 6.40625,4.851562 -3.552735,3.570313 9.728516,0.46875 c 0,0 3.101282,-3.089077 3.148437,-2.310547 0.04715,0.778567 7.669922,-5.212891 7.669922,-5.212891 -6.71632,1.850507 -12.500561,2.006421 -13.449219,2.251953 1.543337,-3.569508 5.836,-5.755994 13.576172,-9.853515 -7.979759,-1.864711 -11.997528,1.031981 -17.15039,2.998047 -2.010887,-0.567649 9.838919,-8.720733 14.958984,-11.064453 -1.31107,-0.102907 -2.576732,-0.14649 -3.789062,-0.142579 z m 81.841794,0.31836 c -1.50909,-0.02249 -2.71662,0.05176 -3,0.203125 -0.69626,0.371587 8.11396,3.555528 9.0625,4.716797 0.19394,-1.005024 1.12696,-3.904297 1.12696,-3.904297 -1.32046,-0.671647 -4.6743,-0.978138 -7.18946,-1.015625 z m 6.0625,4.919922 c -0.0602,0.312133 -0.0541,0.454591 0.0801,0.253906 0.0445,-0.06652 8.1e-4,-0.154902 -0.0801,-0.253906 z"
       style="opacity:0.75;vector-effect:none;fill:url(#radialGradient949);fill-opacity:1;stroke:none;stroke-width:0.41612422px;stroke-linecap:butt;stroke-linejoin:miter;stroke-miterlimit:4;stroke-dasharray:none;stroke-dashoffset:0;stroke-opacity:1;filter:url(#filter939)" />
  </g>
</svg>
