<?xml version="1.0" encoding="UTF-8" standalone="no"?>
<!-- Created with Inkscape (http://www.inkscape.org/) -->

<svg
   xmlns:dc="http://purl.org/dc/elements/1.1/"
   xmlns:cc="http://creativecommons.org/ns#"
   xmlns:rdf="http://www.w3.org/1999/02/22-rdf-syntax-ns#"
   xmlns:svg="http://www.w3.org/2000/svg"
   xmlns="http://www.w3.org/2000/svg"
   xmlns:xlink="http://www.w3.org/1999/xlink"
   xmlns:sodipodi="http://sodipodi.sourceforge.net/DTD/sodipodi-0.dtd"
   xmlns:inkscape="http://www.inkscape.org/namespaces/inkscape"
   width="256"
   height="256"
   viewBox="0 0 67.733332 67.733335"
   version="1.1"
   id="svg8"
   inkscape:version="0.92.5 (2060ec1f9f, 2020-04-08)"
   sodipodi:docname="urho_tire.svg"
   inkscape:export-filename="/home/frode/Creations/Karts/urho/urho_tire.png"
   inkscape:export-xdpi="96"
   inkscape:export-ydpi="96">
  <defs
     id="defs2">
    <linearGradient
       inkscape:collect="always"
       id="linearGradient1084">
      <stop
         style="stop-color:#141414;stop-opacity:1"
         offset="0"
         id="stop1080" />
      <stop
         style="stop-color:#232323;stop-opacity:0.5"
         offset="1"
         id="stop1082" />
    </linearGradient>
    <linearGradient
       inkscape:collect="always"
       id="linearGradient888">
      <stop
         id="stop886"
         offset="0"
         style="stop-color:#606060;stop-opacity:0;" />
      <stop
         id="stop884"
         offset="1"
         style="stop-color:#606060;stop-opacity:1;" />
    </linearGradient>
    <linearGradient
       inkscape:collect="always"
       id="linearGradient827">
      <stop
         style="stop-color:#000000;stop-opacity:1"
         offset="0"
         id="stop823" />
      <stop
         style="stop-color:#232323;stop-opacity:0;"
         offset="1"
         id="stop825" />
    </linearGradient>
    <linearGradient
       inkscape:collect="always"
       xlink:href="#linearGradient827"
       id="linearGradient882"
       gradientUnits="userSpaceOnUse"
       x1="33.866665"
       y1="263.13333"
       x2="37.921154"
       y2="263.13333"
       gradientTransform="matrix(1.5926483,0,0,1,-20.071021,0)" />
    <linearGradient
       inkscape:collect="always"
       xlink:href="#linearGradient888"
       id="linearGradient1074"
       gradientUnits="userSpaceOnUse"
       x1="4.3538613"
       y1="244.79002"
       x2="4.3538613"
       y2="245.99147"
       spreadMethod="reflect" />
    <radialGradient
       inkscape:collect="always"
       xlink:href="#linearGradient1084"
       id="radialGradient1086"
       cx="16.807661"
       cy="246.07433"
       fx="16.807661"
       fy="246.07433"
       r="15.344973"
       gradientUnits="userSpaceOnUse" />
  </defs>
  <sodipodi:namedview
     id="base"
     pagecolor="#ffffff"
     bordercolor="#666666"
     borderopacity="1.0"
     inkscape:pageopacity="0.0"
     inkscape:pageshadow="2"
     inkscape:zoom="2.3304445"
     inkscape:cx="98.725945"
     inkscape:cy="147.04613"
     inkscape:document-units="px"
     inkscape:current-layer="layer1"
     showgrid="false"
     inkscape:pagecheckerboard="true"
     units="px"
     inkscape:snap-page="true"
     inkscape:snap-global="true"
     inkscape:window-width="1920"
     inkscape:window-height="1061"
     inkscape:window-x="0"
     inkscape:window-y="0"
     inkscape:window-maximized="1"
     showguides="true"
     inkscape:guide-bbox="true" />
  <metadata
     id="metadata5">
    <rdf:RDF>
      <cc:Work
         rdf:about="">
        <dc:format>image/svg+xml</dc:format>
        <dc:type
           rdf:resource="http://purl.org/dc/dcmitype/StillImage" />
        <dc:title />
      </cc:Work>
    </rdf:RDF>
  </metadata>
  <g
     inkscape:label="Layer 1"
     inkscape:groupmode="layer"
     id="layer1"
     transform="translate(0,-229.26666)">
    <rect
       style="opacity:1;vector-effect:none;fill:#000000;fill-opacity:1;fill-rule:evenodd;stroke:none;stroke-width:17;stroke-linecap:round;stroke-linejoin:bevel;stroke-miterlimit:4;stroke-dasharray:none;stroke-dashoffset:0;stroke-opacity:1;marker:none"
       id="rect815"
       width="67.73333"
       height="67.73333"
       x="0"
       y="229.26666" />
    <rect
       y="229.26666"
       x="33.866665"
       height="67.73333"
       width="33.866669"
       id="rect817"
       style="opacity:1;vector-effect:none;fill:#2a2a2a;fill-opacity:1;fill-rule:evenodd;stroke:none;stroke-width:17;stroke-linecap:round;stroke-linejoin:bevel;stroke-miterlimit:4;stroke-dasharray:none;stroke-dashoffset:0;stroke-opacity:1;marker:none" />
    <use
       x="0"
       y="0"
       xlink:href="#rect821"
       id="use1398"
       transform="matrix(-1,0,0,1,101.6,0)"
       width="100%"
       height="100%" />
    <rect
       style="opacity:1;vector-effect:none;fill:url(#linearGradient882);fill-opacity:1;fill-rule:evenodd;stroke:none;stroke-width:17;stroke-linecap:round;stroke-linejoin:bevel;stroke-miterlimit:4;stroke-dasharray:none;stroke-dashoffset:0;stroke-opacity:1;marker:none"
       id="rect821"
       width="6.4573746"
       height="67.73333"
       x="33.866665"
       y="229.26666" />
    <circle
       style="opacity:1;vector-effect:none;fill:#393939;fill-opacity:1;fill-rule:evenodd;stroke:none;stroke-width:17;stroke-linecap:round;stroke-linejoin:bevel;stroke-miterlimit:4;stroke-dasharray:none;stroke-dashoffset:0;stroke-opacity:1;marker:none"
       id="path868"
       cx="16.807661"
       cy="246.07433"
       r="16.204868" />
    <circle
       r="15.344973"
       cy="246.07433"
       cx="16.807661"
       id="circle1078"
       style="opacity:1;vector-effect:none;fill:url(#radialGradient1086);fill-opacity:1;fill-rule:evenodd;stroke:none;stroke-width:17;stroke-linecap:round;stroke-linejoin:bevel;stroke-miterlimit:4;stroke-dasharray:none;stroke-dashoffset:0;stroke-opacity:1;marker:none" />
    <rect
       style="opacity:1;vector-effect:none;fill:url(#linearGradient1074);fill-opacity:1;fill-rule:evenodd;stroke:#000000;stroke-width:0.26458332;stroke-linecap:round;stroke-linejoin:round;stroke-miterlimit:4;stroke-dasharray:none;stroke-dashoffset:0;stroke-opacity:1;marker:none"
       id="rect870"
       width="31.851673"
       height="2.4024379"
       x="0.88182449"
       y="244.87311"
       rx="0.74241936"
       ry="0.74241936" />
    <use
       x="0"
       y="0"
       xlink:href="#rect870"
       id="use874"
       transform="rotate(90,16.807661,246.07433)"
       width="100%"
       height="100%"
       style="stroke:#000000;stroke-opacity:1;stroke-width:0.26458333;stroke-miterlimit:4;stroke-dasharray:none;stroke-linejoin:round" />
    <use
       height="100%"
       width="100%"
       transform="rotate(135,16.807662,246.07433)"
       id="use876"
       xlink:href="#rect870"
       y="0"
       x="0"
       style="stroke:#000000;stroke-opacity:1;stroke-width:0.26458333;stroke-miterlimit:4;stroke-dasharray:none;stroke-linejoin:round" />
    <use
       x="0"
       y="0"
       xlink:href="#rect870"
       id="use878"
       transform="rotate(-135,16.807664,246.07433)"
       width="100%"
       height="100%"
       style="stroke:#000000;stroke-opacity:1;stroke-width:0.26458333;stroke-miterlimit:4;stroke-dasharray:none;stroke-linejoin:round" />
    <circle
       r="3.1852057"
       cy="246.07433"
       cx="16.807661"
       id="circle872"
       style="opacity:1;vector-effect:none;fill:#1d1d1d;fill-opacity:1;fill-rule:evenodd;stroke:#000000;stroke-width:0.52916667;stroke-linecap:round;stroke-linejoin:bevel;stroke-miterlimit:4;stroke-dasharray:none;stroke-dashoffset:0;stroke-opacity:1;marker:none" />
    <g
       id="g1382"
       transform="matrix(0.89157524,0,0,1.0035603,4.4737766,-0.81625856)"
       style="stroke-width:1.05718076;opacity:0.42">
      <path
         sodipodi:nodetypes="ccccccccccccccccccccccccccccccccccccccccccccc"
         inkscape:connector-curvature="0"
         id="path1088"
         transform="matrix(0.26458333,0,0,0.26458333,0,229.26666)"
         d="m 150.0332,0 7.82813,7.6523438 -12.72656,12.7343752 12.72656,12.77539 -12.72656,12.732422 12.72656,12.777344 -12.72656,12.732422 12.72656,12.775391 -12.72656,12.734374 12.72656,12.775388 -12.72656,12.73438 12.72656,12.77539 -12.72656,12.73242 12.72656,12.77539 -12.72656,12.73438 12.72656,12.77539 -12.72656,12.73437 12.72656,12.77539 -12.72656,12.73438 12.72656,12.77539 -12.72656,12.73242 4.89843,5.12305 h 7.28711 l -5.11328,-5.12305 12.72656,-12.73242 -12.72656,-12.77539 12.72656,-12.73438 -12.72656,-12.77539 12.72656,-12.73437 -12.72656,-12.77539 12.72656,-12.73438 -12.72656,-12.77539 12.72656,-12.73242 -12.72656,-12.77539 12.72656,-12.73438 L 152.20703,96.914062 164.93359,84.179688 152.20703,71.404297 164.93359,58.671875 152.20703,45.894531 164.93359,33.162109 152.20703,20.386719 164.93359,7.6523438 157.32031,0 Z"
         style="color:#000000;font-style:normal;font-variant:normal;font-weight:normal;font-stretch:normal;font-size:medium;line-height:normal;font-family:sans-serif;font-variant-ligatures:normal;font-variant-position:normal;font-variant-caps:normal;font-variant-numeric:normal;font-variant-alternates:normal;font-feature-settings:normal;text-indent:0;text-align:start;text-decoration:none;text-decoration-line:none;text-decoration-style:solid;text-decoration-color:#000000;letter-spacing:normal;word-spacing:normal;text-transform:none;writing-mode:lr-tb;direction:ltr;text-orientation:mixed;dominant-baseline:auto;baseline-shift:baseline;text-anchor:start;white-space:normal;shape-padding:0;clip-rule:nonzero;display:inline;overflow:visible;visibility:visible;opacity:1;isolation:auto;mix-blend-mode:normal;color-interpolation:sRGB;color-interpolation-filters:linearRGB;solid-color:#000000;solid-opacity:1;vector-effect:none;fill:#212121;fill-opacity:1;fill-rule:nonzero;stroke:none;stroke-width:5.28590393;stroke-linecap:butt;stroke-linejoin:miter;stroke-miterlimit:4;stroke-dasharray:none;stroke-dashoffset:0;stroke-opacity:1;color-rendering:auto;image-rendering:auto;shape-rendering:auto;text-rendering:auto;enable-background:accumulate" />
      <use
         height="100%"
         width="100%"
         transform="translate(3.8613555)"
         id="use1375"
         xlink:href="#path1088"
         y="0"
         x="0"
         style="stroke-width:1.05718076" />
      <use
         x="0"
         y="0"
         xlink:href="#path1088"
         id="use1377"
         transform="translate(7.7227117)"
         width="100%"
         height="100%"
         style="stroke-width:1.05718076" />
    </g>
    <use
       x="0"
       y="0"
       xlink:href="#g1382"
       id="use1384"
       transform="matrix(-1,0,0,1,101.6,0)"
       width="100%"
       height="100%"
       style="stroke-width:1.05718076" />
  </g>
</svg>
