<?xml version="1.0" encoding="UTF-8" standalone="no"?>
<svg
   xmlns:dc="http://purl.org/dc/elements/1.1/"
   xmlns:cc="http://creativecommons.org/ns#"
   xmlns:rdf="http://www.w3.org/1999/02/22-rdf-syntax-ns#"
   xmlns:svg="http://www.w3.org/2000/svg"
   xmlns="http://www.w3.org/2000/svg"
   xmlns:xlink="http://www.w3.org/1999/xlink"
   xmlns:sodipodi="http://sodipodi.sourceforge.net/DTD/sodipodi-0.dtd"
   xmlns:inkscape="http://www.inkscape.org/namespaces/inkscape"
   version="1.1"
   viewBox="0 0 64 64"
   id="svg1029"
   sodipodi:docname="MapIcon.svg"
   inkscape:version="0.92.5 (2060ec1f9f, 2020-04-08)"
   width="64"
   height="64"
   inkscape:export-filename="/home/frode/.local/share/supertuxkart/addons/karts/TootsMapIcon.png"
   inkscape:export-xdpi="96.000008"
   inkscape:export-ydpi="96.000008">
  <metadata
     id="metadata1035">
    <rdf:RDF>
      <cc:Work
         rdf:about="">
        <dc:format>image/svg+xml</dc:format>
        <dc:type
           rdf:resource="http://purl.org/dc/dcmitype/StillImage" />
        <dc:title></dc:title>
      </cc:Work>
    </rdf:RDF>
  </metadata>
  <defs
     id="defs1033">
    <linearGradient
       id="linearGradient1095"
       inkscape:collect="always">
      <stop
         style="stop-color:#473110;stop-opacity:0.24705882"
         offset="0"
         id="stop1089" />
      <stop
         id="stop1091"
         offset="0.47312164"
         style="stop-color:#96774a;stop-opacity:0.31901839" />
      <stop
         style="stop-color:#000000;stop-opacity:0.32515338"
         offset="1"
         id="stop1093" />
    </linearGradient>
    <linearGradient
       inkscape:collect="always"
       id="linearGradient1065">
      <stop
         id="stop1063"
         offset="0"
         style="stop-color:#5d4522;stop-opacity:0;" />
      <stop
         style="stop-color:#5d4522;stop-opacity:0.02352941;"
         offset="0.47312164"
         id="stop1083" />
      <stop
         id="stop1061"
         offset="1"
         style="stop-color:#5d4522;stop-opacity:1;" />
    </linearGradient>
    <radialGradient
       inkscape:collect="always"
       xlink:href="#linearGradient1065"
       id="radialGradient1067"
       cx="104.34495"
       cy="282.01834"
       fx="104.34495"
       fy="282.01834"
       r="96.712494"
       gradientTransform="matrix(0.08283329,-0.03414437,0.00389008,0.00938247,8.6510858,24.32208)"
       gradientUnits="userSpaceOnUse" />
    <linearGradient
       inkscape:collect="always"
       xlink:href="#linearGradient1095"
       id="linearGradient1087"
       x1="83.764313"
       y1="75.555321"
       x2="273.19086"
       y2="75.555321"
       gradientUnits="userSpaceOnUse"
       gradientTransform="matrix(0.11015684,0,0,0.10983673,1.269606,8.2908705)" />
  </defs>
  <sodipodi:namedview
     pagecolor="#ffffff"
     bordercolor="#666666"
     borderopacity="1"
     objecttolerance="10"
     gridtolerance="10"
     guidetolerance="10"
     inkscape:pageopacity="0"
     inkscape:pageshadow="2"
     inkscape:window-width="1920"
     inkscape:window-height="1061"
     id="namedview1031"
     showgrid="false"
     inkscape:snap-global="false"
     inkscape:zoom="2.8284271"
     inkscape:cx="21.20162"
     inkscape:cy="37.189077"
     inkscape:window-x="0"
     inkscape:window-y="0"
     inkscape:window-maximized="1"
     inkscape:current-layer="svg1029"
     inkscape:pagecheckerboard="true" />
  <path
     class="st2"
     d="m 46.789387,29.155126 c 2.649787,10.206991 4.394409,16.542693 1.254563,22.9897 -3.050905,6.26439 -16.130335,8.044204 -21.259158,7.05875 C 20.99007,58.090173 17.5359,51.628218 16.771646,46.970646 16.55784,45.667642 15.758204,43.818331 15.758204,43.818331 c 0,0 -0.627894,4.404453 -3.910567,5.887245 -3.282674,1.493783 -6.179799,0.08788 -5.9374538,-4.009036 0,0 -2.8089994,-4.679046 -4.1418972,-8.775957 -1.33289781,-4.09691 2.1811055,-8.116934 8.62528,-6.4584 0.220314,-7.798407 7.005975,-14.35566 16.424385,-15.124517 9.407395,-0.779841 11.709673,4.250681 16.732825,4.470355 4.846901,0.219672 7.546302,-1.318041 10.079905,-3.844286 2.533613,-2.526244 -0.69488,-7.092781 3.344637,-9.7838278 0,0 -0.243952,-2.6257397 1.507694,-2.3336916 2.956067,0.4928585 1.68919,2.1508881 1.775039,2.785594 0,0 2.530889,0.2488892 2.22486,1.7916266 -0.306023,1.542735 -1.71885,1.8042318 -1.71885,1.8042318 0,0 0.90807,6.175414 -1.18491,9.470516 -2.092981,3.295101 -4.483941,7.710538 -12.789764,9.456942 -1.773525,0.153772 -3.249628,-0.428362 -3.249628,-0.428362"
     stroke-miterlimit="10"
     id="path955"
     style="fill:#826130;fill-opacity:1;stroke:#3f311c;stroke-width:3;stroke-linecap:round;stroke-linejoin:round;stroke-miterlimit:10;stroke-dasharray:none;stroke-opacity:1"
     inkscape:connector-curvature="0"
     sodipodi:nodetypes="cssscccscccscscscscc" />
  <path
     class="st4"
     d="m 5.678876,37.074356 c 0.804145,0.999514 2.2692308,4.195763 2.1811054,6.700041 -0.099141,2.51526 2.6217326,3.602644 4.0537706,1.427877 1.43204,-2.174768 1.828605,-6.414466 0.837192,-8.479396 -0.991411,-2.075915 -1.53118,-2.855755 -1.53118,-2.855755 0,0 -0.295726,1.049366 -1.6837017,1.247073 -1.3879764,0.197705 -1.9811331,-0.492585 -2.1497553,-1.137236 0,0 -0.046295,1.253107 -1.1371571,1.476047 -1.4298282,0.292214 -1.6608267,-0.762108 -1.6608267,-0.762108 0,0 0.2974234,1.394925 1.0905528,2.383457 z"
     id="path971"
     style="opacity:1;vector-effect:none;fill:#574020;fill-opacity:1;stroke:#3f311c;stroke-width:1;stroke-linecap:round;stroke-linejoin:round;stroke-miterlimit:10;stroke-dasharray:none;stroke-dashoffset:0;stroke-opacity:1"
     inkscape:connector-curvature="0"
     sodipodi:nodetypes="ccsccscscc" />
  <path
     d="m 37.712463,32.263506 c 0.143203,-0.933612 0.220313,-1.614599 -0.859224,-1.383942 -1.079537,0.230656 -7.688946,1.977061 -8.867625,2.229685 -1.189695,0.252625 -0.958364,1.329024 0.198282,1.977061 1.156646,0.648037 4.373227,2.548213 5.695108,2.372474 1.321882,-0.175739 2.500561,-0.417381 3.04033,-2.108865 0.539767,-1.680503 0.793129,-3.086413 0.793129,-3.086413 z"
     stroke-miterlimit="10"
     id="path975"
     inkscape:connector-curvature="0"
     style="fill:#2e2314;stroke:#2b2011;stroke-width:3;stroke-linecap:round;stroke-linejoin:round;stroke-miterlimit:10;stroke-dasharray:none" />
  <g
     transform="matrix(0.11015684,0,0,0.10983673,-16.815174,-8.8483834)"
     id="g979"
     style="stroke-width:27.27355194;stroke-miterlimit:10;stroke-dasharray:none">
    <path
       d="m 458.6,419.7 c -11.4,0 -36.3,-14.2 -46.9,-20.2 l -2.2,-1.3 c -5.1,-2.9 -8.4,-7.1 -7.9,-10.2 0.3,-2 2.3,-3.4 5.5,-4.1 5.5,-1.2 24,-5.9 41.8,-10.5 l 3.8,-1 c 15.9,4.2 28.4,14.9 33.4,28.7 l -0.2,0.7 c -4.5,14 -13.6,16.2 -25.9,17.8 -0.5,0.1 -0.9,0.1 -1.4,0.1 z"
       id="path977"
       inkscape:connector-curvature="0"
       style="fill:#ad4949;stroke-width:27.27355194;stroke-miterlimit:10;stroke-dasharray:none" />
  </g>
  <g
     transform="matrix(0.11015684,0,0,0.10983673,-16.815174,-8.8483834)"
     id="g985"
     style="stroke-width:27.27355194;stroke-miterlimit:10;stroke-dasharray:none">
    <path
       class="st33"
       d="m 404,397 c -3.6,-2.6 -5.6,-6.3 -5,-9.5 0.5,-2.8 2.7,-4.7 6.3,-5.4 5.8,-1.2 25.1,-6.2 43.7,-11 8.9,-2.3 17.5,-4.5 24.3,-6.2 l 3.4,15 z"
       id="path981"
       inkscape:connector-curvature="0"
       style="fill:#ffffff;stroke-width:27.27355194;stroke-miterlimit:10;stroke-dasharray:none" />
    <path
       class="st42"
       d="m 471.9,367.4 2.5,11.1 -70,16.4 c -2.5,-2.1 -3.9,-4.7 -3.5,-6.9 0.5,-2.6 3.2,-3.5 4.8,-3.9 5.8,-1.2 25.1,-6.2 43.8,-11 8.2,-2.1 16,-4.1 22.4,-5.7 m 3,-4.9 c -20.4,5.1 -61.2,15.8 -70,17.7 -10.3,2.2 -10.6,13 -1.3,19 l 75.6,-17.8 z"
       id="path983"
       inkscape:connector-curvature="0"
       style="fill:#7d7d65;stroke-width:27.27355194;stroke-miterlimit:10;stroke-dasharray:none" />
  </g>
  <path
     class="st2"
     d="m 27.776315,10.120432 c 0.473674,1.131319 0.319455,2.515261 0.297425,2.965592"
     stroke-miterlimit="10"
     id="path989"
     style="opacity:1;vector-effect:none;fill:none;fill-opacity:1;stroke:#3f311c;stroke-width:3;stroke-linecap:round;stroke-linejoin:round;stroke-miterlimit:10;stroke-dasharray:none;stroke-dashoffset:0;stroke-opacity:1"
     inkscape:connector-curvature="0" />
  <g
     transform="matrix(0.11015684,0,0,0.10983673,-16.815174,-8.8483834)"
     id="g993"
     style="stroke-width:27.27355194;stroke-miterlimit:10;stroke-dasharray:none">
    <path
       d="m 358.6,376.9 c 2.2,5.7 6.2,9.9 8.9,8.3 2.7,-1.6 2.9,-5.7 0.4,-12.4 -2.4,-6.6 -13.6,-29.8 -16.6,-34.3 -3,-4.5 -6.4,-5.8 -9.1,-4.2 -2.7,1.6 -1.9,5.5 -0.1,9.2 1.9,3.8 16.5,33.4 16.5,33.4 z"
       id="path991"
       inkscape:connector-curvature="0"
       style="stroke-width:27.27355194;stroke-miterlimit:10;stroke-dasharray:none" />
  </g>
  <path
     style="fill:#ffffff;stroke-width:3;stroke-miterlimit:10;stroke-dasharray:none"
     inkscape:connector-curvature="0"
     id="path995"
     d="m 25.848571,42.840784 c -0.473674,0 -0.96938,-0.05492 -1.45407,-0.175738 -2.335325,-0.571152 -3.62416,-2.361491 -4.020725,-3.73445 -0.25336,-0.878693 -0.176251,-1.636567 0.220314,-2.031979 0.352502,-0.362461 0.738051,-0.549184 1.1236,-0.549184 0.826176,0 1.586258,0.790825 1.960791,1.263123 0.837193,1.043449 1.630322,1.570665 2.357357,1.570665 0.583831,0 1.090553,-0.32951 1.509149,-0.988531 1.101568,-1.691485 1.398991,-3.745432 0.903286,-6.084955 -0.165236,-0.779841 0.03305,-1.230171 0.231329,-1.471812 0.198282,-0.252624 0.495706,-0.395412 0.804145,-0.395412 0.176251,0 0.330471,0.04393 0.462659,0.131803 2.004854,1.296074 2.225168,5.711511 1.498133,8.171854 -0.616879,2.064931 -2.632748,4.294616 -5.595968,4.294616 z"
     class="st33" />
  <path
     style="fill:#7d7d65;stroke-width:2;stroke-miterlimit:10;stroke-dasharray:none"
     inkscape:connector-curvature="0"
     id="path997"
     d="m 29.472731,30.462184 c 0.132189,0 0.242345,0.03295 0.341487,0.09885 0.837191,0.5382 1.432038,1.757388 1.674383,3.426906 0.220315,1.49378 0.110157,3.218217 -0.275392,4.503306 -0.319455,1.087384 -1.002427,2.108866 -1.905713,2.855756 -1.002427,0.834759 -2.203136,1.274105 -3.46994,1.274105 -0.462659,0 -0.925318,-0.05492 -1.398993,-0.175738 -2.247199,-0.549184 -3.480955,-2.27362 -3.855489,-3.580678 -0.231329,-0.790824 -0.165235,-1.482796 0.165236,-1.812306 0.319454,-0.318526 0.638909,-0.483281 0.96938,-0.483281 0.760082,0 1.509149,0.823775 1.795556,1.175252 0.881255,1.098368 1.729463,1.647552 2.522592,1.647552 0.660941,0 1.233756,-0.362461 1.696416,-1.087384 1.134615,-1.746404 1.443054,-3.844286 0.925317,-6.24971 -0.121173,-0.5382 -0.05508,-0.999515 0.187266,-1.28509 0.165236,-0.197706 0.396565,-0.307543 0.627894,-0.307543 m 0,-0.439347 c -0.73805,0 -1.553211,0.702955 -1.244772,2.130833 0.396565,1.82329 0.396565,3.954122 -0.870239,5.909216 -0.418596,0.648037 -0.881255,0.889678 -1.332897,0.889678 -0.903287,0 -1.773526,-0.966564 -2.181106,-1.482796 -0.418596,-0.527216 -1.222741,-1.340008 -2.137043,-1.340008 -0.418596,0 -0.848208,0.164755 -1.288835,0.615086 -1.211725,1.241154 0.220313,5.228228 3.910568,6.128889 0.517737,0.131804 1.024458,0.186722 1.509149,0.186722 2.941187,0 5.133308,-2.174767 5.805265,-4.448387 0.782114,-2.636081 0.506722,-7.073486 -1.586258,-8.424478 -0.165236,-0.109836 -0.374534,-0.164755 -0.583832,-0.164755 z"
     class="st42" />
  <path
     d="m 23.645435,39.644534 c 0.716019,0.186723 2.137043,0.219674 3.282673,-0.724921"
     stroke-miterlimit="10"
     id="path1001"
     inkscape:connector-curvature="0"
     style="fill:none;stroke:#7d7d65;stroke-width:0.5;stroke-linecap:round;stroke-linejoin:round;stroke-miterlimit:10;stroke-dasharray:none" />
  <path
     d="m 20.693231,35.547625 -1.883682,0.713939 c -0.550785,0.20869 -1.167663,-0.0659 -1.365945,-0.615086 -0.209298,-0.549184 0.06609,-1.16427 0.616877,-1.361976 l 1.883683,-0.713938 c 0.550784,-0.20869 1.167663,0.0659 1.365946,0.615086 0.209296,0.538198 -0.0661,1.153284 -0.616879,1.361975 z"
     id="path1005"
     style="fill:#a35e2e;fill-opacity:1;stroke-width:3;stroke-miterlimit:10;stroke-dasharray:none"
     inkscape:connector-curvature="0" />
  <g
     stroke-miterlimit="10"
     id="g1015"
     style="fill:none;stroke:#a77a39;stroke-width:18.18236923;stroke-linecap:round;stroke-linejoin:round;stroke-miterlimit:10;stroke-dasharray:none;stroke-opacity:1"
     transform="matrix(0.11015684,0,0,0.10983673,1.2696061,8.2908706)">
    <path
       class="st34"
       d="m 495.46035,21.976301 c -0.49394,-9.294947 3.05859,-21.83635757 10.10707,-25.8828206"
       id="path1007"
       style="stroke:#a77a39;stroke-width:18.18236923;stroke-miterlimit:10;stroke-dasharray:none;stroke-opacity:1"
       inkscape:connector-curvature="0"
       sodipodi:nodetypes="cc" />
    <path
       class="st34"
       d="m 474.327,95.7571 c 9.10202,-4.905053 25.14747,-21.998989 26.40404,-38.043431"
       id="path1009"
       style="stroke:#a77a39;stroke-width:18.18236923;stroke-miterlimit:10;stroke-dasharray:none;stroke-opacity:1"
       inkscape:connector-curvature="0"
       sodipodi:nodetypes="cc" />
    <path
       class="st34"
       d="m 384.227,121.257 c 15.7,1.4 33.6,-0.1 52.7,-6.6"
       id="path1011"
       style="stroke:#a77a39;stroke-width:18.18236923;stroke-miterlimit:10;stroke-dasharray:none;stroke-opacity:1"
       inkscape:connector-curvature="0" />
    <path
       class="st34"
       d="m 274.627,78.9571 c 19.9,3.5 36.4,12.2 56.1,23.6"
       id="path1013"
       style="stroke:#a77a39;stroke-width:18.18236923;stroke-miterlimit:10;stroke-dasharray:none;stroke-opacity:1"
       inkscape:connector-curvature="0" />
  </g>
  <path
     d="m 35.39917,36.239596 -0.716021,0.285575 c -0.539768,0.20869 -1.156647,-0.05492 -1.365944,-0.593118 l -0.07711,-0.197706 c -0.209297,-0.538201 0.05508,-1.153285 0.594848,-1.361975 l 0.71602,-0.285576 c 0.539767,-0.208691 1.156646,0.05492 1.365945,0.593118 l 0.07711,0.197707 c 0.220314,0.5382 -0.05508,1.153284 -0.594846,1.361975 z"
     id="path1025"
     inkscape:connector-curvature="0"
     style="fill:#b9655a;stroke-width:3;stroke-miterlimit:10;stroke-dasharray:none" />
  <path
     class="st2"
     d="m 15.758204,43.807348 c 0.198283,-1.537716 0.06609,-2.427393 0.06609,-2.427393"
     stroke-miterlimit="10"
     id="path1027"
     style="fill:#fbc16c;stroke:#3f311c;stroke-width:3;stroke-linecap:round;stroke-linejoin:round;stroke-miterlimit:10;stroke-dasharray:none;stroke-opacity:1"
     inkscape:connector-curvature="0" />
  <path
     style="opacity:1;vector-effect:none;fill:url(#radialGradient1067);fill-opacity:1;stroke:none;stroke-width:3;stroke-linecap:round;stroke-linejoin:round;stroke-miterlimit:10;stroke-dasharray:none;stroke-dashoffset:0;stroke-opacity:1"
     id="path1071"
     stroke-miterlimit="10"
     d="m 15.438749,24.552968 c -2.280246,0.373444 -4.064787,-0.03295 -4.813854,-3.009527 -0.7490655,-2.976576 1.872668,-6.469383 5.64003,-7.831358 3.767365,-1.361977 7.490666,-0.252625 7.490666,-0.252625 0,0 1.046491,-2.471327 1.410008,-3.8992046 0.363518,-1.4278778 1.465085,-1.5486978 2.5997,0.5711516 0,0 3.172518,-0.4503315 3.558068,2.943624 0.396564,3.393955 -2.280248,5.096424 -2.280248,5.096424 -2.490419,2.754917 -9.069578,4.254343 -13.60437,6.381515 z"
     class="st2"
     inkscape:connector-curvature="0"
     sodipodi:nodetypes="csscscccc" />
  <path
     class="st2"
     d="m 15.438749,24.552968 c -2.280246,0.373444 -4.064787,-0.03295 -4.813854,-3.009527 -0.7490655,-2.976576 1.872668,-6.469383 5.64003,-7.831358 3.767365,-1.361977 7.490666,-0.252625 7.490666,-0.252625 0,0 1.046491,-2.471327 1.410008,-3.8992046 0.363518,-1.4278778 1.465085,-1.5486978 2.5997,0.5711516 0,0 3.172518,-0.4503315 3.558068,2.943624 0.396564,3.393955 -2.280248,5.096424 -2.280248,5.096424"
     stroke-miterlimit="10"
     id="path987"
     style="opacity:1;vector-effect:none;fill:none;fill-opacity:1;stroke:#3f311c;stroke-width:3;stroke-linecap:round;stroke-linejoin:round;stroke-miterlimit:10;stroke-dasharray:none;stroke-dashoffset:0;stroke-opacity:1"
     inkscape:connector-curvature="0" />
  <path
     sodipodi:nodetypes="csscscccc"
     inkscape:connector-curvature="0"
     class="st2"
     d="m 15.438749,24.552968 c -2.280246,0.373444 -4.064787,-0.03295 -4.813854,-3.009527 -0.7490655,-2.976576 1.872668,-6.469383 5.64003,-7.831358 3.767365,-1.361977 7.490666,-0.252625 7.490666,-0.252625 0,0 1.046491,-2.471327 1.410008,-3.8992046 0.363518,-1.4278778 1.465085,-1.5486978 2.5997,0.5711516 0,0 3.172518,-0.4503315 3.558068,2.943624 0.396564,3.393955 -2.280248,5.096424 -2.280248,5.096424 -2.490419,2.754917 -9.069578,4.254343 -13.60437,6.381515 z"
     stroke-miterlimit="10"
     id="path1085"
     style="opacity:1;vector-effect:none;fill:url(#linearGradient1087);fill-opacity:1;stroke:none;stroke-width:3;stroke-linecap:round;stroke-linejoin:round;stroke-miterlimit:10;stroke-dasharray:none;stroke-dashoffset:0;stroke-opacity:1" />
</svg>
