<?xml version="1.0" encoding="UTF-8" standalone="no"?>
<!-- Created with Inkscape (http://www.inkscape.org/) -->

<svg
   width="512"
   height="512"
   viewBox="0 0 135.46666 135.46666"
   version="1.1"
   id="svg8"
   inkscape:version="1.1.2 (0a00cf5339, 2022-02-04)"
   sodipodi:docname="clockface.svg"
   inkscape:export-filename="../Resources/UI/ClockFace.png"
   inkscape:export-xdpi="96"
   inkscape:export-ydpi="96"
   xmlns:inkscape="http://www.inkscape.org/namespaces/inkscape"
   xmlns:sodipodi="http://sodipodi.sourceforge.net/DTD/sodipodi-0.dtd"
   xmlns:xlink="http://www.w3.org/1999/xlink"
   xmlns="http://www.w3.org/2000/svg"
   xmlns:svg="http://www.w3.org/2000/svg"
   xmlns:rdf="http://www.w3.org/1999/02/22-rdf-syntax-ns#"
   xmlns:cc="http://creativecommons.org/ns#"
   xmlns:dc="http://purl.org/dc/elements/1.1/">
  <defs
     id="defs2">
    <inkscape:path-effect
       effect="spiro"
       id="path-effect877"
       is_visible="true"
       lpeversion="1" />
  </defs>
  <sodipodi:namedview
     id="base"
     pagecolor="#cdcdcd"
     bordercolor="#666666"
     borderopacity="1.0"
     inkscape:pageopacity="0"
     inkscape:pageshadow="2"
     inkscape:zoom="1.6542969"
     inkscape:cx="255.69776"
     inkscape:cy="256"
     inkscape:document-units="px"
     inkscape:current-layer="layer1"
     showgrid="false"
     units="px"
     inkscape:pagecheckerboard="true"
     inkscape:snap-center="true"
     inkscape:snap-global="true"
     inkscape:window-width="1920"
     inkscape:window-height="1057"
     inkscape:window-x="0"
     inkscape:window-y="0"
     inkscape:window-maximized="1"
     inkscape:snap-page="true"
     fit-margin-top="0"
     fit-margin-left="0"
     fit-margin-right="0"
     fit-margin-bottom="0"
     inkscape:showpageshadow="false" />
  <metadata
     id="metadata5">
    <rdf:RDF>
      <cc:Work
         rdf:about="">
        <dc:format>image/svg+xml</dc:format>
        <dc:type
           rdf:resource="http://purl.org/dc/dcmitype/StillImage" />
      </cc:Work>
    </rdf:RDF>
  </metadata>
  <g
     inkscape:label="Layer 1"
     inkscape:groupmode="layer"
     id="layer1"
     transform="translate(4.4256337e-4,-263.13289)">
    <g
       id="g29174"
       transform="matrix(3.9998955,0,0,3.9998955,0.0013296,-789.37121)">
      <circle
         transform="rotate(23.466504)"
         r="15.361669"
         cy="250.16028"
         cx="127.05884"
         id="circle1199"
         style="opacity:1;vector-effect:none;fill:#aaaaaa;fill-opacity:1;fill-rule:evenodd;stroke:none;stroke-width:0.146217px;stroke-linecap:butt;stroke-linejoin:miter;stroke-miterlimit:4;stroke-dasharray:none;stroke-dashoffset:0;stroke-opacity:1;marker:none" />
      <g
         id="g1252">
        <g
           id="text1181"
           style="font-style:normal;font-weight:normal;font-size:10.5833px;line-height:1.25;font-family:sans-serif;letter-spacing:0px;word-spacing:0px;fill:#000000;fill-opacity:1;stroke:none;stroke-width:0.264583"
           aria-label="৪">
          <path
             id="path1241"
             style="font-size:8.11389px;stroke-width:0.264583"
             d="m 16.959711,272.37688 q -0.696381,0 -1.192288,-0.4326 -0.495908,-0.4326 -0.495908,-1.04457 0,-0.33764 0.200474,-0.64363 0.200473,-0.31653 0.538112,-0.51701 -0.305985,-0.25323 -0.474805,-0.55921 -0.158268,-0.30599 -0.158268,-0.60142 0,-0.52756 0.464253,-0.89685 0.464254,-0.3693 1.11843,-0.3693 0.611971,0 1.044571,0.3904 0.4326,0.37984 0.4326,0.92851 0,0.32708 -0.189922,0.63307 -0.179371,0.29543 -0.495908,0.4748 0.390396,0.17937 0.611971,0.52757 0.232127,0.33763 0.232127,0.73858 0,0.56977 -0.485356,0.97071 -0.474805,0.40095 -1.150083,0.40095 z m 0,-0.42205 q 0.506458,0 0.854649,-0.27433 0.358741,-0.28488 0.358741,-0.67528 0,-0.4537 -0.369293,-0.78079 -0.369292,-0.32709 -0.896853,-0.32709 -0.506459,0 -0.8652,0.29544 -0.348191,0.29543 -0.348191,0.70693 0,0.4326 0.369293,0.74913 0.369293,0.30599 0.896854,0.30599 z m -0.05276,-2.42678 q 0.453702,0 0.78079,-0.24268 0.327088,-0.25323 0.327088,-0.60142 0,-0.39039 -0.316537,-0.66473 -0.305985,-0.28488 -0.738585,-0.28488 -0.485356,0 -0.822995,0.26378 -0.337639,0.26378 -0.337639,0.63308 0,0.36929 0.327087,0.63307 0.327088,0.26378 0.780791,0.26378 z" />
        </g>
        <g
           id="text1185"
           style="font-style:normal;font-weight:normal;font-size:10.5833px;line-height:1.25;font-family:sans-serif;letter-spacing:0px;word-spacing:0px;fill:#000000;fill-opacity:1;stroke:none;stroke-width:0.264583"
           aria-label="১">
          <path
             id="path1238"
             style="font-size:8.11389px;stroke-width:0.264583"
             d="m 27.54465,281.97648 q -0.305985,0 -0.527561,-0.16882 -0.211024,-0.16882 -0.211024,-0.41149 0,-0.20048 0.147717,-0.33764 0.158268,-0.13717 0.379844,-0.13717 0.316536,0 0.538112,0.17937 0.221575,0.16882 0.200473,0.40095 0.464254,-0.12662 0.759688,-0.50646 0.295434,-0.37984 0.295434,-0.8652 0,-0.42205 -0.422049,-0.8652 -0.411497,-0.44315 -1.107878,-0.77024 -0.485356,-0.22157 -0.770239,-0.53811 -0.284883,-0.31654 -0.284883,-0.62252 0,-0.24268 0.137166,-0.48536 0.137166,-0.24268 0.390395,-0.4115 l 0.316537,0.26378 q -0.200474,0.16882 -0.316537,0.33764 -0.105512,0.15827 -0.105512,0.29544 0,0.20047 0.274332,0.44315 0.274331,0.24268 0.728034,0.4537 0.728034,0.33764 1.150083,0.85465 0.4326,0.51701 0.4326,1.04457 0,0.75969 -0.590868,1.30835 -0.580318,0.53811 -1.413864,0.53811 z" />
        </g>
        <g
           id="text1189"
           style="font-style:normal;font-weight:normal;font-size:10.5833px;line-height:1.25;font-family:sans-serif;letter-spacing:0px;word-spacing:0px;fill:#000000;fill-opacity:1;stroke:none;stroke-width:0.264583"
           aria-label="২">
          <path
             id="path1235"
             style="font-size:8.11389px;stroke-width:0.264583"
             d="m 18.846745,293.77895 q -0.643624,-0.91795 -1.551029,-1.60378 -0.907405,-0.69638 -1.98363,-1.08678 l 0.211025,-0.42205 q 0.274331,0.15827 0.559214,0.24268 0.295435,0.0739 0.60142,0.0739 0.611971,0 1.044571,-0.24268 0.4326,-0.25323 0.4326,-0.60142 0,-0.27433 -0.327088,-0.51701 -0.327088,-0.24268 -0.833546,-0.32709 -0.453703,-0.0844 -0.759688,-0.34819 -0.295434,-0.27433 -0.295434,-0.60142 0,-0.18992 0.08441,-0.35874 0.08441,-0.16882 0.232127,-0.27433 l 0.316537,0.21102 q -0.105512,0.0844 -0.158269,0.20048 -0.05276,0.10551 -0.05276,0.22157 0,0.20048 0.263781,0.37985 0.274332,0.17937 0.685829,0.25323 0.548664,0.095 0.907405,0.42204 0.358742,0.32709 0.358742,0.73859 0,0.50646 -0.485356,0.8652 -0.474805,0.34819 -1.150083,0.34819 0.738585,0.51701 1.308351,1.06567 0.569766,0.53812 0.960161,1.09733 l -0.369293,0.26378 z" />
        </g>
        <g
           id="text1193"
           style="font-style:normal;font-weight:normal;font-size:10.5833px;line-height:1.25;font-family:sans-serif;letter-spacing:0px;word-spacing:0px;fill:#000000;fill-opacity:1;stroke:none;stroke-width:0.264583"
           aria-label="৩">
          <path
             id="path1232"
             style="font-size:8.11389px;stroke-width:0.264583"
             d="m 6.7111797,281.75406 q -1.0445708,0 -1.8359124,-0.92851 -0.7913415,-0.92851 -0.907405,-2.28961 l 0.4220489,-0.0528 q 0.1055122,1.21339 0.7702391,2.03639 0.6752781,0.81244 1.5510294,0.81244 0.6119708,0 1.0445709,-0.46425 0.4326,-0.46426 0.4326,-1.11843 0,-0.61197 -0.3587415,-1.04457 -0.3481903,-0.4326 -0.8546489,-0.4326 -0.1899219,0 -0.3692927,0.0528 -0.1688195,0.0528 -0.3165366,0.15827 0.1477171,0 0.2532293,0.13717 0.1160634,0.13716 0.1160634,0.33764 0,0.17937 -0.1371659,0.30598 -0.1371658,0.11607 -0.337639,0.11607 -0.2215757,0 -0.379844,-0.14772 -0.1477171,-0.15827 -0.1477171,-0.37985 0,-0.41149 0.379844,-0.70693 0.3903952,-0.29543 0.9390586,-0.29543 0.6752782,0 1.1500831,0.55921 0.4853561,0.54867 0.4853561,1.34001 0,0.83354 -0.5592147,1.42441 -0.5486634,0.58032 -1.340005,0.58032 z" />
        </g>
      </g>
      <circle
         r="4.7620101"
         cy="250.16026"
         cx="127.05883"
         id="circle817"
         style="opacity:1;fill:#ead96a;fill-opacity:1;fill-rule:evenodd;stroke:#000000;stroke-width:0.132292;stroke-linecap:butt;stroke-linejoin:miter;stroke-miterlimit:4;stroke-dasharray:none;stroke-dashoffset:0;stroke-opacity:0.42;marker:none"
         transform="rotate(23.466504)" />
      <g
         id="g1266"
         transform="translate(-1.5734024e-6)">
        <use
           x="0"
           y="0"
           xlink:href="#g1171"
           id="use1175"
           transform="rotate(135,16.933333,280.06668)"
           width="100%"
           height="100%" />
        <use
           height="100%"
           width="100%"
           transform="rotate(45,16.933331,280.06668)"
           id="use1177"
           xlink:href="#g1171"
           y="0"
           x="0" />
        <use
           height="100%"
           width="100%"
           transform="rotate(90,16.933333,280.06668)"
           id="use1173"
           xlink:href="#g1171"
           y="0"
           x="0" />
        <g
           id="g1171">
          <rect
             style="opacity:1;vector-effect:none;fill:#000000;fill-opacity:1;fill-rule:evenodd;stroke:none;stroke-width:0.264583;stroke-linecap:butt;stroke-linejoin:miter;stroke-miterlimit:4;stroke-dasharray:none;stroke-dashoffset:0;stroke-opacity:1;marker:none"
             id="rect1013"
             width="0.59036648"
             height="2.9518325"
             x="16.638149"
             y="263.69733"
             rx="0.85689932"
             ry="0.85689932" />
          <use
             style="fill:none;fill-opacity:1;stroke:none;stroke-opacity:1"
             x="0"
             y="0"
             xlink:href="#rect1013"
             id="use1159"
             transform="translate(0,29.786871)"
             width="100%"
             height="100%" />
        </g>
      </g>
      <path
         inkscape:connector-curvature="0"
         style="opacity:1;vector-effect:none;fill:#ead96a;fill-opacity:1;fill-rule:evenodd;stroke:#000000;stroke-width:0.264583;stroke-linecap:butt;stroke-linejoin:miter;stroke-miterlimit:4;stroke-dasharray:none;stroke-dashoffset:0;stroke-opacity:1;marker:none"
         d="m 23.622371,264.65831 a 16.797612,16.797612 0 0 0 -22.0974063,8.71933 16.797612,16.797612 0 0 0 8.7193263,22.0974 16.797612,16.797612 0 0 0 22.097406,-8.71932 16.797612,16.797612 0 0 0 -8.719326,-22.09741 z m -0.664213,1.53003 a 15.12972,15.12972 0 0 1 7.85351,19.90316 15.12972,15.12972 0 0 1 -19.903164,7.85351 15.12972,15.12972 0 0 1 -7.853509,-19.90317 15.12972,15.12972 0 0 1 19.903163,-7.8535 z"
         id="path815" />
      <circle
         style="opacity:1;vector-effect:none;fill:#d5c247;fill-opacity:1;fill-rule:evenodd;stroke:#000000;stroke-width:0.146217px;stroke-linecap:butt;stroke-linejoin:miter;stroke-miterlimit:4;stroke-dasharray:none;stroke-dashoffset:0;stroke-opacity:0.55;marker:none"
         id="circle858"
         cx="127.05883"
         cy="250.16026"
         r="2.2647936"
         transform="rotate(23.466504)" />
    </g>
  </g>
</svg>
