<?xml version="1.0" encoding="UTF-8" standalone="no"?>
<!-- Created with Inkscape (http://www.inkscape.org/) -->

<svg
   width="4096"
   height="4096"
   viewBox="0 0 1083.7333 1083.7334"
   version="1.1"
   id="svg5"
   inkscape:version="1.1.2 (0a00cf5339, 2022-02-04)"
   sodipodi:docname="menu.svg"
   inkscape:export-filename="../Resources/UI/Menu.png"
   inkscape:export-xdpi="96"
   inkscape:export-ydpi="96"
   xmlns:inkscape="http://www.inkscape.org/namespaces/inkscape"
   xmlns:sodipodi="http://sodipodi.sourceforge.net/DTD/sodipodi-0.dtd"
   xmlns:xlink="http://www.w3.org/1999/xlink"
   xmlns="http://www.w3.org/2000/svg"
   xmlns:svg="http://www.w3.org/2000/svg">
  <sodipodi:namedview
     id="namedview7"
     pagecolor="#505050"
     bordercolor="#eeeeee"
     borderopacity="1"
     inkscape:pageshadow="0"
     inkscape:pageopacity="0"
     inkscape:pagecheckerboard="true"
     inkscape:document-units="px"
     showgrid="false"
     units="px"
     inkscape:snap-center="true"
     inkscape:zoom="0.19453337"
     inkscape:cx="2025.3595"
     inkscape:cy="1930.2601"
     inkscape:window-width="1920"
     inkscape:window-height="1057"
     inkscape:window-x="0"
     inkscape:window-y="0"
     inkscape:window-maximized="1"
     inkscape:current-layer="layer1"
     inkscape:snap-global="false" />
  <defs
     id="defs2">
    <linearGradient
       inkscape:collect="always"
       id="linearGradient1345">
      <stop
         style="stop-color:#0c2833;stop-opacity:0.83209348"
         offset="0"
         id="stop1341" />
      <stop
         style="stop-color:#0b2630;stop-opacity:0.70043296"
         offset="0.63724422"
         id="stop1543" />
      <stop
         style="stop-color:#103843;stop-opacity:0.57616836"
         offset="1"
         id="stop1343" />
    </linearGradient>
    <linearGradient
       inkscape:collect="always"
       id="linearGradient2234">
      <stop
         style="stop-color:#9595b3;stop-opacity:1"
         offset="0"
         id="stop2230" />
      <stop
         style="stop-color:#8383a4;stop-opacity:1"
         offset="0.12151089"
         id="stop3072" />
      <stop
         style="stop-color:#5e5e7e;stop-opacity:1"
         offset="0.5"
         id="stop2814" />
      <stop
         style="stop-color:#4a4a6d;stop-opacity:1"
         offset="0.79812205"
         id="stop3266" />
      <stop
         style="stop-color:#484870;stop-opacity:1"
         offset="1"
         id="stop2232" />
    </linearGradient>
    <linearGradient
       inkscape:collect="always"
       xlink:href="#linearGradient2234"
       id="linearGradient2236"
       x1="-20.706692"
       y1="188.62459"
       x2="-20.706692"
       y2="231.20192"
       gradientUnits="userSpaceOnUse"
       gradientTransform="translate(-1210.8488)" />
    <linearGradient
       inkscape:collect="always"
       xlink:href="#linearGradient2234"
       id="linearGradient4141"
       gradientUnits="userSpaceOnUse"
       x1="-20.706692"
       y1="188.62459"
       x2="-20.706692"
       y2="231.20192"
       gradientTransform="translate(-1266.0902,101.58827)" />
    <linearGradient
       inkscape:collect="always"
       xlink:href="#linearGradient2234"
       id="linearGradient4145"
       gradientUnits="userSpaceOnUse"
       gradientTransform="matrix(0.48164422,0,0,0.65188803,322.21901,-242.76779)"
       x1="-20.706692"
       y1="188.62459"
       x2="-20.706692"
       y2="231.20192" />
    <linearGradient
       inkscape:collect="always"
       xlink:href="#linearGradient2234"
       id="linearGradient856"
       gradientUnits="userSpaceOnUse"
       gradientTransform="matrix(0.66044141,0,0,0.66044141,-1019.7834,70.515662)"
       x1="-20.706692"
       y1="188.62459"
       x2="-20.706692"
       y2="231.20192" />
    <linearGradient
       inkscape:collect="always"
       xlink:href="#linearGradient2234"
       id="linearGradient940"
       gradientUnits="userSpaceOnUse"
       gradientTransform="matrix(0.66044141,0,0,0.66044141,-1055.7085,172.10392)"
       x1="-20.706692"
       y1="188.62459"
       x2="-20.706692"
       y2="231.20192" />
    <radialGradient
       inkscape:collect="always"
       xlink:href="#linearGradient1345"
       id="radialGradient1347"
       cx="1141.8628"
       cy="1836.899"
       fx="1141.8628"
       fy="1836.899"
       r="1783.7682"
       gradientTransform="matrix(1,0,0,1.011534,0,-21.186839)"
       gradientUnits="userSpaceOnUse" />
    <radialGradient
       inkscape:collect="always"
       xlink:href="#linearGradient1345"
       id="radialGradient2367"
       gradientUnits="userSpaceOnUse"
       gradientTransform="matrix(1,0,0,1.011534,0,-21.186839)"
       cx="1141.8628"
       cy="1836.899"
       fx="1141.8628"
       fy="1836.899"
       r="1783.7682" />
    <filter
       inkscape:collect="always"
       style="color-interpolation-filters:sRGB"
       id="filter2369"
       x="-0.051125988"
       y="-0.058320674"
       width="1.102252"
       height="1.1166413">
      <feGaussianBlur
         inkscape:collect="always"
         stdDeviation="68.498928"
         id="feGaussianBlur2371" />
    </filter>
  </defs>
  <g
     inkscape:label="Layer 1"
     inkscape:groupmode="layer"
     id="layer1">
    <rect
       style="fill:url(#linearGradient940);fill-opacity:1;fill-rule:evenodd;stroke:#2a3d4c;stroke-width:0.698965;stroke-miterlimit:4;stroke-dasharray:none;stroke-opacity:1"
       id="rect938"
       width="168.2123"
       height="26.974667"
       x="-1069.0345"
       y="295.76953"
       rx="8.9487219"
       ry="11.443716"
       inkscape:export-filename="../Resources/UI/Menu.png"
       inkscape:export-xdpi="96"
       inkscape:export-ydpi="96"
       transform="scale(-1,1)" />
    <rect
       style="fill:url(#linearGradient856);fill-opacity:1;fill-rule:evenodd;stroke:#2a3d4c;stroke-width:0.698965;stroke-miterlimit:4;stroke-dasharray:none;stroke-opacity:1"
       id="rect850"
       width="168.2123"
       height="26.974667"
       x="-1033.1095"
       y="194.18127"
       rx="8.9487219"
       ry="11.443716"
       inkscape:export-filename="../Resources/UI/Menu.png"
       inkscape:export-xdpi="96"
       inkscape:export-ydpi="96"
       transform="scale(-1,1)" />
    <rect
       style="fill:url(#linearGradient2236);fill-opacity:1;fill-rule:evenodd;stroke:#2a3d4c;stroke-width:1.05833;stroke-miterlimit:4;stroke-dasharray:none;stroke-opacity:1"
       id="rect35"
       width="254.69678"
       height="40.843391"
       x="-1231.0264"
       y="187.24692"
       rx="13.549607"
       ry="17.327375"
       inkscape:export-filename="../Resources/UI/Menu.png"
       inkscape:export-xdpi="96"
       inkscape:export-ydpi="96"
       transform="scale(-1,1)" />
    <rect
       style="fill:url(#linearGradient4141);fill-opacity:1;fill-rule:evenodd;stroke:#2a3d4c;stroke-width:1.05833;stroke-miterlimit:4;stroke-dasharray:none;stroke-opacity:1"
       id="rect4139"
       width="254.69678"
       height="40.843391"
       x="-1286.2677"
       y="288.83517"
       rx="13.549607"
       ry="17.327375"
       inkscape:export-filename="../Resources/UI/Menu.png"
       inkscape:export-xdpi="96"
       inkscape:export-ydpi="96"
       transform="scale(-1,1)" />
    <path
       id="path1722"
       style="fill:#000045;fill-opacity:0.818469;stroke:#008893;stroke-width:2.11666"
       inkscape:transform-center-y="1.5519703e-06"
       d="m -335.65269,169.35908 -31.19725,53.50379 h -350.03363 l -31.19726,-53.50379 31.19726,-53.50379 h 350.03363 z"
       sodipodi:nodetypes="ccccccc" />
    <g
       id="g2777"
       transform="translate(-1069.9208)">
      <path
         id="path2666"
         style="fill:#000045;fill-opacity:0.818469;stroke:#008893;stroke-width:2.11667;stroke-miterlimit:4;stroke-dasharray:none;stroke-opacity:1"
         inkscape:transform-center-y="4.918352e-06"
         d="M 136.57708,406.78862 58.58959,541.86669 136.57708,676.94474 Z" />
      <use
         x="0"
         y="0"
         xlink:href="#path2666"
         inkscape:transform-center-y="4.918352e-06"
         id="use2773"
         transform="matrix(-1,0,0,1,1056.1081,0)"
         width="100%"
         height="100%"
         inkscape:transform-center-x="4.4823766e-06" />
    </g>
    <g
       id="g848"
       transform="matrix(-1,0,0,1,1080.8992,0)">
      <path
         sodipodi:type="star"
         style="opacity:0.54835448;fill:url(#radialGradient2367);fill-opacity:1;fill-rule:evenodd;stroke:#396382;stroke-width:28.2791;stroke-miterlimit:4;stroke-dasharray:none;stroke-opacity:0.332966;filter:url(#filter2369)"
         id="path2365"
         inkscape:flatsided="true"
         sodipodi:sides="6"
         sodipodi:cx="1141.8628"
         sodipodi:cy="1836.899"
         sodipodi:r1="1767.4413"
         sodipodi:r2="1530.649"
         sodipodi:arg1="0"
         sodipodi:arg2="0.52359878"
         inkscape:rounded="0"
         inkscape:randomized="0"
         d="M 2909.3041,1836.899 2025.5834,3367.5481 H 258.14215 L -625.57849,1836.899 258.14215,306.25 l 1767.44125,0 z"
         transform="matrix(0.27637062,0,0,0.27637062,228.93521,89.279714)"
         inkscape:export-filename="../Resources/UI/Menu.png"
         inkscape:export-xdpi="96"
         inkscape:export-ydpi="96" />
      <path
         id="path4447"
         style="fill:#272734;fill-opacity:1;fill-rule:evenodd;stroke:#141d24;stroke-width:8;stroke-linejoin:round;stroke-miterlimit:4;stroke-dasharray:none;stroke-opacity:1"
         d="m 1001.2168,298.94922 -0.6211,1.05664 L 13.431641,2008.875 v 56.8203 L 1062.0293,3881.8828 1201.5586,3640.2656 v -56.8203 L 308.88477,2037.2812 1139.998,597.39062 h 1818.1524 l 139.5293,-241.61914 v -56.82226 z"
         transform="scale(0.26458334)"
         sodipodi:nodetypes="ccccccccccccc" />
      <path
         sodipodi:type="star"
         style="fill:url(#radialGradient1347);fill-opacity:1;fill-rule:evenodd;stroke:#396382;stroke-width:28.2791;stroke-miterlimit:4;stroke-dasharray:none;stroke-opacity:1"
         id="path31"
         inkscape:flatsided="true"
         sodipodi:sides="6"
         sodipodi:cx="1141.8628"
         sodipodi:cy="1836.899"
         sodipodi:r1="1767.4413"
         sodipodi:r2="1530.649"
         sodipodi:arg1="0"
         sodipodi:arg2="0.52359878"
         inkscape:rounded="0"
         inkscape:randomized="0"
         d="M 2909.3041,1836.899 2025.5834,3367.5481 H 258.14215 L -625.57849,1836.899 258.14215,306.25 l 1767.44125,0 z"
         transform="matrix(0.28073585,0,0,0.28073585,223.95071,29.35827)"
         inkscape:transform-center-x="-1.1857592e-06"
         inkscape:transform-center-y="1.0814181e-05"
         inkscape:export-filename="../Resources/UI/Menu.png"
         inkscape:export-xdpi="96"
         inkscape:export-ydpi="96" />
      <path
         id="path968"
         style="fill:#656586;fill-opacity:1;fill-rule:evenodd;stroke:#2d4251;stroke-width:2.11667;stroke-miterlimit:4;stroke-dasharray:none;stroke-opacity:1"
         d="M 264.74072,79.376479 C 177.6751,230.08421 90.615051,380.80189 3.5539301,531.51485 96.034581,691.69257 188.51478,851.87054 280.99534,1012.0477 293.30101,990.73874 305.60676,969.42929 317.91262,948.1199 237.73706,809.25165 157.56185,670.38318 77.386442,531.51485 152.1325,402.01842 226.87859,272.522 301.62467,143.02556 c 160.35081,0 320.70162,0 481.05243,0 12.30696,-21.30877 24.61271,-42.61826 36.9173,-63.928364 -184.89636,0 -369.7927,0 -554.68904,0 -0.0549,0.09305 -0.10976,0.186189 -0.16464,0.279283 z" />
      <rect
         style="fill:url(#linearGradient4145);fill-opacity:1;fill-rule:evenodd;stroke:#2a3d4c;stroke-width:0.593022;stroke-miterlimit:4;stroke-dasharray:none;stroke-opacity:1"
         id="rect4143"
         width="122.67323"
         height="26.625319"
         x="312.50064"
         y="-120.70377"
         rx="6.5260901"
         ry="11.295508"
         inkscape:export-filename="../Resources/UI/Menu.png"
         inkscape:export-xdpi="96"
         inkscape:export-ydpi="96"
         transform="scale(1,-1)"
         inkscape:tile-cx="373.83723"
         inkscape:tile-cy="113.32847"
         inkscape:tile-w="166.13228"
         inkscape:tile-h="27.218338"
         inkscape:tile-x0="290.77109"
         inkscape:tile-y0="99.719299" />
      <use
         x="0"
         y="0"
         inkscape:tiled-clone-of="#rect4143"
         xlink:href="#rect4143"
         transform="translate(166.13228)"
         id="use4149"
         width="100%"
         height="100%" />
      <use
         x="0"
         y="0"
         inkscape:tiled-clone-of="#rect4143"
         xlink:href="#rect4143"
         transform="translate(332.26456)"
         id="use4151"
         width="100%"
         height="100%" />
    </g>
  </g>
</svg>
