<?xml version="1.0" encoding="UTF-8" standalone="no"?>
<!-- Created with Inkscape (http://www.inkscape.org/) -->

<svg
   width="128"
   height="128"
   viewBox="0 0 33.866666 33.866668"
   version="1.1"
   id="svg5"
   sodipodi:docname="whip.svg"
   inkscape:export-filename="/home/frode/Creations/Games/Tux!/Resources/UI/Bullwhip.png"
   inkscape:export-xdpi="96.000008"
   inkscape:export-ydpi="96.000008"
   inkscape:version="1.1.2 (0a00cf5339, 2022-02-04)"
   xmlns:inkscape="http://www.inkscape.org/namespaces/inkscape"
   xmlns:sodipodi="http://sodipodi.sourceforge.net/DTD/sodipodi-0.dtd"
   xmlns:xlink="http://www.w3.org/1999/xlink"
   xmlns="http://www.w3.org/2000/svg"
   xmlns:svg="http://www.w3.org/2000/svg">
  <sodipodi:namedview
     id="namedview7"
     pagecolor="#505050"
     bordercolor="#eeeeee"
     borderopacity="1"
     inkscape:pageshadow="0"
     inkscape:pageopacity="0"
     inkscape:pagecheckerboard="0"
     inkscape:document-units="mm"
     showgrid="false"
     units="px"
     width="128px"
     inkscape:snap-global="false"
     inkscape:zoom="3.2310312"
     inkscape:cx="71.339453"
     inkscape:cy="98.111092"
     inkscape:window-width="1920"
     inkscape:window-height="1056"
     inkscape:window-x="0"
     inkscape:window-y="0"
     inkscape:window-maximized="1"
     inkscape:current-layer="layer1" />
  <defs
     id="defs2">
    <linearGradient
       inkscape:collect="always"
       id="linearGradient8870">
      <stop
         style="stop-color:#5f250a;stop-opacity:1"
         offset="0"
         id="stop8866" />
      <stop
         style="stop-color:#311a10;stop-opacity:0.44673881"
         offset="1"
         id="stop8868" />
    </linearGradient>
    <linearGradient
       inkscape:collect="always"
       id="linearGradient4898">
      <stop
         style="stop-color:#d7af83;stop-opacity:0.48405084"
         offset="0"
         id="stop4894" />
      <stop
         style="stop-color:#d7af83;stop-opacity:0.31094918"
         offset="1"
         id="stop4896" />
    </linearGradient>
    <linearGradient
       inkscape:collect="always"
       id="linearGradient4260">
      <stop
         style="stop-color:#311a10;stop-opacity:1;"
         offset="0"
         id="stop4256" />
      <stop
         style="stop-color:#311a10;stop-opacity:0.44673881"
         offset="1"
         id="stop4258" />
    </linearGradient>
    <inkscape:path-effect
       effect="powerstroke"
       id="path-effect4192"
       is_visible="true"
       lpeversion="1"
       offset_points="12.513608,1.2021403 | 8.9142123,0.55031373 | 7.6903642,0.57568169 | 4.6855891,0.36976071 | 0.91622864,0.24578299 | 13.946,2.1275978 | 12.972455,1.5077286"
       not_jump="false"
       sort_points="true"
       interpolator_type="CentripetalCatmullRom"
       interpolator_beta="0.2"
       start_linecap_type="zerowidth"
       linejoin_type="round"
       miter_limit="4"
       scale_width="1"
       end_linecap_type="zerowidth" />
    <inkscape:path-effect
       effect="powerstroke"
       id="path-effect4186"
       is_visible="true"
       lpeversion="1"
       offset_points="12.513608,1.2021403 | 8.9142123,0.55031373 | 7.6903642,0.57568169 | 4.6855891,0.36976071 | 0.91622864,0.24578299 | 13.946,2.1275978 | 12.972455,1.5077286"
       not_jump="false"
       sort_points="true"
       interpolator_type="CentripetalCatmullRom"
       interpolator_beta="0.2"
       start_linecap_type="zerowidth"
       linejoin_type="round"
       miter_limit="4"
       scale_width="1"
       end_linecap_type="zerowidth" />
    <inkscape:path-effect
       effect="powerstroke"
       id="path-effect3735"
       is_visible="true"
       lpeversion="1"
       offset_points="12.513608,1.2021403 | 8.9142123,0.55031373 | 7.6903642,0.57568169 | 4.6855891,0.36976071 | 0.91622864,0.24578299 | 13.946,2.1275978 | 12.972455,1.5077286"
       not_jump="false"
       sort_points="true"
       interpolator_type="CentripetalCatmullRom"
       interpolator_beta="0.2"
       start_linecap_type="zerowidth"
       linejoin_type="round"
       miter_limit="4"
       scale_width="1"
       end_linecap_type="zerowidth" />
    <inkscape:path-effect
       effect="powerstroke"
       id="path-effect3103"
       is_visible="true"
       lpeversion="1"
       offset_points="12.513608,1.2021403 | 8.9142123,0.55031373 | 7.6903642,0.57568169 | 4.6855891,0.36976071 | 0.91622864,0.24578299 | 13.946,2.1275978 | 12.972455,1.5077286"
       not_jump="false"
       sort_points="true"
       interpolator_type="CentripetalCatmullRom"
       interpolator_beta="0.2"
       start_linecap_type="zerowidth"
       linejoin_type="round"
       miter_limit="4"
       scale_width="1"
       end_linecap_type="zerowidth" />
    <inkscape:path-effect
       effect="powerstroke"
       id="path-effect1102"
       is_visible="true"
       lpeversion="1"
       offset_points="12.513608,1.2021403 | 8.9142123,0.55031373 | 7.6903642,0.57568169 | 4.6855891,0.36976071 | 0.91622864,0.24578299 | 13.946,2.1275978 | 12.972455,1.5077286"
       not_jump="false"
       sort_points="true"
       interpolator_type="CentripetalCatmullRom"
       interpolator_beta="0.2"
       start_linecap_type="zerowidth"
       linejoin_type="round"
       miter_limit="4"
       scale_width="1"
       end_linecap_type="zerowidth" />
    <filter
       inkscape:collect="always"
       style="color-interpolation-filters:sRGB"
       id="filter4252"
       x="-0.071273928"
       y="-0.057222607"
       width="1.1425479"
       height="1.1144452">
      <feGaussianBlur
         inkscape:collect="always"
         stdDeviation="2.7438259"
         id="feGaussianBlur4254" />
    </filter>
    <linearGradient
       inkscape:collect="always"
       xlink:href="#linearGradient8870"
       id="linearGradient4262"
       x1="96.171951"
       y1="98.039459"
       x2="69.056679"
       y2="132.96371"
       gradientUnits="userSpaceOnUse" />
    <clipPath
       clipPathUnits="userSpaceOnUse"
       id="clipPath4886">
      <path
         id="path4888"
         style="fill:none;fill-opacity:1;fill-rule:nonzero;stroke:#fe0000;stroke-width:0.377953;stroke-miterlimit:4;stroke-dasharray:none;stroke-opacity:1"
         d="m 62.58453,48.904198 c 0.27704,-0.02306 0.584402,-6.92e-4 0.857979,0.110551 0.204057,0.08296 0.367597,0.206475 0.487506,0.366198 0.100952,0.134476 0.169663,0.292649 0.210936,0.471266 0.03742,0.161159 0.05299,0.34337 0.04592,0.541058 -0.01285,0.359698 -0.102576,0.767819 -0.262715,1.129927 -0.07385,0.16698 -0.158211,0.313248 -0.245442,0.427046 -0.02759,0.03628 -0.05514,0.06826 -0.0816,0.09581 -0.05227,0.05446 -0.0997,0.08984 -0.134022,0.103483 -0.27481,0.244573 -0.582773,0.441566 -0.925811,0.589776 -0.319256,0.137915 -0.673969,0.23573 -1.065131,0.287282 -0.72339,0.09532 -1.566607,0.03061 -2.482636,-0.223975 -0.839811,-0.233461 -1.707643,-0.618723 -2.510736,-1.131488 -0.756703,-0.483145 -1.423552,-1.059768 -1.911073,-1.66797 -0.886798,-1.094011 -1.388269,-2.237189 -1.57053,-3.371369 -0.176692,-1.099612 -0.05718,-2.217369 0.334904,-3.293144 0.384443,-1.054775 1.030855,-2.066298 1.904164,-2.950663 0.861445,-0.872349 1.933561,-1.610082 3.15891,-2.129945 1.826805,-0.776564 3.796986,-1.113086 5.800249,-1.069289 2.009858,0.04396 4.039321,0.470676 5.963081,1.206252 1.944098,0.743346 3.75953,1.794002 5.32772,3.05954 1.599153,1.290519 2.920642,2.787174 3.877183,4.392374 0.636223,1.065796 1.041438,2.133558 1.259751,3.186924 0.222085,1.071602 0.253984,2.144001 0.126954,3.203686 -0.262715,2.191125 -1.207827,4.34815 -2.59497,6.330221 -1.077173,1.539156 -2.409861,2.957624 -3.878385,4.204547 -0.520188,0.441691 -1.062361,0.866181 -1.622929,1.270794 -2.162397,1.56079 -4.581404,2.813224 -7.028739,3.613025 -3.042345,0.999605 -6.258534,1.33553 -9.474553,1.094562 -3.207039,-0.240302 -6.396794,-1.053256 -9.382054,-2.335272 -2.993049,-1.285356 -5.757936,-3.032428 -8.116521,-5.118523 -2.378695,-2.103885 -4.321834,-4.532198 -5.686359,-7.157412 -1.68788,-3.235072 -2.435406,-6.47201 -2.440986,-9.541395 -0.0057,-3.135466 0.76186,-6.128841 2.136214,-8.829677 1.415086,-2.78088 3.473637,-5.253995 6.013048,-7.281546 2.636539,-2.105097 5.774035,-3.717719 9.252897,-4.731946 4.313563,-1.261877 8.737262,-1.565412 12.98298,-1.166785 4.526071,0.424949 8.85081,1.645563 12.732302,3.369552 3.178628,1.411809 6.054006,3.156876 8.562795,5.097044 0.833919,0.644909 1.619313,1.304769 2.356861,1.973513 3.46399,3.140855 5.940072,6.533174 7.590614,9.826043 2.204508,4.40366 3.060382,8.675146 3.035758,12.544807 -0.02532,3.962208 -0.97621,7.940538 -2.912451,11.68006 -1.705028,3.292973 -4.320215,6.66904 -8.083185,9.5928 -2.1257,1.651634 -4.689724,3.212167 -7.723487,4.483744 -1.432868,0.600574 -2.996666,1.148024 -4.692397,1.608268 -5.005495,1.362332 -10.632649,1.880252 -16.674023,1.227029 -5.316159,-0.57481 -10.841734,-2.05033 -16.201264,-4.518097 -4.935339,-2.272448 -9.6598,-5.358595 -13.739922,-9.198077 -3.864539,-3.636613 -7.109417,-7.913273 -9.331928,-12.684363 -2.421977,-5.186245 -3.475919,-10.453293 -3.29696,-15.550776 0.175562,-5.000625 1.539661,-9.83534 3.950448,-14.231568 2.399731,-4.376069 5.82863,-8.304315 10.117739,-11.512367 4.322491,-3.23302 9.488069,-5.711995 15.302227,-7.1937319 6.606671,-1.6904014 13.405693,-1.9981214 19.994472,-1.214492 6.841957,0.813741 13.411139,2.7967239 19.344128,5.5946109 6.290997,2.966716 11.79388,6.810657 16.286869,11.132226 4.90752,4.720286 8.52195,9.91583 10.88653,15.201757 3.09244,6.882797 4.36663,12.376627 4.71855,16.742303 0.44439,5.512864 -0.56012,9.596973 -1.72504,12.502609 -0.0803,0.200353 -0.16192,0.396265 -0.2445,0.587796 -1.83351,4.252653 -4.56629,7.282526 -6.5182,9.165275 -2.19856,2.120648 -5.285259,4.56573 -9.660308,7.286472 -0.439994,0.273638 -0.906376,0.551992 -1.399401,0.834674 -3.395248,1.91983 -8.429998,3.991348 -15.328679,6.200323 -5.961127,1.908763 -12.465634,3.654062 -19.063083,5.317316 -6.979018,1.759439 -13.497263,3.286719 -18.421012,4.634499 -3.206522,0.87772 -5.729274,1.67508 -7.60186,2.4776 -1.628135,0.69776 -2.745025,1.3915 -3.398151,2.12945 -2.037777,2.30242 -0.174906,7.15226 -0.15958,8.41944 0.673366,1.06835 1.752158,6.1528 4.587701,7.04157 0.917499,0.28758 2.202336,0.29983 3.944732,0.0468 1.99683,-0.29 4.608477,-0.93092 7.839868,-1.89489 4.903748,-1.46285 11.539135,-3.77263 18.495454,-6.52177 6.566245,-2.59499 13.176008,-5.48475 19.194576,-8.51303 7.073492,-3.55908 12.223299,-6.745289 16.226784,-9.654913 0.523709,-0.3807 1.022419,-0.74651 1.502429,-1.10013 4.81294,-3.545673 8.16006,-6.852627 10.67321,-9.832698 2.1293,-2.524898 5.43962,-6.903605 7.54834,-12.726096 0.096,-0.265021 0.19056,-0.535812 0.28331,-0.812398 1.37474,-4.099215 2.37791,-9.531285 1.57852,-16.424417 -0.62639,-5.401361 -2.35698,-11.727379 -5.91842,-19.218064 -2.94632,-6.186595 -7.28341,-12.08188 -12.94336,-17.306859 C 97.446832,14.415077 91.209697,10.248517 84.181703,7.0893205 77.552408,4.1093451 70.237454,2.0379055 62.62575,1.26242 55.291671,0.51521909 47.686683,0.9762326 40.28588,2.9942775 33.73257,4.7867695 27.877081,7.7158313 22.96465,11.533018 18.090789,15.320233 14.185417,19.951468 11.471898,25.124988 8.7419351,30.329862 7.2452703,36.031953 7.1410558,41.900835 7.0347604,47.88701 8.3771431,53.950377 11.208249,59.79172 c 2.617408,5.389432 6.340451,10.110958 10.64905,14.048478 4.550863,4.158916 9.756728,7.449864 15.139696,9.843609 5.849017,2.600991 11.865734,4.13003 17.658752,4.688134 6.588321,0.634726 12.746226,0.0076 18.248125,-1.5465 1.873191,-0.530377 3.604082,-1.156634 5.193612,-1.841938 3.365325,-1.450911 6.225211,-3.218683 8.610686,-5.091481 4.221789,-3.314452 7.209127,-7.146587 9.189649,-10.925026 2.249372,-4.291348 3.409002,-8.894903 3.487862,-13.517046 0.0772,-4.522964 -0.87447,-9.474852 -3.36163,-14.518469 -1.871168,-3.798491 -4.667841,-7.637105 -8.536599,-11.134906 -0.823412,-0.744458 -1.698724,-1.476226 -2.626504,-2.188821 -2.789567,-2.142573 -5.974601,-4.053455 -9.484085,-5.588037 -4.282916,-1.872779 -9.066766,-3.19014 -14.091538,-3.621392 -4.715943,-0.404747 -9.669551,-0.02838 -14.525019,1.441672 -3.950646,1.199399 -7.54161,3.0933 -10.571585,5.580197 -2.917847,2.394864 -5.299533,5.329046 -6.928175,8.652873 -1.583965,3.232651 -2.446154,6.818468 -2.382361,10.56181 0.06253,3.668969 1.01482,7.452087 3.002481,11.141938 1.629813,3.016463 3.890889,5.734053 6.577905,8.039803 2.665516,2.287302 5.75513,4.173506 9.070981,5.542984 3.308689,1.366518 6.845643,2.219875 10.413528,2.440493 3.58069,0.221405 7.186587,-0.195137 10.6139,-1.365452 2.738079,-0.939288 5.401001,-2.367606 7.761861,-4.115048 0.614109,-0.454548 1.208643,-0.931298 1.779791,-1.427622 1.608434,-1.397718 3.090935,-3.002041 4.30289,-4.768724 1.555105,-2.2669 2.693162,-4.845714 3.000619,-7.578633 0.14933,-1.327419 0.101897,-2.68859 -0.190223,-4.056439 -0.287433,-1.345882 -0.809034,-2.68507 -1.597674,-3.992575 -1.141781,-1.889862 -2.684372,-3.607238 -4.503682,-5.062988 -1.785021,-1.42831 -3.840019,-2.607209 -6.038037,-3.439869 -2.17491,-0.823903 -4.495275,-1.310521 -6.824946,-1.355295 -2.325687,-0.0447 -4.657761,0.351371 -6.847487,1.288937 -1.525236,0.653995 -2.870015,1.583902 -3.959535,2.697854 -1.103925,1.128676 -1.948241,2.448662 -2.45525,3.869284 -0.519488,1.455595 -0.680027,3.003376 -0.418197,4.542146 0.270803,1.591396 0.983312,3.118507 2.129934,4.502491 0.69905,0.838095 1.592376,1.563998 2.539722,2.137103 1.011912,0.612167 2.107903,1.06492 3.188209,1.324865 1.178018,0.283464 2.337978,0.338834 3.398657,0.137083 0.57651,-0.109644 1.116487,-0.293783 1.610835,-0.55121 0.532747,-0.277417 0.998698,-0.632731 1.396055,-1.052493 0.14434,-0.161915 0.256705,-0.336982 0.343824,-0.505538 0.04513,-0.08731 0.08519,-0.176315 0.120642,-0.26589 0.109228,-0.275905 0.178772,-0.567118 0.21566,-0.852079 0.07952,-0.613841 0.01323,-1.23058 -0.171288,-1.744456 -0.102879,-0.286224 -0.241588,-0.539154 -0.410669,-0.749715 -0.188749,-0.235011 -0.40642,-0.406352 -0.638498,-0.518891 -0.2688,-0.130356 -0.543791,-0.174728 -0.798195,-0.171099 -0.335206,0.0049 -0.652792,0.09173 -0.907468,0.178356 z"
         sodipodi:nodetypes="cscsssssssssssc" />
    </clipPath>
    <filter
       inkscape:collect="always"
       style="color-interpolation-filters:sRGB"
       id="filter4890"
       x="-0.024212265"
       y="-0.021371087"
       width="1.0484245"
       height="1.0427422">
      <feGaussianBlur
         inkscape:collect="always"
         stdDeviation="1.0872073"
         id="feGaussianBlur4892" />
    </filter>
    <linearGradient
       inkscape:collect="always"
       xlink:href="#linearGradient4898"
       id="linearGradient4900"
       x1="39.431313"
       y1="100.4894"
       x2="30.644379"
       y2="114.37565"
       gradientUnits="userSpaceOnUse" />
    <clipPath
       clipPathUnits="userSpaceOnUse"
       id="clipPath5665">
      <path
         id="path5667"
         style="fill:none;fill-opacity:1;fill-rule:nonzero;stroke:#fe0000;stroke-width:0.377953;stroke-miterlimit:4;stroke-dasharray:none;stroke-opacity:1"
         d="m 64.58453,50.904198 c 0.27704,-0.02306 0.584402,-6.92e-4 0.857979,0.110551 0.204057,0.08296 0.367597,0.206475 0.487506,0.366198 0.100952,0.134476 0.169663,0.292649 0.210936,0.471266 0.03742,0.161159 0.05299,0.34337 0.04592,0.541058 -0.01285,0.359698 -0.102576,0.767819 -0.262715,1.129927 -0.07385,0.16698 -0.158211,0.313248 -0.245442,0.427046 -0.02759,0.03628 -0.05514,0.06826 -0.0816,0.09581 -0.05227,0.05446 -0.0997,0.08984 -0.134022,0.103483 -0.27481,0.244573 -0.582773,0.441566 -0.925811,0.589776 -0.319256,0.137915 -0.673969,0.23573 -1.065131,0.287282 -0.72339,0.09532 -1.566607,0.03061 -2.482636,-0.223975 -0.839811,-0.233461 -1.707643,-0.618723 -2.510736,-1.131488 -0.756703,-0.483145 -1.423552,-1.059768 -1.911073,-1.66797 -0.886798,-1.094011 -1.388269,-2.237189 -1.57053,-3.371369 -0.176692,-1.099612 -0.05718,-2.217369 0.334904,-3.293144 0.384443,-1.054775 1.030855,-2.066298 1.904164,-2.950662 0.861445,-0.872349 1.933561,-1.610082 3.15891,-2.129945 1.826805,-0.776565 3.796986,-1.113087 5.800249,-1.06929 2.009858,0.04396 4.039321,0.470676 5.963081,1.206253 1.944098,0.743346 3.75953,1.794002 5.32772,3.059539 1.599153,1.290519 2.920642,2.787174 3.877183,4.392374 0.636223,1.065796 1.041438,2.133558 1.259751,3.186924 0.222085,1.071602 0.253984,2.144001 0.126954,3.203686 -0.262715,2.191125 -1.207827,4.34815 -2.59497,6.330221 -1.077173,1.539156 -2.409861,2.957624 -3.878385,4.204547 -0.520188,0.441691 -1.062361,0.866181 -1.622929,1.270794 -2.162397,1.56079 -4.581404,2.813224 -7.028739,3.613025 -3.042345,0.999605 -6.258534,1.33553 -9.474553,1.094562 -3.207039,-0.240302 -6.396794,-1.053256 -9.382054,-2.335272 -2.993049,-1.285356 -5.757936,-3.032428 -8.11652,-5.118523 -2.378696,-2.103885 -4.321835,-4.532198 -5.68636,-7.157412 -1.68788,-3.235072 -2.435406,-6.47201 -2.440986,-9.541395 -0.0057,-3.135466 0.76186,-6.12884 2.136214,-8.829677 1.415086,-2.78088 3.473637,-5.253995 6.013049,-7.281546 2.636538,-2.105097 5.774034,-3.717719 9.252896,-4.731946 4.313563,-1.261877 8.737262,-1.565412 12.98298,-1.166785 4.526071,0.424949 8.85081,1.645563 12.732302,3.369552 3.178628,1.411809 6.054006,3.156876 8.562795,5.097044 0.833919,0.644909 1.619313,1.304769 2.356861,1.973513 3.46399,3.140855 5.940072,6.533175 7.590614,9.826043 2.204508,4.40366 3.060382,8.675146 3.035758,12.544807 -0.02532,3.962208 -0.97621,7.940538 -2.912451,11.68006 -1.705028,3.292973 -4.320215,6.66904 -8.083185,9.5928 -2.1257,1.651634 -4.689724,3.212167 -7.723487,4.483744 -1.432868,0.600574 -2.996666,1.148024 -4.692397,1.608268 -5.005495,1.362332 -10.632649,1.880252 -16.674023,1.227029 -5.316159,-0.57481 -10.841734,-2.05033 -16.201263,-4.518097 -4.93534,-2.272448 -9.659801,-5.358595 -13.739923,-9.198077 -3.864539,-3.636613 -7.109417,-7.913273 -9.331928,-12.684363 -2.421977,-5.186245 -3.475919,-10.453293 -3.29696,-15.550776 0.175562,-5.000625 1.539661,-9.83534 3.950448,-14.231568 2.399731,-4.376069 5.82863,-8.304315 10.117739,-11.512367 4.322491,-3.23302 9.488069,-5.711995 15.302227,-7.193732 6.606671,-1.6904013 13.405693,-1.9981213 19.994472,-1.2144919 6.841957,0.8137409 13.411139,2.7967239 19.344128,5.5946109 6.290997,2.966716 11.79388,6.810657 16.286869,11.132226 4.90752,4.720286 8.52195,9.91583 10.88653,15.201758 3.09244,6.882796 4.36663,12.376626 4.71855,16.742302 0.44439,5.512864 -0.56012,9.596973 -1.72504,12.502609 -0.0803,0.200353 -0.16192,0.396265 -0.2445,0.587796 -1.83351,4.252653 -4.56629,7.282526 -6.5182,9.165275 -2.19856,2.120648 -5.28526,4.56573 -9.660308,7.286472 -0.439994,0.273638 -0.906376,0.551992 -1.399401,0.834674 -3.395248,1.91983 -8.429998,3.991348 -15.328679,6.200323 -5.961127,1.908763 -12.465634,3.654062 -19.063083,5.317315 -6.979018,1.75944 -13.497263,3.28672 -18.421012,4.6345 -3.206522,0.87772 -5.729274,1.67508 -7.60186,2.4776 -1.628135,0.69776 -2.745025,1.3915 -3.398151,2.12945 -2.037777,2.30242 -0.174906,7.15226 -0.15958,8.41944 0.673366,1.06835 1.752158,6.1528 4.587701,7.04157 0.917499,0.28758 2.202336,0.29983 3.944733,0.0468 1.99683,-0.29 4.608476,-0.93092 7.839867,-1.89489 4.903748,-1.46285 11.539135,-3.77263 18.495454,-6.52177 6.566245,-2.59499 13.176008,-5.48475 19.194576,-8.51303 7.073492,-3.55908 12.223299,-6.74529 16.226783,-9.654913 0.52371,-0.3807 1.02242,-0.74651 1.50243,-1.10013 4.81294,-3.545673 8.16006,-6.852627 10.67321,-9.832698 2.1293,-2.524898 5.43962,-6.903605 7.54834,-12.726096 0.096,-0.265021 0.19056,-0.535812 0.28331,-0.812398 1.37474,-4.099215 2.37791,-9.531285 1.57852,-16.424417 -0.62639,-5.401361 -2.35698,-11.727379 -5.91842,-19.218064 -2.94632,-6.186595 -7.28341,-12.08188 -12.94336,-17.306859 C 99.446832,16.415077 93.209697,12.248517 86.181703,9.0893205 79.552408,6.1093452 72.237454,4.0379056 64.62575,3.26242 57.291671,2.5152191 49.686683,2.9762326 42.285881,4.9942776 35.73257,6.7867696 29.877081,9.7158313 24.96465,13.533018 c -4.873861,3.787215 -8.779233,8.41845 -11.492752,13.59197 -2.729963,5.204874 -4.2266277,10.906965 -4.3308422,16.775847 -0.1062954,5.986175 1.2360872,12.049542 4.0671932,17.890885 2.617408,5.389432 6.340451,10.110958 10.64905,14.048478 4.550863,4.158916 9.756728,7.449864 15.139696,9.843609 5.849017,2.600991 11.865734,4.13003 17.658752,4.688134 6.588321,0.634726 12.746226,0.0076 18.248125,-1.5465 1.873191,-0.530377 3.604082,-1.156634 5.193612,-1.841938 3.365325,-1.450911 6.225211,-3.218683 8.610686,-5.091481 4.221789,-3.314452 7.209127,-7.146587 9.189649,-10.925026 2.249371,-4.291348 3.409001,-8.894903 3.487861,-13.517046 0.0772,-4.522964 -0.87447,-9.474852 -3.361629,-14.518469 -1.871168,-3.798491 -4.667841,-7.637105 -8.536599,-11.134906 -0.823412,-0.744458 -1.698724,-1.476226 -2.626504,-2.188821 -2.789567,-2.142573 -5.974601,-4.053455 -9.484085,-5.588037 -4.282916,-1.872779 -9.066766,-3.19014 -14.091538,-3.621392 -4.715943,-0.404747 -9.669551,-0.02838 -14.525019,1.441672 -3.950646,1.199399 -7.541609,3.0933 -10.571585,5.580197 -2.917847,2.394864 -5.299533,5.329046 -6.928175,8.652873 -1.583965,3.232651 -2.446154,6.818468 -2.382361,10.56181 0.06253,3.668969 1.01482,7.452087 3.002481,11.141938 1.629813,3.016463 3.890889,5.734053 6.577905,8.039803 2.665517,2.287302 5.75513,4.173506 9.070981,5.542984 3.308689,1.366518 6.845643,2.219875 10.413528,2.440493 3.58069,0.221405 7.186587,-0.195137 10.6139,-1.365452 2.738079,-0.939288 5.401001,-2.367606 7.761861,-4.115048 0.614109,-0.454548 1.208643,-0.931298 1.779791,-1.427622 1.608434,-1.397718 3.090935,-3.002041 4.30289,-4.768724 1.555105,-2.2669 2.693162,-4.845714 3.000619,-7.578633 0.14933,-1.327419 0.101897,-2.68859 -0.190223,-4.056439 -0.287433,-1.345882 -0.809034,-2.68507 -1.597674,-3.992575 -1.141781,-1.889862 -2.684372,-3.607238 -4.503682,-5.062987 -1.785021,-1.42831 -3.840019,-2.60721 -6.038037,-3.43987 -2.17491,-0.823903 -4.495275,-1.310521 -6.824946,-1.355295 -2.325687,-0.0447 -4.657761,0.351371 -6.847487,1.288937 -1.525236,0.653995 -2.870015,1.583902 -3.959535,2.697855 -1.103925,1.128676 -1.948241,2.448661 -2.45525,3.869283 -0.519488,1.455595 -0.680027,3.003376 -0.418197,4.542146 0.270803,1.591396 0.983312,3.118507 2.129934,4.502491 0.69905,0.838095 1.592376,1.563998 2.539722,2.137103 1.011912,0.612167 2.107903,1.06492 3.188209,1.324865 1.178018,0.283464 2.337978,0.338834 3.398657,0.137083 0.57651,-0.109644 1.116487,-0.293783 1.610835,-0.55121 0.532747,-0.277417 0.998698,-0.632731 1.396055,-1.052493 0.14434,-0.161915 0.256705,-0.336982 0.343824,-0.505538 0.04513,-0.08731 0.08519,-0.176315 0.120642,-0.26589 0.109228,-0.275905 0.178772,-0.567118 0.21566,-0.852079 0.07952,-0.613841 0.01323,-1.23058 -0.171288,-1.744456 -0.102879,-0.286224 -0.241588,-0.539154 -0.410669,-0.749715 -0.188749,-0.235011 -0.40642,-0.406352 -0.638498,-0.518891 -0.2688,-0.130356 -0.543791,-0.174728 -0.798195,-0.171099 -0.335206,0.0049 -0.652792,0.09173 -0.907468,0.178356 z"
         sodipodi:nodetypes="cscsssssssssssc" />
    </clipPath>
    <linearGradient
       inkscape:collect="always"
       xlink:href="#linearGradient4260"
       id="linearGradient7649"
       gradientUnits="userSpaceOnUse"
       x1="96.171951"
       y1="98.039459"
       x2="69.056679"
       y2="132.96371"
       gradientTransform="translate(-0.44788513,1.8355327)" />
    <filter
       inkscape:collect="always"
       style="color-interpolation-filters:sRGB"
       id="filter8706"
       x="-0.043034411"
       y="-0.040202919"
       width="1.0860688"
       height="1.0804058">
      <feGaussianBlur
         inkscape:collect="always"
         stdDeviation="1.9823759"
         id="feGaussianBlur8704" />
    </filter>
  </defs>
  <g
     inkscape:label="Layer 1"
     inkscape:groupmode="layer"
     id="layer1">
    <path
       id="path3099"
       style="fill:#000000;fill-opacity:1;fill-rule:nonzero;stroke:none;stroke-width:0.264583"
       d="M 25.696375,3.7915772 C 20.782526,0.25980404 13.997845,-0.97413342 8.356751,1.4981994 4.4723784,3.1553745 1.4064072,6.960604 1.2561908,11.266641 c -0.2300405,4.275029 2.354814,8.290657 5.8656179,10.55927 4.1896663,2.801439 9.9453013,3.625575 14.4972253,1.207164 3.200091,-1.630235 5.45076,-5.19145 5.048593,-8.831251 C 26.280656,10.17589 23.079083,6.9064521 19.390542,5.5676934 15.849753,4.2051093 11.394684,4.5302957 8.590549,7.2806436 6.5374582,9.2054422 5.8498182,12.435372 7.0762197,14.99159 8.992447,19.206109 14.687073,21.367286 18.821853,19.114399 20.834806,18.033407 22.729011,15.955454 22.469559,13.518746 22.069444,11.035025 19.577737,9.3239606 17.177649,9.1389531 15.25633,8.9221443 13.020133,10.085975 12.73379,12.13387 c -0.39772,2.183441 2.207888,4.225077 4.211548,3.241549 1.078091,-0.410185 1.092852,-2.306768 -0.111294,-2.514374 -0.725687,-0.119658 -1.309478,0.674091 -1.939794,0.686679 -0.8842,-0.684581 -0.40104,-2.05472 0.546428,-2.404799 1.939902,-0.844488 4.461717,0.320688 5.214263,2.261868 0.396234,1.645949 -1.00228,3.078008 -2.286098,3.878462 -3.303481,2.085147 -8.155836,0.230778 -9.564402,-3.316213 -0.868904,-2.092421 0.117654,-4.588081 1.979319,-5.782264 2.986566,-1.9908802 7.076974,-1.406868 9.943965,0.5232052 2.487454,1.5860738 4.312727,4.5941878 3.688697,7.6033268 -0.607836,3.118581 -3.548309,5.276509 -6.567443,5.76081 C 13.044226,22.924254 7.614261,20.607632 5.0080046,16.364845 3.4060982,13.800403 3.2487936,10.345629 4.9018864,7.7638303 6.934931,4.4207242 11.009058,2.8666058 14.796797,3.0009473 c 3.049704,0.044371 6.217461,1.18107 8.604098,2.8174999 2.667513,1.787705 4.678864,4.5176708 5.498658,7.6312018 0.653359,2.071015 0.625932,4.704548 -0.83335,6.527241 -1.161531,1.503806 -2.774936,2.591848 -4.413242,3.422815 -4.730941,2.103477 -9.879435,2.801734 -14.786205,4.36486 -0.922338,0.289613 -1.9923776,0.928692 -1.885326,2.045418 0.077778,1.24579 0.4164464,2.574475 1.30614,3.493617 1.00168,0.727505 2.311143,0.164248 3.392032,-0.06498 4.53236,-1.373776 8.971337,-3.150069 13.074104,-5.529194 3.201934,-1.928232 6.329751,-4.560156 7.447383,-8.263937 C 33.309704,15.780174 32.096241,11.855652 30.251659,8.6476111 29.090417,6.7351676 27.506477,5.0987627 25.696375,3.7915772 Z"
       sodipodi:nodetypes="ccccccccccccccccccccccccccccccccccccccc" />
    <path
       id="path880"
       style="fill:#986238;fill-opacity:1;fill-rule:nonzero;stroke:#4a0a1e;stroke-width:0.396875;stroke-miterlimit:4;stroke-dasharray:none;stroke-opacity:0.851146"
       d="m 16.44032,13.424887 c 0.0733,-0.0061 0.154623,-1.83e-4 0.227007,0.02925 0.05399,0.02195 0.09726,0.05463 0.128986,0.09689 0.02671,0.03558 0.04489,0.07743 0.05581,0.124689 0.0099,0.04264 0.01402,0.09085 0.01215,0.143155 -0.0034,0.09517 -0.02714,0.203152 -0.06951,0.29896 -0.01954,0.04418 -0.04186,0.08288 -0.06494,0.112989 -0.0073,0.0096 -0.01459,0.01806 -0.02159,0.02535 -0.01383,0.01441 -0.02638,0.02377 -0.03547,0.02738 -0.07271,0.06471 -0.154192,0.116831 -0.244954,0.156045 -0.08447,0.03649 -0.178321,0.06237 -0.281816,0.07601 -0.191397,0.02522 -0.414498,0.0081 -0.656864,-0.05926 -0.2222,-0.06177 -0.451814,-0.163704 -0.664299,-0.299373 -0.200211,-0.127832 -0.376648,-0.280397 -0.505638,-0.441317 -0.234632,-0.289457 -0.367313,-0.591923 -0.415536,-0.892008 -0.04675,-0.290939 -0.01513,-0.586679 0.08861,-0.871311 0.101717,-0.279076 0.272747,-0.546708 0.50381,-0.780696 0.227924,-0.230809 0.511588,-0.426001 0.835795,-0.563548 0.483342,-0.205466 1.004619,-0.294504 1.534649,-0.282916 0.531775,0.01163 1.068737,0.124533 1.577732,0.319153 0.514376,0.196678 0.994709,0.474664 1.409626,0.809504 0.423109,0.34145 0.772753,0.73744 1.025838,1.162149 0.168334,0.281992 0.275547,0.564504 0.333309,0.843207 0.05876,0.283528 0.0672,0.567267 0.03359,0.847642 -0.06951,0.579735 -0.319571,1.150448 -0.686586,1.674871 -0.285002,0.407235 -0.637609,0.782538 -1.026156,1.112453 -0.137633,0.116864 -0.281083,0.229177 -0.4294,0.336231 -0.572134,0.412959 -1.212163,0.744332 -1.859687,0.955946 -0.804954,0.264479 -1.655904,0.353359 -2.506809,0.289603 C 13.889461,18.61236 13.045505,18.397263 12.255655,18.058063 11.463741,17.717977 10.732199,17.255731 10.108157,16.703785 9.478793,16.147133 8.9646712,15.504641 8.6036407,14.810053 8.1570556,13.954107 7.9592728,13.097667 7.9577963,12.285559 7.956288,11.455967 8.1593719,10.66397 8.5230031,9.9493737 8.897411,9.2135993 9.4420688,8.5592542 10.113956,8.0227978 c 0.697583,-0.5569735 1.527712,-0.9836464 2.448161,-1.251994 1.141297,-0.3338717 2.311734,-0.4141818 3.43508,-0.3087118 1.197523,0.1124344 2.341777,0.4353884 3.368755,0.8915274 0.841012,0.373541 1.601789,0.8352567 2.265573,1.3485929 0.220641,0.1706322 0.428443,0.3452201 0.623586,0.5221586 0.916514,0.8310181 1.571644,1.7285691 2.00835,2.5998071 0.583276,1.165135 0.809726,2.295299 0.803211,3.319147 -0.0067,1.048334 -0.258289,2.100934 -0.770586,3.090349 -0.451122,0.871266 -1.143057,1.764517 -2.138676,2.538095 -0.562425,0.436995 -1.240823,0.849886 -2.043506,1.186324 -0.379113,0.158902 -0.792868,0.303748 -1.24153,0.425521 -1.324371,0.36045 -2.813222,0.497483 -4.411669,0.324651 C 13.054138,22.55618 11.592163,22.165782 10.174121,21.512852 8.8683127,20.9116 7.618299,20.095057 6.5387669,19.079194 5.5162744,18.117007 4.6577338,16.985474 4.0696943,15.723123 3.4288797,14.350929 3.1500241,12.957356 3.1973738,11.608647 3.2438244,10.285565 3.6047424,9.00638 4.2425963,7.8432114 4.8775252,6.6853764 5.7847547,5.6460279 6.9195814,4.7972307 8.0632403,3.9418274 9.4299665,3.2859321 10.968295,2.8938891 c 1.748015,-0.447252 3.546923,-0.5286696 5.290204,-0.3213343 1.810268,0.2153023 3.548364,0.7399666 5.118134,1.4802409 1.664493,0.7849435 3.120464,1.8019862 4.309234,2.9454015 1.298447,1.2489091 2.254765,2.6235634 2.880395,4.0221318 0.818208,1.821073 1.155337,3.274649 1.248449,4.429734 0.117579,1.458612 -0.148198,2.539199 -0.456417,3.307982 -0.02125,0.05301 -0.04284,0.104845 -0.06469,0.155521 -0.485116,1.125181 -1.208163,1.926835 -1.724607,2.424979 -0.581702,0.561088 -1.398392,1.208016 -2.555957,1.927879 -0.116415,0.0724 -0.239812,0.146048 -0.370258,0.220841 -0.898326,0.507955 -2.230437,1.056044 -4.055713,1.640502 -1.577215,0.505027 -3.298199,0.966804 -5.043774,1.406872 -1.846532,0.465519 -3.571151,0.869612 -4.873893,1.226212 -0.8483914,0.232231 -1.5158697,0.4432 -2.0113248,0.655533 -0.4307775,0.184615 -0.7262877,0.368168 -0.8990942,0.563417 -0.5391617,0.609181 -0.046277,1.892368 -0.042222,2.227642 0.1781614,0.282669 0.4635917,1.62793 1.2138291,1.863082 0.242755,0.07609 0.5827018,0.07933 1.0437099,0.01237 0.5283281,-0.07673 1.2193261,-0.246307 2.0742981,-0.501356 1.297451,-0.387047 3.053063,-0.998175 4.893589,-1.725552 1.737319,-0.68659 3.486152,-1.451173 5.078565,-2.252406 1.871528,-0.941672 3.234081,-1.784691 4.293336,-2.554529 0.138566,-0.100727 0.270515,-0.197514 0.397518,-0.291076 1.273425,-0.938126 2.159017,-1.813091 2.823955,-2.601568 0.563376,-0.668046 1.439231,-1.826579 1.997163,-3.367113 0.02539,-0.07012 0.05042,-0.141767 0.07496,-0.214947 0.363733,-1.084584 0.629154,-2.521819 0.417651,-4.345627 -0.165732,-1.42911 -0.623619,-3.102869 -1.565915,-5.084779 C 29.679871,8.5070719 28.532349,6.9472778 27.034822,5.5648352 25.664304,4.2996407 24.014062,3.1972382 22.154572,2.3613675 20.400571,1.5729156 18.465156,1.0248472 16.451226,0.81966666 14.510751,0.62196975 12.498598,0.74394623 10.540469,1.2778873 8.8065726,1.7521508 7.2573078,2.5271318 5.9575604,3.5370957 4.6680181,4.5391299 3.6347218,5.7644775 2.9167701,7.1333047 2.1944673,8.5104276 1.7984748,10.019106 1.7709013,11.571914 c -0.028124,1.583841 0.327048,3.188108 1.0761117,4.73363 0.6925226,1.425954 1.6775777,2.675191 2.8175609,3.716993 1.2040827,1.10038 2.5814675,1.97111 4.0057117,2.604455 1.5475514,0.688179 3.1394744,1.092737 4.6722104,1.240402 1.74316,0.167938 3.372439,0.002 4.82815,-0.409178 0.495615,-0.140329 0.95358,-0.306026 1.374143,-0.487346 0.890409,-0.383887 1.647087,-0.85161 2.278244,-1.347121 1.117015,-0.876949 1.907415,-1.890868 2.431428,-2.89058 0.595146,-1.135419 0.901966,-2.353443 0.922829,-3.576385 0.02042,-1.196701 -0.231368,-2.506888 -0.88943,-3.841345 C 24.79278,10.310421 24.052827,9.2947885 23.029218,8.3693285 22.811357,8.1723574 22.579764,7.9787439 22.334289,7.790203 21.596216,7.223314 20.753509,6.7177263 19.824958,6.3117016 18.69177,5.8161955 17.426043,5.4676435 16.096572,5.3535414 14.848812,5.2464522 13.53817,5.3460334 12.253494,5.7349838 11.208219,6.052325 10.25811,6.5534194 9.4564288,7.211411 8.6844156,7.8450523 8.0542612,8.6213878 7.6233498,9.5008172 7.204259,10.356122 6.9761382,11.30487 6.9930169,12.295296 c 0.016543,0.970748 0.2685045,1.971698 0.7944064,2.947971 0.4312214,0.798106 1.0294642,1.517135 1.740404,2.127198 0.7052517,0.605182 1.5227107,1.10424 2.4000297,1.466581 0.875424,0.361558 1.811243,0.587342 2.755246,0.645714 0.947391,0.05858 1.901451,-0.05163 2.808261,-0.361276 0.72445,-0.24852 1.429015,-0.626429 2.053659,-1.088773 0.162483,-0.120266 0.319787,-0.246406 0.470903,-0.377725 0.425565,-0.369813 0.81781,-0.79429 1.138473,-1.261725 0.411455,-0.599784 0.712566,-1.282095 0.793914,-2.00518 0.03951,-0.351213 0.02696,-0.711356 -0.05033,-1.073266 C 21.821934,12.958717 21.683928,12.60439 21.475267,12.258446 21.173171,11.75842 20.765027,11.304031 20.283668,10.918864 19.811381,10.540957 19.267663,10.22904 18.686104,10.008732 18.110659,9.7907409 17.496729,9.66199 16.880337,9.6501435 c -0.615338,-0.011826 -1.232366,0.092967 -1.811731,0.341031 -0.403552,0.1730365 -0.759358,0.4190745 -1.047627,0.7138075 -0.29208,0.298629 -0.515472,0.647875 -0.649618,1.023748 -0.137448,0.385126 -0.179924,0.794643 -0.110648,1.201776 0.07165,0.421057 0.260168,0.825105 0.563545,1.191284 0.184957,0.221746 0.421316,0.413808 0.671968,0.565442 0.267735,0.161969 0.557716,0.28176 0.843547,0.350537 0.311684,0.075 0.61859,0.08965 0.899228,0.03627 0.152535,-0.02901 0.295404,-0.07773 0.4262,-0.145841 0.140956,-0.0734 0.264239,-0.16741 0.369373,-0.278472 0.03819,-0.04284 0.06792,-0.08916 0.09097,-0.133757 0.01194,-0.0231 0.02254,-0.04665 0.03192,-0.07035 0.0289,-0.073 0.0473,-0.15005 0.05706,-0.225446 0.02103,-0.162412 0.0035,-0.325591 -0.04532,-0.461554 -0.02722,-0.07573 -0.06391,-0.142651 -0.108656,-0.198362 -0.04994,-0.06218 -0.107532,-0.107514 -0.168936,-0.13729 -0.07112,-0.03449 -0.143878,-0.04623 -0.211189,-0.04527 -0.08869,0.0013 -0.172718,0.02427 -0.240101,0.04719 z"
       inkscape:path-effect="#path-effect1102"
       inkscape:original-d="m 16.44032,13.424887 c 0.712543,-0.14856 0.686784,0.771594 0.413356,1.041752 -0.740982,0.73211 -2.169619,0.198313 -2.781945,-0.547916 -1.095315,-1.33483 -0.320616,-3.000645 1.128516,-3.619089 2.126667,-0.907593 4.854088,0.266794 5.977252,2.137581 1.497002,2.493467 -1.081273,5.401682 -3.809417,6.316694 C 13.934995,19.905362 9.7884834,18.027926 8.195532,15.02666 6.2662573,11.391723 8.394434,7.4486802 12.407806,6.2528937 17.137428,4.8436994 22.72263,7.4358277 24.775661,11.569809 27.145966,16.342654 24.322373,21.449563 19.02151,22.920915 12.998331,24.592759 5.9675884,21.281951 3.458353,16.014332 0.64337249,10.104859 4.164871,3.8304223 10.754382,2.0858882 18.069848,0.14911669 26.549349,4.180424 29.51284,10.582138 c 3.261515,7.045501 0.670348,11.116655 -4.034405,14.186023 -4.502016,2.937103 -14.205943,5.388881 -17.7616741,6.439282"
       sodipodi:nodetypes="cscsssssssssssc" />
    <path
       id="path3908"
       style="fill:url(#linearGradient4900);fill-opacity:1;fill-rule:nonzero;stroke:none;stroke-width:0.377953;stroke-miterlimit:4;stroke-dasharray:none;stroke-opacity:1;filter:url(#filter4890)"
       d="M 57.685547,2.9257812 C 52.558859,2.9546544 47.373208,3.6067347 42.285156,4.9941406 35.731847,6.7866326 29.877275,9.7160167 24.964844,13.533203 20.090983,17.320419 16.186174,21.95148 13.472656,27.125 10.742693,32.329874 9.2448394,38.03151 9.140625,43.900391 c -0.1062954,5.986174 1.237253,12.049282 4.068359,17.890625 2.617409,5.389432 6.33984,10.111308 10.648438,14.048828 0.62005,0.566647 1.253325,1.116042 1.896484,1.65039 -0.0777,-0.07017 -0.157047,-0.138316 -0.234375,-0.208984 C 21.210933,73.343731 17.488502,68.621854 14.871094,63.232422 12.039987,57.391079 10.696439,51.327971 10.802734,45.341797 10.906949,39.472916 12.404802,33.77128 15.134766,28.566406 17.848284,23.392887 21.753092,18.761825 26.626953,14.974609 31.539384,11.157423 37.393955,8.2280388 43.947266,6.4355469 51.348068,4.4175018 58.954984,3.9559237 66.289062,4.703125 73.900766,5.4786107 81.214455,7.5493216 87.84375,10.529297 93.8444,13.226686 99.265502,16.66189 103.94727,20.583984 98.904023,16.059956 92.906415,12.112738 86.181641,9.0898438 79.552346,6.1098684 72.236704,4.0372043 64.625,3.2617188 62.3331,3.0282185 60.01586,2.9126571 57.685547,2.9257812 Z m 2.023437,17.3203128 c -3.61034,0.004 -7.307617,0.491213 -10.949218,1.59375 -3.950646,1.1994 -7.540337,3.09318 -10.570313,5.580078 -2.917847,2.394864 -5.301046,5.328516 -6.929687,8.652344 -1.583966,3.232651 -2.444653,6.819157 -2.38086,10.5625 0.06253,3.668968 1.014293,7.452727 3.001953,11.142578 1.629814,3.016463 3.891109,5.733312 6.578125,8.039062 0.216996,0.186206 0.441552,0.366048 0.664063,0.546875 -2.250747,-2.103833 -4.156127,-4.51103 -5.580078,-7.146484 -1.987661,-3.689851 -2.939429,-7.471656 -3.001953,-11.140625 -0.06379,-3.743342 0.798847,-7.329851 2.382812,-10.5625 1.628642,-3.323829 4.009887,-6.257479 6.927734,-8.652344 3.029976,-2.486897 6.619667,-4.380678 10.570313,-5.580078 4.855468,-1.470049 9.809447,-1.846153 14.525391,-1.441406 5.024772,0.431252 9.808881,1.748315 14.091796,3.621094 3.509485,1.534581 6.694808,3.445318 9.484376,5.58789 0.398016,0.305703 0.781407,0.615486 1.160156,0.927734 -0.06542,-0.05991 -0.129266,-0.119973 -0.195313,-0.179687 C 88.66487,31.052417 87.789108,30.320017 86.861328,29.607422 84.071761,27.464849 80.886437,25.554112 77.376953,24.019531 73.094038,22.146752 68.309929,20.82969 63.285156,20.398438 62.10617,20.297251 60.912431,20.244757 59.708984,20.246094 Z m 38.458985,5.107422 c 0.462133,0.416184 0.918594,0.835876 1.361328,1.261718 4.907513,4.720286 8.520183,9.915245 10.884763,15.201172 3.09244,6.882796 4.36683,12.376512 4.71875,16.742188 0.4444,5.512864 -0.55968,9.596316 -1.72461,12.501953 -0.0803,0.200353 -0.16155,0.396359 -0.24414,0.587891 -1.83351,4.252652 -4.56566,7.283266 -6.51758,9.166015 -2.19855,2.120648 -5.2851,4.564414 -9.660152,7.285156 -0.439994,0.273638 -0.907366,0.553256 -1.40039,0.835938 -3.395248,1.91983 -8.429445,3.990244 -15.328126,6.199219 -5.961127,1.908763 -12.467004,3.65511 -19.064453,5.318354 -6.979018,1.75945 -13.496172,3.28699 -18.419921,4.63477 -3.206521,0.87772 -5.728977,1.67404 -7.601563,2.47656 -1.628135,0.69776 -2.745311,1.39291 -3.398437,2.13086 -2.037777,2.30242 -0.175483,7.15079 -0.160157,8.41797 0.645134,1.02356 1.664389,5.73151 4.242188,6.90625 1.333629,-0.77782 3.296995,-11.98309 -2.419922,-13.88476 -0.946807,-0.27332 1.770303,-1.43115 3.398437,-2.12891 1.872589,-0.80252 4.395042,-1.60079 7.601563,-2.47852 4.923749,-1.34778 11.442856,-2.87337 18.421875,-4.63281 6.597449,-1.66325 13.101372,-3.409595 19.0625,-5.318358 6.898681,-2.208975 11.932877,-4.279389 15.328125,-6.199219 0.493024,-0.282682 0.960397,-0.5623 1.400391,-0.835937 4.375052,-2.720742 7.461602,-5.164509 9.660152,-7.285157 1.95192,-1.882749 4.68407,-4.913363 6.51758,-9.166015 0.0826,-0.191532 0.16383,-0.387538 0.24414,-0.587891 1.16492,-2.905636 2.169,-6.989089 1.72461,-12.501953 -0.35192,-4.365676 -1.62436,-9.859392 -4.7168,-16.742188 -2.36458,-5.285926 -5.9792,-10.482839 -10.88671,-15.203124 -0.96113,-0.924452 -1.972065,-1.824344 -3.023441,-2.701172 z m -11.416016,9.853515 c 3.361938,3.090695 5.781044,6.415853 7.400391,9.646485 2.204507,4.403659 3.05978,8.67526 3.035156,12.544922 -0.02532,3.962207 -0.975869,7.942119 -2.912109,11.68164 -1.705028,3.292974 -4.319062,6.668038 -8.082032,9.591797 -2.1257,1.651635 -4.690846,3.212798 -7.724609,4.484375 -1.432868,0.600574 -2.995676,1.147177 -4.691406,1.607422 -5.005497,1.362331 -10.634407,1.879786 -16.675782,1.226562 -5.316158,-0.574809 -10.841643,-2.049811 -16.201171,-4.517578 -4.019755,-1.850872 -7.898535,-4.240825 -11.404297,-7.138672 3.923151,3.552785 8.401651,6.43132 13.068359,8.580078 5.359529,2.467767 10.885013,3.942769 16.201172,4.517579 6.041374,0.653223 11.668331,0.135768 16.673828,-1.226563 1.695731,-0.460244 3.258538,-1.0088 4.691406,-1.609375 3.033763,-1.271577 5.598909,-2.830787 7.72461,-4.482422 3.762969,-2.923759 6.377003,-6.300776 8.082031,-9.59375 1.936241,-3.739521 2.886787,-7.71748 2.912109,-11.679687 0.02462,-3.869662 -0.830648,-8.141262 -3.035156,-12.544922 -1.650542,-3.292868 -4.125854,-6.685318 -7.589844,-9.826172 -0.469014,-0.425261 -0.964771,-0.845203 -1.472656,-1.261719 z m -20.503906,1.429688 c -2.325687,-0.0447 -4.65793,0.351496 -6.847656,1.289062 -1.525236,0.653995 -2.869464,1.585268 -3.958985,2.699219 -1.103924,1.128677 -1.950022,2.448518 -2.457031,3.869141 -0.519489,1.455594 -0.679799,3.002245 -0.417969,4.541015 0.270803,1.591397 0.984238,3.119923 2.13086,4.503906 0.54935,0.658619 1.220169,1.2438 1.941406,1.744141 -0.09335,-0.101346 -0.191764,-0.199743 -0.279297,-0.304687 -1.146622,-1.383984 -1.860056,-2.910557 -2.130859,-4.501954 -0.261831,-1.53877 -0.09957,-3.087374 0.419922,-4.542968 0.507008,-1.420623 1.351153,-2.740464 2.455078,-3.869141 1.08952,-1.113951 2.433748,-2.043271 3.958984,-2.697265 2.189726,-0.937554 4.521969,-1.333775 6.847656,-1.289063 2.329671,0.04478 4.649309,0.531566 6.824219,1.355469 2.11297,0.800441 4.09227,1.922993 5.828125,3.277344 -0.461424,-0.444497 -0.944061,-0.873525 -1.451172,-1.279297 -1.785022,-1.42831 -3.841044,-2.606793 -6.039062,-3.439453 -2.174911,-0.823903 -4.494549,-1.310695 -6.824219,-1.355469 z M 78.800781,44.625 c 1.017027,0.996058 1.882748,2.081945 2.5625,3.222656 0.636223,1.065797 1.041453,2.132181 1.259766,3.185547 0.222085,1.071602 0.253983,2.145393 0.126953,3.205078 -0.262715,2.191125 -1.20856,4.348007 -2.595703,6.330078 -1.077173,1.539156 -2.408429,2.956203 -3.876953,4.203125 -0.520188,0.441691 -1.062479,0.866871 -1.623047,1.271485 -2.162396,1.56079 -4.581962,2.81348 -7.029297,3.613281 -3.042346,0.999606 -6.25859,1.334718 -9.474609,1.09375 -3.207039,-0.240302 -6.397553,-1.051969 -9.382813,-2.333984 -2.545984,-1.093366 -4.923143,-2.524917 -7.029297,-4.210938 0.190786,0.178462 0.379341,0.359112 0.576172,0.533203 2.358584,2.086095 5.124138,3.831831 8.117188,5.117188 2.985259,1.282015 6.17382,2.095635 9.380859,2.335937 3.216019,0.240968 6.432264,-0.09414 9.474609,-1.09375 2.447335,-0.799801 4.866901,-2.052491 7.029297,-3.613281 0.560568,-0.404614 1.102859,-0.829794 1.623047,-1.271484 1.468524,-1.246923 2.801733,-2.665923 3.878906,-4.205079 1.387144,-1.982071 2.331035,-4.138953 2.59375,-6.330078 0.12703,-1.059685 0.09513,-2.131523 -0.126953,-3.203125 -0.218313,-1.053365 -0.623542,-2.121703 -1.259765,-3.1875 C 82.068849,47.68191 80.74759,46.185051 79.148438,44.894531 79.034601,44.802665 78.917178,44.714567 78.800781,44.625 Z m -13.308593,6.101562 c -0.335207,0.0049 -0.653528,0.09111 -0.908204,0.177735 0.27704,-0.02305 0.585798,8.5e-5 0.859375,0.111328 0.204057,0.08296 0.366419,0.205512 0.486329,0.365234 0.100951,0.134476 0.169665,0.292087 0.210937,0.470703 0.03742,0.16116 0.05394,0.343328 0.04687,0.541016 -0.01285,0.359698 -0.103533,0.768751 -0.263672,1.13086 -0.07385,0.166979 -0.156909,0.313936 -0.24414,0.427734 -0.02759,0.03628 -0.05558,0.06815 -0.08203,0.0957 -0.05227,0.05446 -0.100447,0.08987 -0.134765,0.103516 -0.27481,0.244573 -0.582744,0.441633 -0.925782,0.589843 -0.319256,0.137915 -0.673291,0.235557 -1.064453,0.28711 -0.72339,0.09532 -1.566393,0.02998 -2.482422,-0.22461 -0.839811,-0.233461 -1.708625,-0.618094 -2.511718,-1.130859 -0.04103,-0.0262 -0.07865,-0.05529 -0.119141,-0.08203 0.474107,0.553584 1.086155,1.077675 1.78125,1.521484 0.803093,0.512765 1.671908,0.899351 2.511719,1.132813 0.916029,0.254589 1.759031,0.317976 2.482422,0.222656 0.304312,-0.04011 0.579185,-0.115781 0.839843,-0.208985 0.312643,-0.213412 0.599343,-0.454041 0.855469,-0.724609 0.14434,-0.161915 0.256632,-0.337304 0.34375,-0.505859 0.04513,-0.08731 0.08564,-0.17605 0.121094,-0.265625 0.109228,-0.275906 0.177955,-0.566601 0.214844,-0.851563 0.05326,-0.411105 0.03606,-0.82119 -0.0332,-1.203125 -0.104414,-0.101727 -0.222516,-0.191548 -0.371093,-0.251953 -0.273578,-0.111243 -0.582336,-0.13243 -0.859375,-0.109375 0.254676,-0.08663 0.572997,-0.174774 0.908203,-0.179687 0.0611,-8.72e-4 0.126347,0.01239 0.189453,0.01758 -0.002,-0.0055 -0.0019,-0.01206 -0.0039,-0.01758 -0.102879,-0.286224 -0.243029,-0.539439 -0.41211,-0.75 -0.188749,-0.235011 -0.40464,-0.406992 -0.636718,-0.519532 -0.2688,-0.130356 -0.544425,-0.17355 -0.798828,-0.169922 z"
       transform="matrix(0.26458333,0,0,0.26458333,-0.64766961,-0.04351532)"
       sodipodi:nodetypes="scssscscscssscsscsssscssscsccssscssscssssscscsscsscssssscccssssccsscscsccccssscsscsscsssccscscsscccccsscsscsssccscssscsscssscssscscscccsscssccccccscscsccscccscccccsc"
       clip-path="url(#clipPath5665)" />
    <path
       id="path4182"
       style="mix-blend-mode:normal;fill:url(#linearGradient4262);fill-opacity:1;fill-rule:nonzero;stroke:none;stroke-width:0.999999;filter:url(#filter8706);opacity:0.63814342"
       d="m 59.351562,5.5683594 c -0.686206,-0.00713 -1.37105,-0.00326 -2.05664,0.011719 C 41.49952,5.8337929 25.064057,13.191788 16.958984,27.236328 c -7.0994884,11.669202 -6.221437,27.129638 1.25586,38.402344 6.777568,10.597961 17.865589,18.029149 29.664062,21.453125 14.496922,4.399808 32.720829,2.349478 43.839844,-9.15625 8.120186,-7.94905 10.9505,-20.812833 6.384766,-31.304688 C 91.561826,30.945418 73.763297,21.587663 57.125,23.039062 c -4.660452,0.426899 -9.567478,1.90721 -13.332031,4.16211 13.777285,-7.657994 31.62313,-4.082628 43.449219,5.625 9.498799,7.461519 15.344512,20.428333 11.83789,32.390625 C 95.600562,78.037102 83.119696,86.623307 70.365234,88.339844 50.511395,91.292105 29.060836,81.647558 18.669922,64.359375 12.002311,53.51173 11.536216,38.974609 18.435547,28.113281 26.632959,14.50988 43.024287,7.7975294 58.472656,8.1230469 79.459058,8.4019873 100.66036,19.479048 111.25195,37.882812 c 5.35434,10.132638 9.22499,22.433485 5.23047,33.712891 -3.63039,9.922768 -12.78712,16.459288 -21.810545,21.15625 -17.956256,8.088107 -37.647973,10.833427 -56.326172,16.699217 -2.340719,0.74455 -5.54855,2.10375 -4.525391,5.19727 0.565195,3.24521 1.282552,7.02709 3.896485,9.21875 5.327358,0.37179 10.304814,-1.94061 15.273437,-3.33594 17.178085,-5.97999 34.380461,-12.7833 49.292966,-23.382812 8.95292,-6.297234 17.1269,-15.505795 19.50586,-26.097657 2.81754,-12.625908 -1.6693,-25.681439 -8.12695,-36.460937 C 102.0333,16.580751 80.623974,5.7895313 59.351562,5.5683594 Z"
       transform="matrix(0.26458333,0,0,0.26458333,-0.11850294,0.48565135)"
       clip-path="url(#clipPath4886)" />
    <path
       id="path7484"
       clip-path="url(#clipPath4886)"
       style="mix-blend-mode:normal;fill:url(#linearGradient7649);fill-opacity:1;fill-rule:nonzero;stroke:none;stroke-width:0.999999;filter:url(#filter4252)"
       d="m 66.029297,10.587891 c 10.089831,1.437586 19.895119,5.31098 28.216797,11.199218 8.768776,5.07317 16.305926,12.19123 21.386716,21.019532 2.77876,5.258568 5.14681,11.103313 6.23438,17.083984 -1.02317,-8.292761 -4.40332,-16.372109 -8.65235,-23.464844 -4.24303,-6.57102 -9.79858,-12.167969 -16.164059,-16.654297 -9.412396,-5.482273 -20.18217,-8.685313 -31.021484,-9.183593 z m 16.919922,21.292968 c 0.737889,0.477801 1.460338,0.97411 2.164062,1.494141 0.746625,0.411052 1.482253,0.838501 2.201172,1.291016 -0.642381,-0.538588 -1.297014,-1.059973 -1.972656,-1.558594 -0.786714,-0.429174 -1.57986,-0.846786 -2.392578,-1.226563 z m -53.47461,47.046875 c 1.812584,1.75785 3.752713,3.381166 5.802735,4.853516 1.921564,1.093665 3.903011,2.073861 5.929687,2.929688 -1.616201,-0.919476 -3.18093,-1.921834 -4.689453,-3.003907 -2.477305,-1.399396 -4.828801,-3.003554 -7.042969,-4.779297 z m 86.394531,6.115235 c -4.48022,5.386012 -10.67703,9.437084 -16.816406,12.632812 -17.956255,8.088109 -37.647973,10.833429 -56.326172,16.699219 -2.340718,0.74455 -5.548549,2.10375 -4.52539,5.19727 0.347321,1.99423 0.755997,4.18971 1.623047,6.0957 4.378476,-0.33713 8.553608,-2.13109 12.71875,-3.30078 17.178085,-5.97999 34.380464,-12.7833 49.292971,-23.382815 5.30244,-3.729587 10.31929,-8.486851 14.0332,-13.941406 z"
       transform="matrix(0.26458333,0,0,0.26458333,-0.00596341,0.36183513)" />
  </g>
</svg>
