<?xml version="1.0" encoding="UTF-8" standalone="no"?>
<!-- Created with Inkscape (http://www.inkscape.org/) -->

<svg
   xmlns:dc="http://purl.org/dc/elements/1.1/"
   xmlns:cc="http://creativecommons.org/ns#"
   xmlns:rdf="http://www.w3.org/1999/02/22-rdf-syntax-ns#"
   xmlns:svg="http://www.w3.org/2000/svg"
   xmlns="http://www.w3.org/2000/svg"
   xmlns:xlink="http://www.w3.org/1999/xlink"
   xmlns:sodipodi="http://sodipodi.sourceforge.net/DTD/sodipodi-0.dtd"
   xmlns:inkscape="http://www.inkscape.org/namespaces/inkscape"
   width="420"
   height="600"
   viewBox="0 0 111.125 158.75"
   version="1.1"
   id="svg8"
   inkscape:version="0.92.3 (2405546, 2018-03-11)"
   sodipodi:docname="PosterGreyface1.svg"
   inkscape:export-filename="/home/frode/Creations/Games/KO/Docs/GreyfacePoster.png"
   inkscape:export-xdpi="96"
   inkscape:export-ydpi="96">
  <defs
     id="defs2">
    <linearGradient
       inkscape:collect="always"
       id="linearGradient2839">
      <stop
         style="stop-color:#7e7e7e;stop-opacity:0.99607843"
         offset="0"
         id="stop2835" />
      <stop
         style="stop-color:#856e6e;stop-opacity:0.99607843"
         offset="1"
         id="stop2837" />
    </linearGradient>
    <linearGradient
       inkscape:collect="always"
       id="linearGradient2831">
      <stop
         style="stop-color:#727272;stop-opacity:1"
         offset="0"
         id="stop2827" />
      <stop
         style="stop-color:#aaaaaa;stop-opacity:0.56074768"
         offset="1"
         id="stop2829" />
    </linearGradient>
    <linearGradient
       inkscape:collect="always"
       id="linearGradient1270">
      <stop
         id="stop1268"
         offset="0"
         style="stop-color:#c0c0c0;stop-opacity:0;" />
      <stop
         id="stop1266"
         offset="1"
         style="stop-color:#adadad;stop-opacity:1" />
    </linearGradient>
    <linearGradient
       inkscape:collect="always"
       id="linearGradient1139">
      <stop
         style="stop-color:#9f0c0c;stop-opacity:1"
         offset="0"
         id="stop1135" />
      <stop
         id="stop2934"
         offset="0.54222691"
         style="stop-color:#d30b0b;stop-opacity:0.45490196;" />
      <stop
         style="stop-color:#ff0b0b;stop-opacity:0"
         offset="1"
         id="stop1137" />
    </linearGradient>
    <linearGradient
       inkscape:collect="always"
       id="linearGradient827">
      <stop
         id="stop825"
         offset="0"
         style="stop-color:#0d0d0d;stop-opacity:1" />
      <stop
         id="stop823"
         offset="1"
         style="stop-color:#f50b0b;stop-opacity:1" />
    </linearGradient>
    <linearGradient
       inkscape:collect="always"
       xlink:href="#linearGradient827"
       id="linearGradient829"
       x1="102.05357"
       y1="90.625008"
       x2="102.05357"
       y2="287.17264"
       gradientUnits="userSpaceOnUse"
       gradientTransform="matrix(0.56422311,0,0,0.56203277,-3.5113216,132.95281)" />
    <linearGradient
       inkscape:collect="always"
       xlink:href="#linearGradient827"
       id="linearGradient829-5"
       x1="102.05357"
       y1="90.625008"
       x2="102.05357"
       y2="287.17264"
       gradientUnits="userSpaceOnUse"
       gradientTransform="matrix(3.860055,0,0,3.8469117,-7.2950445,-9.8348119)" />
    <filter
       inkscape:collect="always"
       style="color-interpolation-filters:sRGB"
       id="filter1016"
       x="-0.034205779"
       width="1.0684116"
       y="-0.02313265"
       height="1.0462652">
      <feGaussianBlur
         inkscape:collect="always"
         stdDeviation="2.6771858"
         id="feGaussianBlur1018" />
    </filter>
    <linearGradient
       inkscape:collect="always"
       xlink:href="#linearGradient1139"
       id="linearGradient1141"
       x1="104.32143"
       y1="215.35715"
       x2="104.32143"
       y2="197.63953"
       gradientUnits="userSpaceOnUse"
       gradientTransform="matrix(1,0,0,1.3297873,0,-63.538495)" />
    <filter
       inkscape:collect="always"
       style="color-interpolation-filters:sRGB"
       id="filter1228"
       x="-0.1486782"
       width="1.2973564"
       y="-0.10059622"
       height="1.2011924">
      <feGaussianBlur
         inkscape:collect="always"
         stdDeviation="45.357861"
         id="feGaussianBlur1230" />
    </filter>
    <linearGradient
       inkscape:collect="always"
       xlink:href="#linearGradient2831"
       id="linearGradient2833"
       x1="105.30352"
       y1="180.58426"
       x2="105.30352"
       y2="221.42969"
       gradientUnits="userSpaceOnUse"
       gradientTransform="matrix(0.50233451,0,0,0.53568101,2.817217,138.02128)" />
    <linearGradient
       inkscape:collect="always"
       xlink:href="#linearGradient2839"
       id="linearGradient2841"
       x1="37.583855"
       y1="159.60017"
       x2="104.99522"
       y2="159.60017"
       gradientUnits="userSpaceOnUse"
       gradientTransform="matrix(0.47098563,0,0,0.53568101,6.1086988,139.73933)"
       spreadMethod="reflect" />
    <linearGradient
       inkscape:collect="always"
       xlink:href="#linearGradient2831"
       id="linearGradient2845"
       gradientUnits="userSpaceOnUse"
       gradientTransform="matrix(0.62396349,0,0,0.24595186,-9.9532476,193.65889)"
       x1="105.30352"
       y1="158.66164"
       x2="105.30352"
       y2="217.46094" />
    <filter
       inkscape:collect="always"
       style="color-interpolation-filters:sRGB"
       id="filter2930"
       x="-0.010155031"
       width="1.02031"
       y="-0.07912799"
       height="1.1582561">
      <feGaussianBlur
         inkscape:collect="always"
         stdDeviation="0.77886719"
         id="feGaussianBlur2932" />
    </filter>
    <clipPath
       clipPathUnits="userSpaceOnUse"
       id="clipPath3143">
      <path
         style="color:#000000;clip-rule:nonzero;display:inline;overflow:visible;visibility:visible;opacity:1;isolation:auto;mix-blend-mode:normal;color-interpolation:sRGB;color-interpolation-filters:linearRGB;solid-color:#000000;solid-opacity:1;vector-effect:none;fill:none;fill-opacity:1;fill-rule:nonzero;stroke:#4da82c;stroke-width:3.56816626;stroke-linecap:round;stroke-linejoin:round;stroke-miterlimit:4;stroke-dasharray:none;stroke-dashoffset:0;stroke-opacity:1;marker:none;color-rendering:auto;image-rendering:auto;shape-rendering:auto;text-rendering:auto;enable-background:accumulate"
         d="M 40.211543,21.320072 V 1084.5503 H 753.49513 V 21.320072 Z"
         id="path3145"
         inkscape:connector-curvature="0" />
    </clipPath>
    <linearGradient
       inkscape:collect="always"
       xlink:href="#linearGradient1270"
       id="linearGradient3270"
       gradientUnits="userSpaceOnUse"
       x1="12.616027"
       y1="169.12161"
       x2="89.37677"
       y2="169.12161" />
    <linearGradient
       inkscape:collect="always"
       xlink:href="#linearGradient1270"
       id="linearGradient3272"
       gradientUnits="userSpaceOnUse"
       x1="12.616027"
       y1="169.12161"
       x2="89.37677"
       y2="169.12161" />
    <linearGradient
       inkscape:collect="always"
       xlink:href="#linearGradient1270"
       id="linearGradient3274"
       gradientUnits="userSpaceOnUse"
       x1="12.616027"
       y1="169.12161"
       x2="89.37677"
       y2="169.12161" />
    <linearGradient
       inkscape:collect="always"
       xlink:href="#linearGradient1270"
       id="linearGradient3276"
       gradientUnits="userSpaceOnUse"
       x1="12.616027"
       y1="169.12161"
       x2="48.274643"
       y2="160.98563" />
    <linearGradient
       inkscape:collect="always"
       xlink:href="#linearGradient1270"
       id="linearGradient3278"
       gradientUnits="userSpaceOnUse"
       gradientTransform="matrix(1.0507367,-0.20753973,0,1.0511289,-5.0609109,10.454467)"
       x1="35.672573"
       y1="174.03531"
       x2="87.108917"
       y2="161.56209" />
    <linearGradient
       inkscape:collect="always"
       xlink:href="#linearGradient827"
       id="linearGradient829-6"
       x1="102.05357"
       y1="90.625008"
       x2="102.05357"
       y2="287.17264"
       gradientUnits="userSpaceOnUse"
       gradientTransform="matrix(2.1324968,0,0,2.1242184,-22.102788,-20.449715)" />
    <linearGradient
       inkscape:collect="always"
       xlink:href="#linearGradient827"
       id="linearGradient3377"
       gradientUnits="userSpaceOnUse"
       gradientTransform="matrix(0.5566641,0,0,0.54790486,-2.7198983,136.29754)"
       x1="102.05357"
       y1="90.625008"
       x2="102.05357"
       y2="287.17264" />
  </defs>
  <sodipodi:namedview
     id="base"
     pagecolor="#ffffff"
     bordercolor="#666666"
     borderopacity="1.0"
     inkscape:pageopacity="0.0"
     inkscape:pageshadow="2"
     inkscape:zoom="0.7"
     inkscape:cx="-127.0665"
     inkscape:cy="345.14112"
     inkscape:document-units="mm"
     inkscape:current-layer="layer1"
     showgrid="false"
     showguides="true"
     inkscape:guide-bbox="true"
     inkscape:snap-global="false"
     inkscape:snap-page="true"
     inkscape:window-width="1920"
     inkscape:window-height="1061"
     inkscape:window-x="0"
     inkscape:window-y="0"
     inkscape:window-maximized="1"
     units="px"
     inkscape:snap-bbox="true"
     inkscape:snap-bbox-midpoints="true"
     inkscape:snap-bbox-edge-midpoints="true" />
  <metadata
     id="metadata5">
    <rdf:RDF>
      <cc:Work
         rdf:about="">
        <dc:format>image/svg+xml</dc:format>
        <dc:type
           rdf:resource="http://purl.org/dc/dcmitype/StillImage" />
        <dc:title></dc:title>
      </cc:Work>
    </rdf:RDF>
  </metadata>
  <g
     inkscape:label="Layer 1"
     inkscape:groupmode="layer"
     id="layer1"
     transform="translate(0,-138.24997)">
    <rect
       style="color:#000000;clip-rule:nonzero;display:inline;overflow:visible;visibility:visible;opacity:1;isolation:auto;mix-blend-mode:normal;color-interpolation:sRGB;color-interpolation-filters:linearRGB;solid-color:#000000;solid-opacity:1;vector-effect:none;fill:none;fill-opacity:1;fill-rule:nonzero;stroke:#000000;stroke-width:4.90662622;stroke-linecap:round;stroke-linejoin:round;stroke-miterlimit:4;stroke-dasharray:none;stroke-dashoffset:0;stroke-opacity:1;marker:none;filter:url(#filter1016);color-rendering:auto;image-rendering:auto;shape-rendering:auto;text-rendering:auto;enable-background:accumulate"
       id="rect998"
       width="187.84094"
       height="277.75659"
       x="11.07953"
       y="11.738368"
       ry="0.26849419"
       transform="matrix(0.54593823,0,0,0.54581197,-1.7610168,135.35)" />
    <rect
       ry="0.14825927"
       y="139.70267"
       x="3.67591"
       height="153.37384"
       width="103.77316"
       id="rect922"
       style="color:#000000;clip-rule:nonzero;display:inline;overflow:visible;visibility:visible;opacity:1;isolation:auto;mix-blend-mode:normal;color-interpolation:sRGB;color-interpolation-filters:linearRGB;solid-color:#000000;solid-opacity:1;vector-effect:none;fill:url(#linearGradient829);fill-opacity:1;fill-rule:nonzero;stroke:#f9f9f9;stroke-width:2.67840481;stroke-linecap:round;stroke-linejoin:round;stroke-miterlimit:4;stroke-dasharray:none;stroke-dashoffset:0;stroke-opacity:1;marker:none;color-rendering:auto;image-rendering:auto;shape-rendering:auto;text-rendering:auto;enable-background:accumulate" />
    <path
       sodipodi:nodetypes="cccccc"
       inkscape:connector-curvature="0"
       id="path2843"
       d="M 28.190819,225.46409 10.89557,237.53867 c 18.385192,4.15554 21.527933,9.72723 44.664197,13.664 20.106842,-2.60745 23.938005,-9.14653 44.664523,-13.664 L 82.715518,225.24092 c 4.212809,-0.79848 -58.031391,-0.85686 -54.524699,0.22317 z"
       style="color:#000000;clip-rule:nonzero;display:inline;overflow:visible;visibility:visible;opacity:0.42000002;isolation:auto;mix-blend-mode:normal;color-interpolation:sRGB;color-interpolation-filters:linearRGB;solid-color:#000000;solid-opacity:1;vector-effect:none;fill:url(#linearGradient2845);fill-opacity:1;fill-rule:nonzero;stroke:none;stroke-width:0.53568101;stroke-linecap:round;stroke-linejoin:round;stroke-miterlimit:4;stroke-dasharray:none;stroke-dashoffset:0;stroke-opacity:1;marker:none;color-rendering:auto;image-rendering:auto;shape-rendering:auto;text-rendering:auto;enable-background:accumulate" />
    <path
       style="color:#000000;clip-rule:nonzero;display:inline;overflow:visible;visibility:visible;opacity:1;isolation:auto;mix-blend-mode:normal;color-interpolation:sRGB;color-interpolation-filters:linearRGB;solid-color:#000000;solid-opacity:1;vector-effect:none;fill:url(#linearGradient2833);fill-opacity:1;fill-rule:nonzero;stroke:none;stroke-width:0.53568101;stroke-linecap:round;stroke-linejoin:round;stroke-miterlimit:4;stroke-dasharray:none;stroke-dashoffset:0;stroke-opacity:1;marker:none;color-rendering:auto;image-rendering:auto;shape-rendering:auto;text-rendering:auto;enable-background:accumulate"
       d="m 36.661922,207.258 -20.745208,30.49082 c 18.68069,10.65713 -4.032651,25.60233 39.643087,25.60233 43.675738,0 20.67993,-15.0074 39.643358,-25.60233 L 74.28604,206.84139 c 2.907003,-1.49058 -40.043871,-1.59956 -37.624118,0.41661 z"
       id="path2825"
       inkscape:connector-curvature="0"
       sodipodi:nodetypes="cczccc" />
    <path
       sodipodi:nodetypes="cccccc"
       inkscape:connector-curvature="0"
       id="path2823"
       d="m 36.050975,199.45654 -13.844438,25.00051 c 13.729258,8.60651 17.350474,20.14599 33.353279,28.29943 13.907426,-5.4003 17.875847,-18.94334 33.35352,-28.29943 L 74.921203,198.98014 c 3.003274,-1.70442 -41.370121,-1.82904 -38.870228,0.4764 z"
       style="color:#000000;clip-rule:nonzero;display:inline;overflow:visible;visibility:visible;opacity:1;isolation:auto;mix-blend-mode:normal;color-interpolation:sRGB;color-interpolation-filters:linearRGB;solid-color:#000000;solid-opacity:1;vector-effect:none;fill:url(#linearGradient2841);fill-opacity:1;fill-rule:nonzero;stroke:none;stroke-width:0.53568101;stroke-linecap:round;stroke-linejoin:round;stroke-miterlimit:4;stroke-dasharray:none;stroke-dashoffset:0;stroke-opacity:1;marker:none;color-rendering:auto;image-rendering:auto;shape-rendering:auto;text-rendering:auto;enable-background:accumulate" />
    <path
       sodipodi:nodetypes="czcc"
       inkscape:connector-curvature="0"
       id="path3420"
       d="m 24.91012,219.64438 c 14.260216,12.98276 23.321098,23.89193 31.053151,23.89193 7.732053,0 15.531246,-11.41179 30.25161,-23.89193 -4.496628,-7.78965 -58.094367,-6.58661 -61.304761,0 z"
       style="color:#000000;clip-rule:nonzero;display:inline;overflow:visible;visibility:visible;opacity:1;isolation:auto;mix-blend-mode:normal;color-interpolation:sRGB;color-interpolation-filters:linearRGB;solid-color:#000000;solid-opacity:1;vector-effect:none;fill:#070707;fill-opacity:0.0627451;fill-rule:nonzero;stroke:none;stroke-width:0.52690589;stroke-linecap:round;stroke-linejoin:round;stroke-miterlimit:4;stroke-dasharray:none;stroke-dashoffset:0;stroke-opacity:1;marker:none;color-rendering:auto;image-rendering:auto;shape-rendering:auto;text-rendering:auto;enable-background:accumulate" />
    <rect
       style="color:#000000;clip-rule:nonzero;display:inline;overflow:visible;visibility:visible;opacity:1;isolation:auto;mix-blend-mode:normal;color-interpolation:sRGB;color-interpolation-filters:linearRGB;solid-color:#000000;solid-opacity:1;vector-effect:none;fill:url(#linearGradient3377);fill-opacity:1;fill-rule:nonzero;stroke:#000000;stroke-width:1.199;stroke-linecap:round;stroke-linejoin:miter;stroke-miterlimit:4;stroke-dasharray:none;stroke-dashoffset:0;stroke-opacity:1;marker:none;color-rendering:auto;image-rendering:auto;shape-rendering:auto;text-rendering:auto;enable-background:accumulate"
       id="rect1175"
       width="95.686035"
       height="30.98945"
       x="7.7194829"
       y="257.84653" />
    <path
       style="color:#000000;clip-rule:nonzero;display:inline;overflow:visible;visibility:visible;opacity:1;isolation:auto;mix-blend-mode:normal;color-interpolation:sRGB;color-interpolation-filters:linearRGB;solid-color:#000000;solid-opacity:1;vector-effect:none;fill:#808080;fill-opacity:1;fill-rule:nonzero;stroke:none;stroke-width:0.53568101;stroke-linecap:round;stroke-linejoin:round;stroke-miterlimit:4;stroke-dasharray:none;stroke-dashoffset:0;stroke-opacity:1;marker:none;color-rendering:auto;image-rendering:auto;shape-rendering:auto;text-rendering:auto;enable-background:accumulate"
       d="m 17.329123,179.53097 c 2.734918,2.64767 5.976597,8.95189 9.643256,11.81682 -4.635195,6.52487 -5.56612,17.26019 -9.412171,24.06802 15.642883,8.30825 19.768835,19.44781 38.002159,27.31869 15.845883,-5.21316 20.367437,-18.28684 38.002426,-27.31869 -5.386958,-8.05127 -3.832915,-14.02451 -9.479213,-22.63527 4.404986,-2.11806 6.915648,-11.11584 9.85321,-13.349 -3.682957,-1.46365 -16.441052,0.9316 -19.558635,2.2732 -4.002165,0 -9.674299,-0.52361 -18.468681,-0.52361 -8.794382,0 -13.16162,0.52361 -18.243469,0.52361 -2.899074,-2.23803 -17.989169,-3.24654 -20.338882,-2.17377 z"
       id="path815"
       inkscape:connector-curvature="0"
       sodipodi:nodetypes="cccccccczcc" />
    <path
       transform="matrix(0.1191918,0,0,0.20857705,48.939907,199.16976)"
       inkscape:transform-center-y="0.8720495"
       d="m 55.5625,204.81122 c -2.896608,0 -15.931347,-22.57683 -14.483043,-25.08536 1.448304,-2.50854 27.517781,-2.50854 28.966086,0 1.448304,2.50853 -11.586434,25.08536 -14.483043,25.08536 z"
       inkscape:randomized="0"
       inkscape:rounded="0.1"
       inkscape:flatsided="true"
       sodipodi:arg2="2.6179939"
       sodipodi:arg1="1.5707963"
       sodipodi:r2="8.3617887"
       sodipodi:r1="16.723577"
       sodipodi:cy="188.08765"
       sodipodi:cx="55.5625"
       sodipodi:sides="3"
       id="path3418"
       style="color:#000000;clip-rule:nonzero;display:inline;overflow:visible;visibility:visible;opacity:1;isolation:auto;mix-blend-mode:normal;color-interpolation:sRGB;color-interpolation-filters:linearRGB;solid-color:#000000;solid-opacity:1;vector-effect:none;fill:#000000;fill-opacity:0.1254902;fill-rule:nonzero;stroke:none;stroke-width:1.19995821;stroke-linecap:round;stroke-linejoin:miter;stroke-miterlimit:4;stroke-dasharray:none;stroke-dashoffset:0;stroke-opacity:0.50196078;marker:none;color-rendering:auto;image-rendering:auto;shape-rendering:auto;text-rendering:auto;enable-background:accumulate"
       sodipodi:type="star" />
    <path
       style="color:#000000;clip-rule:nonzero;display:inline;overflow:visible;visibility:visible;opacity:1;isolation:auto;mix-blend-mode:normal;color-interpolation:sRGB;color-interpolation-filters:linearRGB;solid-color:#000000;solid-opacity:1;vector-effect:none;fill:#050505;fill-opacity:1;fill-rule:nonzero;stroke:none;stroke-width:0.53568101;stroke-linecap:round;stroke-linejoin:round;stroke-miterlimit:4;stroke-dasharray:none;stroke-dashoffset:0;stroke-opacity:1;marker:none;color-rendering:auto;image-rendering:auto;shape-rendering:auto;text-rendering:auto;enable-background:accumulate"
       d="m 49.54242,225.72487 6.019957,3.31558 6.020203,-3.31558 z"
       id="path839"
       inkscape:connector-curvature="0" />
    <path
       style="color:#000000;clip-rule:nonzero;display:inline;overflow:visible;visibility:visible;opacity:1;isolation:auto;mix-blend-mode:normal;color-interpolation:sRGB;color-interpolation-filters:linearRGB;solid-color:#000000;solid-opacity:1;vector-effect:none;fill:#000000;fill-opacity:1;fill-rule:nonzero;stroke:none;stroke-width:0.53568101;stroke-linecap:round;stroke-linejoin:round;stroke-miterlimit:4;stroke-dasharray:none;stroke-dashoffset:0;stroke-opacity:1;marker:none;color-rendering:auto;image-rendering:auto;shape-rendering:auto;text-rendering:auto;enable-background:accumulate"
       d="m 35.849071,209.86531 5.685617,2.88639 1.053999,5.70566 2.183695,-5.70566 z m 39.750647,-0.41246 -9.151382,3.29885 2.183687,5.70566 1.053996,-5.70566 z"
       id="path848"
       inkscape:connector-curvature="0"
       sodipodi:nodetypes="cccccccccc" />
    <path
       id="path860"
       style="color:#000000;clip-rule:nonzero;display:inline;overflow:visible;visibility:visible;opacity:1;isolation:auto;mix-blend-mode:normal;color-interpolation:sRGB;color-interpolation-filters:linearRGB;solid-color:#000000;solid-opacity:1;vector-effect:none;fill:none;fill-opacity:1;fill-rule:nonzero;stroke:#000000;stroke-width:0.53568101;stroke-linecap:butt;stroke-linejoin:bevel;stroke-miterlimit:4;stroke-dasharray:none;stroke-dashoffset:0;stroke-opacity:1;marker:none;color-rendering:auto;image-rendering:auto;shape-rendering:auto;text-rendering:auto;enable-background:accumulate"
       d="m 55.554594,232.15057 3.639899,2.25824 m -3.639899,-5.57606 v 3.31782 l -3.623463,2.25824"
       inkscape:connector-curvature="0"
       sodipodi:nodetypes="ccccc" />
    <path
       style="color:#000000;clip-rule:nonzero;display:inline;overflow:visible;visibility:visible;opacity:1;isolation:auto;mix-blend-mode:normal;color-interpolation:sRGB;color-interpolation-filters:linearRGB;solid-color:#000000;solid-opacity:1;vector-effect:none;fill:none;fill-opacity:1;fill-rule:nonzero;stroke:#ffffff;stroke-width:2.24986005;stroke-linecap:butt;stroke-linejoin:round;stroke-miterlimit:4;stroke-dasharray:none;stroke-dashoffset:0;stroke-opacity:1;marker:none;color-rendering:auto;image-rendering:auto;shape-rendering:auto;text-rendering:auto;enable-background:accumulate"
       d="M 13.47727,169.07751 H 97.647727"
       id="path1177"
       inkscape:connector-curvature="0" />
    <path
       style="color:#000000;clip-rule:nonzero;display:inline;overflow:visible;visibility:visible;opacity:1;isolation:auto;mix-blend-mode:normal;color-interpolation:sRGB;color-interpolation-filters:linearRGB;solid-color:#000000;solid-opacity:1;vector-effect:none;fill:none;fill-opacity:1;fill-rule:nonzero;stroke:#000000;stroke-width:0.53568101;stroke-linecap:butt;stroke-linejoin:round;stroke-miterlimit:4;stroke-dasharray:none;stroke-dashoffset:0;stroke-opacity:0.25098039;marker:none;color-rendering:auto;image-rendering:auto;shape-rendering:auto;text-rendering:auto;enable-background:accumulate"
       d="m 46.279209,213.21315 -3.616036,5.76212 -2.439752,-4.80156"
       id="path1183"
       inkscape:connector-curvature="0"
       sodipodi:nodetypes="ccc" />
    <use
       x="0"
       y="0"
       xlink:href="#path1183"
       id="use1187"
       transform="matrix(-1,0,0,1,111.28748,-3.8083e-8)"
       width="100%"
       height="100%"
       style="stroke:#000000;stroke-width:1.10888088;stroke-opacity:1" />
    <path
       sodipodi:nodetypes="ccc"
       inkscape:connector-curvature="0"
       id="path1189"
       d="m 48.49286,214.62247 -5.777168,5.76211 -3.897876,-4.80155"
       style="color:#000000;clip-rule:nonzero;display:inline;overflow:visible;visibility:visible;opacity:1;isolation:auto;mix-blend-mode:normal;color-interpolation:sRGB;color-interpolation-filters:linearRGB;solid-color:#000000;solid-opacity:1;vector-effect:none;fill:none;fill-opacity:1;fill-rule:nonzero;stroke:#000000;stroke-width:0.53568101;stroke-linecap:butt;stroke-linejoin:round;stroke-miterlimit:4;stroke-dasharray:none;stroke-dashoffset:0;stroke-opacity:0.25098039;marker:none;color-rendering:auto;image-rendering:auto;shape-rendering:auto;text-rendering:auto;enable-background:accumulate" />
    <use
       x="0"
       y="0"
       xlink:href="#path1189"
       id="use1191"
       transform="matrix(-1,0,0,1,111.36304,-3.8083e-8)"
       width="100%"
       height="100%"
       style="stroke-width:1.10888088" />
    <path
       style="color:#000000;clip-rule:nonzero;overflow:visible;visibility:visible;opacity:1;isolation:auto;mix-blend-mode:normal;color-interpolation:sRGB;color-interpolation-filters:linearRGB;solid-color:#000000;solid-opacity:1;vector-effect:none;fill:#000000;fill-opacity:0.16470589;fill-rule:nonzero;stroke:none;stroke-width:18.89763641;stroke-linecap:round;stroke-linejoin:round;stroke-miterlimit:4;stroke-dasharray:none;stroke-dashoffset:0;stroke-opacity:1;marker:none;filter:url(#filter1228);color-rendering:auto;image-rendering:auto;shape-rendering:auto;text-rendering:auto;enable-background:accumulate"
       d="m 31.808594,11.863281 c -0.579513,0 -1.046875,0.46541 -1.046875,1.044922 V 1092.9551 c 0,0.5795 0.467362,1.0449 1.046875,1.0449 H 761.89258 c 0.57951,0 1.04687,-0.4654 1.04687,-1.0449 V 12.908203 c 0,-0.579512 -0.46736,-1.044922 -1.04687,-1.044922 z M 254.28516,428.96885 c 58.98354,0.0507 113.51747,19.39278 143.3457,50.8418 C 427.68764,448.93422 481.69635,430.0301 540,429.97862 c 91.91469,1.9e-4 166.42603,46.05102 166.42578,102.85742 2.5e-4,56.8064 -74.51109,102.85722 -166.42578,102.85742 -58.98354,-0.0507 -113.51747,-19.39278 -143.3457,-50.8418 -30.05678,30.87643 -84.06549,49.78055 -142.36914,49.83203 C 162.37047,634.6835 87.859125,588.63267 87.859375,531.82627 87.859125,475.01987 162.37047,428.96904 254.28516,428.96885 Z M 53.902344,843.94727 H 736.09766 c 0.57951,0 1.04492,0.46736 1.04492,1.04687 v 222.19336 c 0,0.5795 -0.46541,1.0469 -1.04492,1.0469 H 53.902344 c -0.579512,0 -1.044922,-0.4674 -1.044922,-1.0469 V 844.99414 c 0,-0.57951 0.46541,-1.04687 1.044922,-1.04687 z"
       transform="matrix(0.14173227,0,0,0.14173227,-0.68400598,138.02128)"
       id="rect1203"
       inkscape:connector-curvature="0"
       sodipodi:nodetypes="ssssssssscccccccccsssssssss"
       clip-path="url(#clipPath3143)" />
    <text
       xml:space="preserve"
       style="font-style:normal;font-variant:normal;font-weight:bold;font-stretch:normal;font-size:26.79576874px;line-height:0%;font-family:Uroob;-inkscape-font-specification:'Uroob Bold';font-variant-ligatures:normal;font-variant-position:normal;font-variant-caps:normal;font-variant-numeric:normal;font-variant-alternates:normal;font-feature-settings:normal;text-indent:0;text-align:center;text-decoration:none;text-decoration-line:none;text-decoration-style:solid;text-decoration-color:#000000;letter-spacing:0px;word-spacing:0px;text-transform:none;writing-mode:lr-tb;direction:ltr;text-orientation:mixed;dominant-baseline:auto;baseline-shift:baseline;text-anchor:middle;white-space:normal;shape-padding:0;opacity:1;vector-effect:none;fill:#ffffff;fill-opacity:1;stroke:none;stroke-width:0.14173225px;stroke-linecap:butt;stroke-linejoin:miter;stroke-miterlimit:4;stroke-dasharray:none;stroke-dashoffset:0;stroke-opacity:1"
       x="58.676262"
       y="154.51425"
       id="text837"
       transform="scale(0.93711201,1.0671083)"><tspan
         sodipodi:role="line"
         id="tspan835"
         x="58.676262"
         y="154.51425"
         style="font-style:normal;font-variant:normal;font-weight:bold;font-stretch:normal;font-size:26.79576874px;line-height:0%;font-family:Uroob;-inkscape-font-specification:'Uroob Bold';font-variant-ligatures:normal;font-variant-position:normal;font-variant-caps:normal;font-variant-numeric:normal;font-variant-alternates:normal;font-feature-settings:normal;text-indent:0;text-align:center;text-decoration:none;text-decoration-line:none;text-decoration-style:solid;text-decoration-color:#000000;letter-spacing:0px;word-spacing:0px;text-transform:none;writing-mode:lr-tb;direction:ltr;text-orientation:mixed;dominant-baseline:auto;baseline-shift:baseline;text-anchor:middle;white-space:normal;shape-padding:0;vector-effect:none;fill:#ffffff;fill-opacity:1;stroke:none;stroke-width:0.14173225px;stroke-linecap:butt;stroke-linejoin:miter;stroke-miterlimit:4;stroke-dasharray:none;stroke-dashoffset:0;stroke-opacity:1">GREYFACE</tspan></text>
    <text
       xml:space="preserve"
       style="font-style:normal;font-variant:normal;font-weight:bold;font-stretch:normal;font-size:18.67310524px;line-height:125%;font-family:Uroob;-inkscape-font-specification:'Uroob Bold';font-variant-ligatures:normal;font-variant-position:normal;font-variant-caps:normal;font-variant-numeric:normal;font-variant-alternates:normal;font-feature-settings:normal;text-indent:0;text-align:center;text-decoration:none;text-decoration-line:none;text-decoration-style:solid;text-decoration-color:#000000;letter-spacing:0px;word-spacing:0px;text-transform:none;writing-mode:lr-tb;direction:ltr;text-orientation:mixed;dominant-baseline:auto;baseline-shift:baseline;text-anchor:middle;white-space:normal;shape-padding:0;opacity:1;vector-effect:none;fill:#ffffff;fill-opacity:1;stroke:none;stroke-width:0.13959606px;stroke-linecap:butt;stroke-linejoin:miter;stroke-miterlimit:4;stroke-dasharray:none;stroke-dashoffset:0;stroke-opacity:1"
       x="65.619652"
       y="232.83731"
       id="text865"
       transform="scale(0.84089366,1.189211)"><tspan
         sodipodi:role="line"
         x="65.619652"
         y="232.83731"
         style="font-style:normal;font-variant:normal;font-weight:bold;font-stretch:normal;font-size:18.67310524px;line-height:0%;font-family:Uroob;-inkscape-font-specification:'Uroob Bold';font-variant-ligatures:normal;font-variant-position:normal;font-variant-caps:normal;font-variant-numeric:normal;font-variant-alternates:normal;font-feature-settings:normal;text-indent:0;text-align:center;text-decoration:none;text-decoration-line:none;text-decoration-style:solid;text-decoration-color:#000000;letter-spacing:0px;word-spacing:0px;text-transform:none;writing-mode:lr-tb;direction:ltr;text-orientation:mixed;dominant-baseline:auto;baseline-shift:baseline;text-anchor:middle;white-space:normal;shape-padding:0;vector-effect:none;fill:#ffffff;fill-opacity:1;stroke:none;stroke-width:0.13959606px;stroke-linecap:butt;stroke-linejoin:miter;stroke-miterlimit:4;stroke-dasharray:none;stroke-dashoffset:0;stroke-opacity:1"
         id="tspan914">IS WATCHING YOU</tspan></text>
    <g
       id="g2759"
       transform="matrix(0.53568101,0,0,0.40626633,-0.53582054,163.33978)"
       style="stroke-width:1.14827979">
      <use
         height="100%"
         width="100%"
         transform="matrix(-1,0,0,1,209.44674,2.2122776e-8)"
         id="use2709"
         xlink:href="#g1241"
         y="0"
         x="0"
         style="stroke-width:1.14827979" />
      <g
         transform="matrix(1.0507367,-0.20753973,0,1.0511289,-5.0609109,10.454468)"
         style="stroke:url(#linearGradient3276);stroke-width:1.09262908;stroke-linecap:round;stroke-opacity:0.50196078"
         id="g1241">
        <path
           sodipodi:nodetypes="cc"
           style="color:#000000;clip-rule:nonzero;display:inline;overflow:visible;visibility:visible;opacity:1;isolation:auto;mix-blend-mode:normal;color-interpolation:sRGB;color-interpolation-filters:linearRGB;solid-color:#000000;solid-opacity:1;vector-effect:none;fill:none;fill-opacity:0.16470588;fill-rule:nonzero;stroke:url(#linearGradient3270);stroke-width:0.45890421;stroke-linecap:round;stroke-linejoin:round;stroke-miterlimit:4;stroke-dasharray:none;stroke-dashoffset:0;stroke-opacity:0.50196078;marker:none;color-rendering:auto;image-rendering:auto;shape-rendering:auto;text-rendering:auto;enable-background:accumulate"
           d="m 87.129865,156.6835 c -24.940497,1.79577 -50.64651,1.295 -74.300928,6.94901"
           id="path1232"
           inkscape:connector-curvature="0" />
        <path
           sodipodi:nodetypes="cc"
           inkscape:connector-curvature="0"
           id="path1234"
           d="m 87.541617,161.41468 c -25.044979,4.21394 -53.44645,6.43049 -65.764764,14.8324"
           style="color:#000000;clip-rule:nonzero;display:inline;overflow:visible;visibility:visible;opacity:1;isolation:auto;mix-blend-mode:normal;color-interpolation:sRGB;color-interpolation-filters:linearRGB;solid-color:#000000;solid-opacity:1;vector-effect:none;fill:none;fill-opacity:0.16470588;fill-rule:nonzero;stroke:url(#linearGradient3272);stroke-width:0.45890421;stroke-linecap:round;stroke-linejoin:round;stroke-miterlimit:4;stroke-dasharray:none;stroke-dashoffset:0;stroke-opacity:0.50196078;marker:none;color-rendering:auto;image-rendering:auto;shape-rendering:auto;text-rendering:auto;enable-background:accumulate"
           inkscape:transform-center-x="54.937982"
           inkscape:transform-center-y="13.890491" />
        <path
           sodipodi:nodetypes="cc"
           inkscape:transform-center-y="27.636181"
           inkscape:transform-center-x="49.470892"
           style="color:#000000;clip-rule:nonzero;display:inline;overflow:visible;visibility:visible;opacity:1;isolation:auto;mix-blend-mode:normal;color-interpolation:sRGB;color-interpolation-filters:linearRGB;solid-color:#000000;solid-opacity:1;vector-effect:none;fill:none;fill-opacity:0.16470588;fill-rule:nonzero;stroke:url(#linearGradient3274);stroke-width:0.45890421;stroke-linecap:round;stroke-linejoin:round;stroke-miterlimit:4;stroke-dasharray:none;stroke-dashoffset:0;stroke-opacity:0.50196078;marker:none;color-rendering:auto;image-rendering:auto;shape-rendering:auto;text-rendering:auto;enable-background:accumulate"
           d="m 89.163858,165.87808 c -8.681264,2.07807 -16.313899,6.86973 -27.158553,15.68"
           id="path1236"
           inkscape:connector-curvature="0" />
      </g>
      <path
         inkscape:connector-curvature="0"
         id="path2620"
         d="M 91.2488,158.2044 C 41.207465,170.27364 26.115635,179.41272 26.115635,179.41272 M 91.447378,162.9328 c -25.219245,9.55023 -45.47407,22.49022 -45.47407,22.49022"
         style="color:#000000;clip-rule:nonzero;display:inline;overflow:visible;visibility:visible;opacity:1;isolation:auto;mix-blend-mode:normal;color-interpolation:sRGB;color-interpolation-filters:linearRGB;solid-color:#000000;solid-opacity:1;vector-effect:none;fill:none;fill-opacity:0.16470588;fill-rule:nonzero;stroke:url(#linearGradient3278);stroke-width:0.48227745;stroke-linecap:round;stroke-linejoin:round;stroke-miterlimit:4;stroke-dasharray:none;stroke-dashoffset:0;stroke-opacity:0.50196078;marker:none;color-rendering:auto;image-rendering:auto;shape-rendering:auto;text-rendering:auto;enable-background:accumulate" />
      <use
         height="100%"
         width="100%"
         transform="matrix(-1,0,0,1,209.44674,2.2122776e-8)"
         id="use2711"
         xlink:href="#path2620"
         y="0"
         x="0"
         style="stroke-width:1.14827979" />
    </g>
    <use
       x="0"
       y="0"
       xlink:href="#g1127"
       id="use1129"
       transform="matrix(-1,0,0,1,111.12499,-3.8083e-8)"
       width="100%"
       height="100%" />
    <g
       id="g1127"
       transform="matrix(0.48953339,-0.21751137,0.21751137,0.48953339,-28.960118,187.88175)">
      <path
         style="color:#000000;clip-rule:nonzero;display:inline;overflow:visible;visibility:visible;opacity:1;isolation:auto;mix-blend-mode:normal;color-interpolation:sRGB;color-interpolation-filters:linearRGB;solid-color:#000000;solid-opacity:1;vector-effect:none;fill:#808080;fill-opacity:1;fill-rule:nonzero;stroke:none;stroke-width:3.77952766;stroke-linecap:round;stroke-linejoin:round;stroke-miterlimit:4;stroke-dasharray:none;stroke-dashoffset:0;stroke-opacity:1;marker:none;color-rendering:auto;image-rendering:auto;shape-rendering:auto;text-rendering:auto;enable-background:accumulate"
         d="m 660.9707,647.85156 c -5.02857,-0.0899 -10.89768,1.37194 -17.74609,4.9668 -29.82957,15.65806 -9.39063,58.90039 -9.39063,58.90039 0,0 -46.10995,-55.32381 -56.44531,8.8418 -3.17868,19.7342 23.94531,47.46679 23.94531,47.46679 0,0 2.09632,59.74557 51.34571,67.82032 49.24938,8.07474 68.49414,-29.9336 68.49414,-29.9336 0,0 20.02694,-2.1422 35.34882,-10.34375 v -69.21679 c -8.69311,1.1265 -19.28046,4.66992 -19.28046,4.66992 0,0 10.18643,-7.71836 16.25,-18.61719 v -28.95898 c -0.27917,-0.40997 -0.57152,-0.82127 -0.88086,-1.23047 -25.96096,-34.34104 -61.83985,11.89648 -61.83985,11.89648 0,0 -2.6465,-45.77624 -29.80078,-46.26172 z"
         transform="matrix(0.24179012,0.10743312,-0.10743312,0.24179012,86.03229,-63.626871)"
         id="path1020"
         inkscape:connector-curvature="0"
         sodipodi:nodetypes="sccccsccccccccs" />
      <ellipse
         transform="rotate(-32.409659)"
         ry="5.4122081"
         rx="9.5548859"
         cy="254.42291"
         cx="55.81097"
         id="path1047"
         style="color:#000000;clip-rule:nonzero;display:inline;overflow:visible;visibility:visible;opacity:1;isolation:auto;mix-blend-mode:normal;color-interpolation:sRGB;color-interpolation-filters:linearRGB;solid-color:#000000;solid-opacity:1;vector-effect:none;fill:#bf6d6d;fill-opacity:1;fill-rule:nonzero;stroke:none;stroke-width:1;stroke-linecap:round;stroke-linejoin:round;stroke-miterlimit:4;stroke-dasharray:none;stroke-dashoffset:0;stroke-opacity:1;marker:none;color-rendering:auto;image-rendering:auto;shape-rendering:auto;text-rendering:auto;enable-background:accumulate" />
      <ellipse
         style="color:#000000;clip-rule:nonzero;display:inline;overflow:visible;visibility:visible;opacity:1;isolation:auto;mix-blend-mode:normal;color-interpolation:sRGB;color-interpolation-filters:linearRGB;solid-color:#000000;solid-opacity:1;vector-effect:none;fill:#bf6d6d;fill-opacity:1;fill-rule:nonzero;stroke:none;stroke-width:1.00002396;stroke-linecap:round;stroke-linejoin:round;stroke-miterlimit:4;stroke-dasharray:none;stroke-dashoffset:0;stroke-opacity:1;marker:none;color-rendering:auto;image-rendering:auto;shape-rendering:auto;text-rendering:auto;enable-background:accumulate"
         id="ellipse1049"
         cx="249.56165"
         cy="58.253101"
         rx="11.392485"
         ry="6.4634023"
         transform="matrix(0.78343642,0.62147194,-0.6137553,0.78949631,0,0)" />
      <ellipse
         inkscape:transform-center-y="0.033887233"
         inkscape:transform-center-x="-0.033543927"
         style="color:#000000;clip-rule:nonzero;display:inline;overflow:visible;visibility:visible;opacity:1;isolation:auto;mix-blend-mode:normal;color-interpolation:sRGB;color-interpolation-filters:linearRGB;solid-color:#000000;solid-opacity:1;vector-effect:none;fill:#bf6d6d;fill-opacity:1;fill-rule:nonzero;stroke:none;stroke-width:1;stroke-linecap:round;stroke-linejoin:round;stroke-miterlimit:4;stroke-dasharray:none;stroke-dashoffset:0;stroke-opacity:1;marker:none;color-rendering:auto;image-rendering:auto;shape-rendering:auto;text-rendering:auto;enable-background:accumulate"
         id="ellipse1051"
         cx="47.014709"
         cy="268.49121"
         rx="9.5548859"
         ry="5.4122081"
         transform="rotate(-32.38677)" />
      <ellipse
         transform="rotate(-67.704757)"
         ry="5.4122081"
         rx="9.5548859"
         cy="225.08139"
         cx="-96.220329"
         id="ellipse1053"
         style="color:#000000;clip-rule:nonzero;display:inline;overflow:visible;visibility:visible;opacity:1;isolation:auto;mix-blend-mode:normal;color-interpolation:sRGB;color-interpolation-filters:linearRGB;solid-color:#000000;solid-opacity:1;vector-effect:none;fill:#bf6d6d;fill-opacity:1;fill-rule:nonzero;stroke:none;stroke-width:1;stroke-linecap:round;stroke-linejoin:round;stroke-miterlimit:4;stroke-dasharray:none;stroke-dashoffset:0;stroke-opacity:1;marker:none;color-rendering:auto;image-rendering:auto;shape-rendering:auto;text-rendering:auto;enable-background:accumulate"
         inkscape:transform-center-x="-0.45976391"
         inkscape:transform-center-y="-0.91829221" />
      <ellipse
         inkscape:transform-center-y="0.22011085"
         inkscape:transform-center-x="0.10313455"
         style="color:#000000;clip-rule:nonzero;display:inline;overflow:visible;visibility:visible;opacity:1;isolation:auto;mix-blend-mode:normal;color-interpolation:sRGB;color-interpolation-filters:linearRGB;solid-color:#000000;solid-opacity:1;vector-effect:none;fill:#bf6d6d;fill-opacity:1;fill-rule:nonzero;stroke:none;stroke-width:1;stroke-linecap:round;stroke-linejoin:round;stroke-miterlimit:4;stroke-dasharray:none;stroke-dashoffset:0;stroke-opacity:1;marker:none;color-rendering:auto;image-rendering:auto;shape-rendering:auto;text-rendering:auto;enable-background:accumulate"
         id="ellipse1055"
         cx="-186.43262"
         cy="146.31879"
         rx="9.5548859"
         ry="5.4122081"
         transform="rotate(-92.698777)" />
      <ellipse
         transform="scale(-1,1)"
         ry="2.328336"
         rx="3.7455838"
         cy="181.47275"
         cx="-187.15829"
         id="path1079"
         style="color:#000000;clip-rule:nonzero;display:inline;overflow:visible;visibility:visible;opacity:1;isolation:auto;mix-blend-mode:normal;color-interpolation:sRGB;color-interpolation-filters:linearRGB;solid-color:#000000;solid-opacity:1;vector-effect:none;fill:#ffffff;fill-opacity:0.21962615;fill-rule:nonzero;stroke:none;stroke-width:1;stroke-linecap:round;stroke-linejoin:round;stroke-miterlimit:4;stroke-dasharray:none;stroke-dashoffset:0;stroke-opacity:1;marker:none;color-rendering:auto;image-rendering:auto;shape-rendering:auto;text-rendering:auto;enable-background:accumulate" />
      <ellipse
         transform="scale(-1,1)"
         style="color:#000000;clip-rule:nonzero;display:inline;overflow:visible;visibility:visible;opacity:1;isolation:auto;mix-blend-mode:normal;color-interpolation:sRGB;color-interpolation-filters:linearRGB;solid-color:#000000;solid-opacity:1;vector-effect:none;fill:#ffffff;fill-opacity:0.21962615;fill-rule:nonzero;stroke:none;stroke-width:0.99999994;stroke-linecap:round;stroke-linejoin:round;stroke-miterlimit:4;stroke-dasharray:none;stroke-dashoffset:0;stroke-opacity:1;marker:none;color-rendering:auto;image-rendering:auto;shape-rendering:auto;text-rendering:auto;enable-background:accumulate"
         id="ellipse1081"
         cx="-173.52464"
         cy="170.71516"
         rx="3.4745038"
         ry="3.3408689" />
      <ellipse
         transform="scale(-1,1)"
         ry="3.6749558"
         rx="3.8219543"
         cy="175.72647"
         cx="-154.81578"
         id="ellipse1083"
         style="color:#000000;clip-rule:nonzero;display:inline;overflow:visible;visibility:visible;opacity:1;isolation:auto;mix-blend-mode:normal;color-interpolation:sRGB;color-interpolation-filters:linearRGB;solid-color:#000000;solid-opacity:1;vector-effect:none;fill:#ffffff;fill-opacity:0.21962615;fill-rule:nonzero;stroke:none;stroke-width:0.99999994;stroke-linecap:round;stroke-linejoin:round;stroke-miterlimit:4;stroke-dasharray:none;stroke-dashoffset:0;stroke-opacity:1;marker:none;color-rendering:auto;image-rendering:auto;shape-rendering:auto;text-rendering:auto;enable-background:accumulate" />
    </g>
    <rect
       style="color:#000000;clip-rule:nonzero;display:inline;overflow:visible;visibility:visible;opacity:0.42000002;isolation:auto;mix-blend-mode:normal;color-interpolation:sRGB;color-interpolation-filters:linearRGB;solid-color:#000000;solid-opacity:1;vector-effect:none;fill:url(#linearGradient1141);fill-opacity:1;fill-rule:nonzero;stroke:none;stroke-width:1;stroke-linecap:round;stroke-linejoin:round;stroke-miterlimit:4;stroke-dasharray:none;stroke-dashoffset:0;stroke-opacity:1;marker:none;filter:url(#filter2930);color-rendering:auto;image-rendering:auto;shape-rendering:auto;text-rendering:auto;enable-background:accumulate"
       id="rect1133"
       width="184.0744"
       height="23.623514"
       x="12.662203"
       y="199.21721"
       ry="0.36804172"
       transform="matrix(0.53568101,0,0,0.53568101,-0.68400598,138.02128)" />
    <g
       id="g2819"
       transform="matrix(0.46987023,0,0,0.58969427,6.6214007,147.41207)"
       style="fill:#000000;fill-opacity:0.25098039;stroke-width:1.01766264">
      <path
         sodipodi:nodetypes="sccs"
         inkscape:connector-curvature="0"
         id="path2797"
         d="m 41.918188,58.204632 c 10.902843,1.118818 15.978344,4.520946 24.28034,5.674459 C 68.637831,74.317457 52.578209,65.550932 54.151291,78.006058 47.670344,71.525598 28.804484,56.858943 41.918188,58.204632 Z"
         style="color:#000000;clip-rule:nonzero;display:inline;overflow:visible;visibility:visible;opacity:1;isolation:auto;mix-blend-mode:normal;color-interpolation:sRGB;color-interpolation-filters:linearRGB;solid-color:#000000;solid-opacity:1;vector-effect:none;fill:#000000;fill-opacity:0.25098039;fill-rule:nonzero;stroke:none;stroke-width:1.01766253;stroke-linecap:round;stroke-linejoin:round;stroke-miterlimit:4;stroke-dasharray:none;stroke-dashoffset:0;stroke-opacity:1;marker:none;color-rendering:auto;image-rendering:auto;shape-rendering:auto;text-rendering:auto;enable-background:accumulate" />
      <use
         height="100%"
         width="100%"
         transform="matrix(-1,0,0,1,209.17935,4.5324555e-8)"
         id="use2815"
         xlink:href="#path2797"
         y="0"
         x="0"
         style="fill:#000000;fill-opacity:0.25098039;stroke-width:1.00526834" />
    </g>
    <path
       inkscape:connector-curvature="0"
       id="path2821"
       d="m 50.725337,225.72487 4.837067,2.66408 4.837264,-2.66408 z"
       style="color:#000000;clip-rule:nonzero;display:inline;overflow:visible;visibility:visible;opacity:1;isolation:auto;mix-blend-mode:normal;color-interpolation:sRGB;color-interpolation-filters:linearRGB;solid-color:#000000;solid-opacity:1;vector-effect:none;fill:#bf6d6d;fill-opacity:0.25098039;fill-rule:nonzero;stroke:none;stroke-width:0.53568101;stroke-linecap:round;stroke-linejoin:round;stroke-miterlimit:4;stroke-dasharray:none;stroke-dashoffset:0;stroke-opacity:1;marker:none;color-rendering:auto;image-rendering:auto;shape-rendering:auto;text-rendering:auto;enable-background:accumulate" />
    <rect
       style="color:#000000;clip-rule:nonzero;display:inline;overflow:visible;visibility:visible;opacity:1;isolation:auto;mix-blend-mode:normal;color-interpolation:sRGB;color-interpolation-filters:linearRGB;solid-color:#000000;solid-opacity:1;vector-effect:none;fill:none;fill-opacity:1;fill-rule:nonzero;stroke:#f9f9f9;stroke-width:2.67840481;stroke-linecap:round;stroke-linejoin:round;stroke-miterlimit:4;stroke-dasharray:none;stroke-dashoffset:0;stroke-opacity:1;marker:none;color-rendering:auto;image-rendering:auto;shape-rendering:auto;text-rendering:auto;enable-background:accumulate"
       id="rect2860"
       width="103.77316"
       height="153.37384"
       x="3.67591"
       y="139.70267"
       ry="0.14825927" />
    <path
       style="color:#000000;clip-rule:nonzero;display:inline;overflow:visible;visibility:visible;opacity:0.42000002;isolation:auto;mix-blend-mode:normal;color-interpolation:sRGB;color-interpolation-filters:linearRGB;solid-color:#000000;solid-opacity:1;vector-effect:none;fill:#636363;fill-opacity:1;fill-rule:nonzero;stroke:none;stroke-width:0.53568101;stroke-linecap:round;stroke-linejoin:round;stroke-miterlimit:4;stroke-dasharray:none;stroke-dashoffset:0;stroke-opacity:1;marker:none;color-rendering:auto;image-rendering:auto;shape-rendering:auto;text-rendering:auto;enable-background:accumulate"
       d="m 11.199204,250.44472 1.861226,-3.43612 -3.292938,-3.29293 4.295136,2.86343 1.431712,-3.86563 2.147569,2.57708 3.436109,-2.0044 -1.288542,2.57709 2.577082,1.57488 -6.299532,-0.85902 z"
       id="path2878"
       inkscape:connector-curvature="0" />
    <path
       inkscape:connector-curvature="0"
       id="path2880"
       d="m 100.2517,250.37094 -1.86123,-3.85912 3.29293,-2.54456 -4.295124,1.88728 -1.431715,-4.19102 -2.147567,2.089 -3.436109,-2.78533 1.288543,2.86993 -1.574887,3.13674 5.297334,-1.57488 z"
       style="color:#000000;clip-rule:nonzero;display:inline;overflow:visible;visibility:visible;opacity:0.42000002;isolation:auto;mix-blend-mode:normal;color-interpolation:sRGB;color-interpolation-filters:linearRGB;solid-color:#000000;solid-opacity:1;vector-effect:none;fill:#636363;fill-opacity:1;fill-rule:nonzero;stroke:none;stroke-width:0.53568101;stroke-linecap:round;stroke-linejoin:round;stroke-miterlimit:4;stroke-dasharray:none;stroke-dashoffset:0;stroke-opacity:1;marker:none;color-rendering:auto;image-rendering:auto;shape-rendering:auto;text-rendering:auto;enable-background:accumulate"
       sodipodi:nodetypes="ccccccccccc" />
    <path
       sodipodi:type="star"
       style="color:#000000;clip-rule:nonzero;display:inline;overflow:visible;visibility:visible;opacity:1;isolation:auto;mix-blend-mode:normal;color-interpolation:sRGB;color-interpolation-filters:linearRGB;solid-color:#000000;solid-opacity:1;vector-effect:none;fill:#000000;fill-opacity:0.25098039;fill-rule:nonzero;stroke:#000000;stroke-width:1.19995817;stroke-linecap:round;stroke-linejoin:miter;stroke-miterlimit:4;stroke-dasharray:none;stroke-dashoffset:0;stroke-opacity:0.50196078;marker:none;color-rendering:auto;image-rendering:auto;shape-rendering:auto;text-rendering:auto;enable-background:accumulate"
       id="path3379"
       sodipodi:sides="3"
       sodipodi:cx="55.5625"
       sodipodi:cy="188.08765"
       sodipodi:r1="16.723577"
       sodipodi:r2="8.3617887"
       sodipodi:arg1="1.5707963"
       sodipodi:arg2="2.6179939"
       inkscape:flatsided="true"
       inkscape:rounded="0.1"
       inkscape:randomized="0"
       d="m 55.5625,204.81122 c -2.896608,0 -15.931347,-22.57683 -14.483043,-25.08536 1.448304,-2.50854 27.517781,-2.50854 28.966086,0 1.448304,2.50853 -11.586434,25.08536 -14.483043,25.08536 z"
       inkscape:transform-center-y="3.7418288"
       transform="matrix(0.20421517,0,0,0.89498244,44.215796,20.129145)" />
    <path
       transform="matrix(0.15980701,-0.02171542,0,0.71536895,35.721913,54.063034)"
       inkscape:transform-center-y="2.9726262"
       d="m 55.5625,204.81122 c -2.896608,0 -15.931347,-22.57683 -14.483043,-25.08536 1.448304,-2.50854 27.517781,-2.50854 28.966086,0 1.448304,2.50853 -11.586434,25.08536 -14.483043,25.08536 z"
       inkscape:randomized="0"
       inkscape:rounded="0.1"
       inkscape:flatsided="true"
       sodipodi:arg2="2.6179939"
       sodipodi:arg1="1.5707963"
       sodipodi:r2="8.3617887"
       sodipodi:r1="16.723577"
       sodipodi:cy="188.08765"
       sodipodi:cx="55.5625"
       sodipodi:sides="3"
       id="path3381"
       style="color:#000000;clip-rule:nonzero;display:inline;overflow:visible;visibility:visible;opacity:1;isolation:auto;mix-blend-mode:normal;color-interpolation:sRGB;color-interpolation-filters:linearRGB;solid-color:#000000;solid-opacity:1;vector-effect:none;fill:#000000;fill-opacity:0.25098039;fill-rule:nonzero;stroke:#000000;stroke-width:1.199;stroke-linecap:round;stroke-linejoin:miter;stroke-miterlimit:4;stroke-dasharray:none;stroke-dashoffset:0;stroke-opacity:0.50196078;marker:none;color-rendering:auto;image-rendering:auto;shape-rendering:auto;text-rendering:auto;enable-background:accumulate"
       sodipodi:type="star" />
    <use
       x="0"
       y="0"
       xlink:href="#path3381"
       inkscape:transform-center-y="1.6993415"
       id="use3391"
       transform="matrix(-1,0,0,1,111.125,-0.09449405)"
       width="100%"
       height="100%"
       style="fill:#000000;fill-opacity:0.25098041;stroke:#000000;stroke-opacity:0.50196081" />
    <path
       style="color:#000000;clip-rule:nonzero;display:inline;overflow:visible;visibility:visible;opacity:1;isolation:auto;mix-blend-mode:normal;color-interpolation:sRGB;color-interpolation-filters:linearRGB;solid-color:#000000;solid-opacity:1;vector-effect:none;fill:#000000;fill-opacity:0.1254902;fill-rule:nonzero;stroke:none;stroke-width:0.35198715;stroke-linecap:round;stroke-linejoin:round;stroke-miterlimit:4;stroke-dasharray:none;stroke-dashoffset:0;stroke-opacity:0.25098039;marker:none;color-rendering:auto;image-rendering:auto;shape-rendering:auto;text-rendering:auto;enable-background:accumulate"
       d="m 50.317031,196.39089 -1.551871,1.65826 c -2.008356,2.14608 1.653384,5.60276 2.82659,7.74884 l 0.906544,1.65826 c -0.786,-3.14219 -3.52678,-7.92317 -2.181263,-11.06536 z m 10.490407,0 c 1.345712,3.14227 -1.394929,7.92309 -2.181043,11.06536 l 0.906853,-1.65826 c 1.173206,-2.14608 4.834946,-5.60276 2.82659,-7.74884 z"
       id="rect3393"
       inkscape:connector-curvature="0"
       sodipodi:nodetypes="cccccccccc" />
    <path
       sodipodi:nodetypes="cccccccccc"
       inkscape:connector-curvature="0"
       id="path3416"
       d="m 35.577212,200.6672 -2.795575,1.65826 c -6.73088,2.14608 5.541215,5.60276 9.473143,7.74884 l 3.038226,1.65826 c -2.63423,-3.14219 -14.84226,-7.92317 -9.715794,-11.06536 z m 39.968801,0 c 5.127208,3.14227 -7.080443,7.92309 -9.715056,11.06536 l 3.039261,-1.65826 c 3.931928,-2.14608 16.204023,-5.60276 9.473143,-7.74884 z"
       style="color:#000000;clip-rule:nonzero;display:inline;overflow:visible;visibility:visible;opacity:1;isolation:auto;mix-blend-mode:normal;color-interpolation:sRGB;color-interpolation-filters:linearRGB;solid-color:#000000;solid-opacity:1;vector-effect:none;fill:#000000;fill-opacity:0.0627451;fill-rule:nonzero;stroke:none;stroke-width:0.64438057;stroke-linecap:round;stroke-linejoin:round;stroke-miterlimit:4;stroke-dasharray:none;stroke-dashoffset:0;stroke-opacity:0.25098039;marker:none;color-rendering:auto;image-rendering:auto;shape-rendering:auto;text-rendering:auto;enable-background:accumulate" />
    <g
       id="g3431"
       transform="translate(0.02055211)">
      <circle
         r="1.503391"
         cy="283.06854"
         cx="50.280079"
         id="path3422"
         style="color:#000000;clip-rule:nonzero;display:inline;overflow:visible;visibility:visible;opacity:1;isolation:auto;mix-blend-mode:normal;color-interpolation:sRGB;color-interpolation-filters:linearRGB;solid-color:#000000;solid-opacity:1;vector-effect:none;fill:#ffffff;fill-opacity:1;fill-rule:nonzero;stroke:none;stroke-width:0.23;stroke-linecap:round;stroke-linejoin:round;stroke-miterlimit:4;stroke-dasharray:none;stroke-dashoffset:0;stroke-opacity:0.25098039;marker:none;color-rendering:auto;image-rendering:auto;shape-rendering:auto;text-rendering:auto;enable-background:accumulate" />
      <use
         height="100%"
         width="100%"
         transform="translate(5.2618712)"
         id="use3424"
         xlink:href="#path3422"
         y="0"
         x="0" />
      <use
         x="0"
         y="0"
         xlink:href="#path3422"
         id="use3426"
         transform="translate(10.523738)"
         width="100%"
         height="100%" />
    </g>
  </g>
</svg>
