<?xml version="1.0" encoding="UTF-8" standalone="no"?>
<!-- Created with Inkscape (http://www.inkscape.org/) -->

<svg
   width="64"
   height="64"
   viewBox="0 0 16.933333 16.933333"
   version="1.1"
   id="svg5"
   sodipodi:docname="dash.svg"
   inkscape:export-filename="../Resources/Textures/Dash.png"
   inkscape:export-xdpi="96"
   inkscape:export-ydpi="96"
   inkscape:version="1.1.2 (0a00cf5339, 2022-02-04)"
   xmlns:inkscape="http://www.inkscape.org/namespaces/inkscape"
   xmlns:sodipodi="http://sodipodi.sourceforge.net/DTD/sodipodi-0.dtd"
   xmlns="http://www.w3.org/2000/svg"
   xmlns:svg="http://www.w3.org/2000/svg">
  <sodipodi:namedview
     id="namedview7"
     pagecolor="#505050"
     bordercolor="#eeeeee"
     borderopacity="1"
     inkscape:pageshadow="0"
     inkscape:pageopacity="0"
     inkscape:pagecheckerboard="0"
     inkscape:document-units="px"
     showgrid="false"
     units="px"
     width="64px"
     inkscape:snap-global="true"
     inkscape:snap-page="true"
     inkscape:zoom="8.1029756"
     inkscape:cx="8.8856247"
     inkscape:cy="15.426432"
     inkscape:window-width="1920"
     inkscape:window-height="1056"
     inkscape:window-x="0"
     inkscape:window-y="0"
     inkscape:window-maximized="1"
     inkscape:current-layer="layer1" />
  <defs
     id="defs2">
    <filter
       inkscape:collect="always"
       style="color-interpolation-filters:sRGB"
       id="filter1112"
       x="-0.063480015"
       y="-0.063479987"
       width="1.12696"
       height="1.12696">
      <feGaussianBlur
         inkscape:collect="always"
         stdDeviation="0.39190092"
         id="feGaussianBlur1114" />
    </filter>
  </defs>
  <g
     inkscape:label="Layer 1"
     inkscape:groupmode="layer"
     id="layer1">
    <rect
       style="fill:#e7cb72;stroke:#463c29;stroke-width:2.11666;stroke-linejoin:round;stroke-miterlimit:4;stroke-dasharray:none;stop-color:#000000;fill-opacity:1"
       id="rect846"
       width="14.816667"
       height="14.816673"
       x="1.0583301"
       y="1.0583301" />
    <rect
       style="fill:#e7cb72;stroke:#322a1d;stroke-width:2.11666;stroke-linejoin:round;stroke-miterlimit:4;stroke-dasharray:none;stop-color:#000000;fill-opacity:1;stroke-opacity:1"
       id="rect1090"
       width="14.816667"
       height="14.816673"
       x="1.0583301"
       y="1.0583301" />
    <rect
       style="mix-blend-mode:normal;fill:#877333;fill-opacity:1;stroke:none;stroke-width:2.34841;stroke-linejoin:round;stroke-miterlimit:4;stroke-dasharray:none;filter:url(#filter1112);stop-color:#000000"
       id="rect1092"
       width="14.816667"
       height="14.816673"
       x="1.0583301"
       y="1.0583301"
       transform="matrix(0.90131556,0,0,0.90131556,0.83552797,0.83552823)" />
  </g>
</svg>
