<?xml version="1.0" encoding="UTF-8" standalone="no"?>
<!-- Created with Inkscape (http://www.inkscape.org/) -->

<svg
   xmlns:dc="http://purl.org/dc/elements/1.1/"
   xmlns:cc="http://creativecommons.org/ns#"
   xmlns:rdf="http://www.w3.org/1999/02/22-rdf-syntax-ns#"
   xmlns:svg="http://www.w3.org/2000/svg"
   xmlns="http://www.w3.org/2000/svg"
   xmlns:sodipodi="http://sodipodi.sourceforge.net/DTD/sodipodi-0.dtd"
   xmlns:inkscape="http://www.inkscape.org/namespaces/inkscape"
   width="1024"
   height="1024"
   viewBox="0 0 270.93333 270.93334"
   version="1.1"
   id="svg8"
   inkscape:version="0.92.3 (2405546, 2018-03-11)"
   sodipodi:docname="Title.svg"
   inkscape:export-filename="/home/frode/Creations/Games/AmazingUrho/Resources/Textures/Title.png"
   inkscape:export-xdpi="96"
   inkscape:export-ydpi="96">
  <defs
     id="defs2" />
  <sodipodi:namedview
     id="base"
     pagecolor="#808080"
     bordercolor="#666666"
     borderopacity="1.0"
     inkscape:pageopacity="0"
     inkscape:pageshadow="2"
     inkscape:zoom="0.49497475"
     inkscape:cx="361.11829"
     inkscape:cy="609.65298"
     inkscape:document-units="mm"
     inkscape:current-layer="layer1"
     showgrid="false"
     units="px"
     showguides="true"
     inkscape:guide-bbox="true"
     inkscape:snap-global="false"
     inkscape:window-width="1920"
     inkscape:window-height="1061"
     inkscape:window-x="0"
     inkscape:window-y="0"
     inkscape:window-maximized="1">
    <sodipodi:guide
       position="174.25973,135.46667"
       orientation="0,1"
       id="guide1550"
       inkscape:locked="false"
       inkscape:label=""
       inkscape:color="rgb(0,0,255)" />
  </sodipodi:namedview>
  <metadata
     id="metadata5">
    <rdf:RDF>
      <cc:Work
         rdf:about="">
        <dc:format>image/svg+xml</dc:format>
        <dc:type
           rdf:resource="http://purl.org/dc/dcmitype/StillImage" />
        <dc:title></dc:title>
      </cc:Work>
    </rdf:RDF>
  </metadata>
  <g
     inkscape:label="Layer 1"
     inkscape:groupmode="layer"
     id="layer1"
     transform="translate(0,-26.06665)">
    <path
       style="fill:#000000;fill-opacity:1;fill-rule:nonzero;stroke:none;stroke-width:2.19563103px;stroke-linecap:butt;stroke-linejoin:miter;stroke-opacity:1"
       d="M 340.26367 517.7832 C 334.00825 517.75297 307.03862 519.33101 299.89258 520.61719 C 270.54434 526.48298 242.15179 536.8371 215.5918 550.58203 C 191.26493 563.21317 168.68162 579.97015 151.68164 601.62695 C 137.76105 619.3608 126.27075 638.81705 113.39258 657.29297 C 97.174266 681.25336 80.42327 704.89514 62.048828 727.26367 C 54.485102 737.54697 52.182191 751.24431 55.267578 763.56055 C 56.11886 768.20748 58.140883 772.63122 58.494141 777.35938 C 58.30936 785.8144 54.220857 793.82811 55.175781 802.36523 C 55.32666 816.15858 61.53315 829.51245 71.197266 839.22852 C 76.783914 845.72511 79.999907 853.8174 82.541016 861.94531 C 86.856885 875.75 91.802349 889.78234 100.89258 901.28711 C 112.15103 914.90705 127.52983 924.29064 143.26172 931.95117 C 178.89137 949.30106 214.3057 967.15203 250.67773 982.91406 C 264.2329 988.33731 278.59081 991.76094 291.62891 998.44727 C 300.51335 1003.2405 309.08843 1008.9706 318.98438 1011.498 C 332.6608 1015.5775 346.91196 1017.0816 361.00781 1018.9707 C 399.49059 1023.4322 438.94075 1022.0599 476.52539 1012.2227 C 489.80971 1008.5702 502.68896 1003.605 515.3418 998.18555 C 510.88993 997.27215 506.42173 998.64498 501.97852 998.95898 C 488.15701 1000.6349 474.19343 1001.1804 460.28125 1000.6738 C 447.27321 1000.1442 434.30698 998.57226 421.55273 995.95898 C 426.20477 994.14496 431.22216 995.04003 436.08203 994.88477 C 469.71813 993.81009 503.47938 992.85762 536.73242 987.36328 C 570.23521 982.58154 604.14784 978.36737 638.00391 980.79492 C 666.92224 982.86841 694.75041 992.91989 723.80859 993.99414 C 746.49218 993.92535 769.04604 989.31882 791.75 991.10938 C 809.56964 994.07827 818.58877 1000.6709 836.49609 1003.2168 C 845.44004 1002.7249 852.98973 995.20344 854.66992 986.59375 C 862.16575 957.52537 869.04788 921.49454 876.95703 892.53516 C 878.94166 890.2716 882.24573 891.20649 884.70703 892.00586 C 893.82692 894.57953 902.05321 900.45761 911.70117 900.86523 C 918.49003 901.1521 924.8169 893.82759 927.44727 887.85352 C 933.00143 875.23862 944.95772 853.88999 950.18945 825.61523 C 954.28325 803.49026 958.22626 781.23907 959.00586 758.75391 C 960.80756 706.78979 951.33093 672.46969 949.17773 660.30664 C 947.10772 648.61274 938.58176 650.1664 930.08398 649.91797 C 881.21821 648.4895 871.59605 657.42482 863.43945 657.25391 C 861.10499 657.20591 861.86529 657.27285 863.16016 655.44727 C 879.9594 631.70057 917.86227 593.27784 932.51758 568.03906 C 935.73913 562.49091 938.69081 556.7153 940.60352 550.59961 C 941.18534 548.74023 938.46471 547.80109 936.54297 547.69727 C 881.37846 544.71681 834.05046 546.95035 778.89453 548.42188 C 720.85338 549.97035 662.55063 549.28 604.91016 541.82031 C 582.2226 538.88415 560.11906 532.70056 537.76172 527.9707 C 519.9855 524.21004 502.0096 521.14676 483.82422 520.27539 C 436.00401 517.98405 388.12212 518.00782 340.26367 517.7832 z M 878.04688 577.50195 C 878.94251 577.49015 879.74907 577.49392 880.46094 577.51367 L 880.47461 577.51367 C 881.16777 577.53257 881.78537 577.56805 882.33594 577.61719 C 883.8651 577.75514 884.27679 577.97497 884.83008 578.16406 C 884.64677 578.24116 884.68348 579.05956 882.96289 581.66211 C 878.71633 588.08508 869.09506 597.51486 861.40039 605.35742 C 847.46059 619.56512 828.77616 644.9613 810.59766 672.55469 C 804.37841 673.36551 798.1682 673.37704 791.94336 672.77734 C 797.49446 661.03269 802.99109 649.22389 806.16211 639.96484 C 808.1727 634.09407 809.60355 628.9718 810.24414 624.48438 C 810.88473 619.99694 811.72478 615.58856 807.58008 611.15234 C 799.37094 602.36589 785.23021 598.97022 767.6875 595.4082 C 750.14475 591.84623 729.32562 589.20445 709.55469 586.66797 C 704.6475 586.03841 701.52254 585.33075 696.81445 584.70312 C 729.62226 585.7804 761.39446 585.08114 789.13086 583.55273 C 830.90875 581.25075 864.61222 577.67894 878.04688 577.50195 z M 906.20117 681.91406 C 907.09036 681.89187 907.95027 681.89832 908.77734 681.9375 C 914.88536 682.22701 918.77583 683.77771 921.7832 687.20117 C 925.32541 691.23359 929.33738 704.75439 930.58398 722.03711 C 931.83055 739.31983 931.12773 760.43587 928.98047 781.07031 C 926.83321 801.70476 923.23465 821.90918 918.875 837.35547 C 916.6952 845.07859 914.30707 851.62461 911.98047 856.26953 C 909.6539 860.9145 907.10987 863.38138 906.67969 863.60547 C 904.03761 864.98182 896.29444 865.06135 886.35156 862.43359 C 876.40868 859.80588 864.46778 855.13676 852.55664 850.24609 C 840.64546 845.35542 828.75843 840.25196 818.37891 836.70703 C 807.99934 833.1621 799.57275 830.12569 791.05078 833.37109 C 786.36674 835.15496 782.64895 836.70568 780.10352 837.5625 C 778.8099 837.99794 779.21039 837.9345 778.73047 838.00586 C 778.39976 836.27238 778.11226 833.18077 778.16211 828.16602 C 778.27738 816.56812 777.85815 782.85925 779.59375 752.75195 C 780.46157 737.69832 781.91074 723.52424 784.04492 714.09375 C 785.09635 709.4478 786.41822 706.01324 787.27148 704.61523 C 807.62231 709.20872 830.32844 702.79518 851.92969 695.89648 C 872.74212 689.2497 892.86341 682.24699 906.20117 681.91406 z M 897.05078 698.43164 C 885.39184 698.38329 870.09741 700.02139 855.56055 702.42969 C 846.61478 703.91172 838.07203 705.70085 831.02344 707.70898 C 823.97485 709.71716 818.75821 711.06231 814.38477 715.37891 C 811.45306 718.27232 810.57842 721.2736 809.56445 724.82031 C 808.55044 728.36698 807.77945 732.48713 807.12109 737.10352 C 805.80438 746.33626 804.99142 757.50977 804.45703 768.64648 C 803.38826 790.91996 803.47941 813.24718 803.4375 817.20312 C 803.40348 820.51006 804.99295 822.45924 806.22852 823.76562 C 807.46412 825.07206 808.74692 825.98864 810.18359 826.89648 C 813.05694 828.71213 816.58364 830.37347 820.75586 832.08594 C 829.10038 835.51083 839.94585 838.993 851.11719 841.94141 C 862.28849 844.88982 873.71549 847.29067 883.26562 848.41406 C 888.04068 848.97574 892.32253 849.23824 896.125 848.99805 C 899.92747 848.75767 903.51531 848.6041 907.04883 845.09961 C 910.66818 841.50985 910.97191 838.41973 912.10547 833.99023 C 913.23906 829.56078 914.24314 824.09311 915.16992 817.81641 C 917.02352 805.26293 918.54077 789.53854 919.57031 773.84961 C 920.59989 758.16071 921.13987 742.54744 921.00195 730.21484 C 920.93317 724.04854 920.70046 718.72085 920.23438 714.44727 C 920.00118 712.31043 919.71698 710.44822 919.28906 708.71875 C 918.86111 706.98928 918.66577 705.40966 916.61719 703.16016 C 914.55485 700.89554 912.56031 700.31618 910.63672 699.7793 C 908.71317 699.24238 906.70989 698.9455 904.48828 698.74609 C 902.23898 698.5441 899.74131 698.4428 897.05078 698.43164 z M 749.74023 746.55078 L 749.74219 746.55078 C 749.65072 747.52023 749.60728 748.82855 749.49805 749.75586 L 749.46094 750.11719 L 749.45312 750.47852 C 749.27172 766.08154 747.94451 782.62166 747.41602 799.21484 C 742.97998 798.73095 737.77583 798.05311 734.97656 797.55273 C 730.33825 796.72362 727.85854 795.84501 723.71289 789.75781 C 724.60822 791.07248 723.67523 789.44495 723.48438 787.46289 C 723.29237 785.48087 723.26605 782.85946 723.45312 780.38281 C 723.64097 777.90616 724.06815 775.51254 724.49414 774.17383 C 724.67896 773.59318 724.81723 773.36364 724.81836 773.34766 C 731.40377 770.51123 736.36322 765.03122 742.50586 757.25586 C 744.77195 754.38742 747.35441 749.93316 749.74023 746.55078 z M 809.49023 868.29297 C 820.54993 871.94501 831.82048 876.75608 843.45508 881.90625 C 843.82509 887.11402 843.96054 892.55236 842.77539 899.54883 C 837.80652 928.88083 834.66297 948.1904 831.55469 957.70312 C 830.12735 962.07147 828.83424 963.30533 828.91992 963.36523 C 828.57976 963.24505 828.25846 963.17824 827.33984 962.58984 C 808.85996 950.75191 784.8014 954.83476 757.01953 957.20898 C 729.2377 959.58325 697.28362 961.13702 662.40625 948.92578 C 661.86427 948.73605 661.42507 948.7436 660.88672 948.56445 C 661.22952 948.61623 661.62474 948.5879 661.96289 948.64648 C 701.03984 955.19935 717.80421 949.12511 757.6543 944.68945 C 772.86943 942.99588 784.14063 941.99435 792.9707 940.02344 C 801.80078 938.05253 809.19379 934.54945 812.98242 927.52539 C 816.7711 920.50133 816.54832 912.31436 815.20508 901.44531 C 814.18646 893.20277 811.8106 880.8901 809.49023 868.29297 z "
       transform="matrix(0.26458333,0,0,0.26458333,0,26.06665)"
       id="path4231" />
    <path
       sodipodi:nodetypes="csssscssssssssssssssssssssssssssc"
       inkscape:transform-center-y="-2.5077393"
       inkscape:transform-center-x="137.3879"
       inkscape:connector-curvature="0"
       id="path4235"
       d="m 82.436541,169.51037 c -4.775999,1.65003 -9.467619,3.66078 -14.132325,5.74703 -6.178871,2.76346 -12.409443,5.90944 -17.684514,10.90007 -6.031185,5.70598 -10.476039,13.55694 -15.411305,20.60887 l -12.581954,17.97818 c -1.433976,2.049 -0.563245,5.7662 1.754261,8.19861 -1.653779,2.31374 -2.368985,2.79082 -2.499218,5.37629 -0.31336,6.22028 4.847252,1.82445 6.06384,11.04098 0.49806,3.77311 2.177765,5.16986 4.356571,8.00414 3.709591,4.82553 8.642114,7.67803 13.500346,10.16564 6.870418,3.5179 12.887501,4.85688 19.592461,8.94099 2.407049,1.46618 5.479457,1.78113 7.887496,-0.0724 2.814524,-2.16652 4.433217,-5.96094 6.318263,-9.25393 2.303915,-4.02469 3.565103,-1.8135 4.823943,-6.58944 0.763365,-2.89616 -0.6773,-6.03974 -2.675194,-7.57625 -2.0984,-1.61383 -4.146306,-3.77235 -4.897543,-6.87462 -0.807952,-3.33648 0.489528,-7.01254 2.487181,-9.24342 1.007606,-1.12523 2.580446,-2.93769 2.435126,-4.10413 -0.309604,-2.48503 -0.873824,-4.70598 -0.48044,-7.05127 0.459101,-2.73717 1.284059,-6.89606 0.575607,-8.10181 -1.170696,-1.99249 -2.817443,-3.84609 -2.98582,-6.49835 -0.274577,-4.325 0.523883,-8.7025 -0.022,-12.99723 -0.142519,-1.12139 -1.615313,-0.5746 -1.878881,0.37841 -0.319916,1.1568 -0.546198,2.35475 -0.834425,3.52536 -3.158036,12.82582 -2.774226,15.60834 -7.923853,23.16958 -1.231991,1.80895 -1.790555,22.38902 -6.043505,23.90697 -6.282534,2.24235 -16.869065,-5.90345 -19.728116,-13.28928 -3.784907,-9.7776 3.984254,-17.93134 5.328307,-20.92505 1.930882,-4.30079 3.602802,-8.78328 5.780701,-12.88988 2.151415,-4.05666 4.725049,-7.75579 7.721739,-10.80862 6.984172,-7.11501 15.246108,-11.91739 21.839283,-19.65669 0.579917,-0.68073 0.171963,-2.3051 -0.686046,-2.00867 z"
       style="fill:#ffffff;fill-opacity:1;fill-rule:evenodd;stroke:none;stroke-width:0.58092737px;stroke-linecap:butt;stroke-linejoin:miter;stroke-opacity:1" />
    <path
       sodipodi:nodetypes="sscsssccssssssssscssssssss"
       inkscape:transform-center-y="63.433184"
       inkscape:transform-center-x="251.45103"
       inkscape:connector-curvature="0"
       id="path4237"
       d="m 86.993156,225.5111 c 0.751858,-3.56399 0.748698,-4.67049 2.43799,-4.57622 1.689311,0.0942 3.163877,0.60824 3.163877,0.60824 0,0 1.522969,-6.63174 1.261443,-10.11021 -0.261532,-3.47849 1.060318,-2.40786 2.891548,-2.88756 1.83123,-0.47969 2.430881,-0.14195 2.217351,7.03239 -0.213546,7.17431 -0.01868,8.0006 -0.01868,8.0006 3.735815,0.31337 5.112105,-0.39868 5.499515,1.46821 0.0675,-1.02744 0.003,-1.557 1.08131,-1.62039 1.41143,-0.083 2.54475,-0.039 3.34755,-1.61505 0.80278,-1.57599 1.60004,-2.006 2.67121,-1.52541 1.07118,0.4806 0.26337,3.09648 1.77324,3.29812 1.50986,0.20164 6.52355,-0.63988 7.0718,1.09644 0.54825,1.73631 0.73415,8.52587 -0.62752,10.57263 -1.36169,2.04679 -4.68161,1.63041 -7.07646,1.3009 -1.33415,-0.18356 -1.51166,2.85495 -3.17811,2.1451 -1.66645,-0.70987 -0.62408,-2.49976 -1.97583,-2.51152 -1.35175,-0.0109 -3.26322,0.61704 -3.23596,-0.91108 0.0272,-1.52813 0.19195,1.42049 -1.51929,1.75078 -1.71124,0.3303 -3.17571,-1.03884 -2.6752,2.35308 0.5005,3.39192 1.00431,22.57251 -0.893714,28.65512 -1.898035,6.08261 -4.58696,11.27944 -6.436628,11.46217 -1.849673,0.1827 3.530141,-6.49724 2.60056,-19.83899 -0.929592,-13.34172 -1.341668,-22.69747 -2.429958,-23.75092 -1.088282,-1.05346 -4.949244,-0.1563 -5.254118,-2.89175 -0.304859,-2.73544 -1.097733,-5.59976 -0.695878,-7.50468 z"
       style="color:#000000;clip-rule:nonzero;display:inline;overflow:visible;visibility:visible;opacity:1;isolation:auto;mix-blend-mode:normal;color-interpolation:sRGB;color-interpolation-filters:linearRGB;solid-color:#000000;solid-opacity:1;fill:#ffffff;fill-opacity:1;fill-rule:evenodd;stroke:none;stroke-width:0.58092737px;stroke-linecap:butt;stroke-linejoin:miter;stroke-miterlimit:4;stroke-dasharray:none;stroke-dashoffset:0;stroke-opacity:1;marker:none;color-rendering:auto;image-rendering:auto;shape-rendering:auto;text-rendering:auto;enable-background:accumulate" />
    <path
       inkscape:transform-center-y="-11.202832"
       inkscape:transform-center-x="68.771713"
       sodipodi:nodetypes="ssssssssssssssssssssssssssssssssssscsssssss"
       inkscape:connector-curvature="0"
       id="path4239"
       d="m 125.71759,174.9195 c -0.15573,0.77054 1.89674,3.75394 2.63406,5.95582 2.64087,6.73908 3.30894,14.67122 3.47873,22.08224 0.13868,5.91057 -0.0717,11.85024 -0.62714,17.77882 -0.0871,0.9297 -0.92146,1.39535 -1.61309,1.56395 -0.7389,0.18286 -1.47886,-0.02 -2.17284,-0.19634 -1.28676,0.2459 -1.71917,1.88286 -1.6877,3.21077 0.0722,3.04538 -0.67807,6.20154 0.0256,9.16734 0.92811,1.47522 2.86854,1.7465 4.36578,1.03463 0.86154,0.50078 0.39971,1.62832 0.42499,2.56683 -0.0882,7.83015 0.32596,15.67454 -1.05307,23.47772 -1.04704,5.92482 -2.30516,9.29307 -4.82127,15.71548 -0.34338,0.8765 0.84442,1.09851 1.25397,0.43186 0.73275,-0.91071 1.30857,-1.96023 1.96169,-2.93898 3.1146,-5.2306 4.73433,-11.28739 6.09232,-17.26101 1.42561,-6.51757 3.07874,-15.22446 3.17216,-21.78539 0.60692,-0.68613 1.40407,-0.0653 2.08116,-0.0109 0.61651,0.0986 1.29119,0.0989 1.86881,-0.25788 1.18679,0.96841 1.91966,1.19028 2.67533,2.57026 0.7944,0.84461 2.14786,0.21328 2.739,-0.72759 0.94569,-1.08402 2.34796,-1.66123 3.65385,-1.5998 0.90572,0.1042 1.47071,1.01938 1.55044,1.9881 0.11854,1.44022 0.22539,5.3856 0.45406,6.80506 0.59235,4.5054 0.18189,9.16882 -0.81932,13.74998 -0.95668,3.98189 -3.39889,8.97724 -4.63174,12.85156 0.46085,0.86205 1.56763,0.35945 2.0776,-0.36527 5.05294,-7.18063 7.13877,-13.47628 7.52958,-18.57529 0.31763,-4.14412 0.68862,-7.3434 0.63194,-11.03239 -0.0163,-1.053 0.26259,-2.09563 0.83461,-2.98382 0.66367,-1.03051 1.13319,-2.21851 1.19007,-3.50216 0.1336,-3.01588 0.0254,-6.04186 -0.5304,-8.9453 -0.2014,-1.05198 -0.46014,-2.39332 -1.39006,-2.81206 -1.31898,-0.59392 -2.84517,0.0163 -4.26588,0.12671 -2.16695,0.16774 -4.42582,0.12925 -6.32654,-1.03967 -0.99854,-0.61412 -2.50656,-0.2522 -3.16227,0.98 -0.28985,0.5447 -0.51089,1.13803 -0.54765,1.75507 -0.7004,0.0227 -0.56329,-0.95554 -0.8317,-1.42247 -0.66523,-1.15736 -2.10397,-1.19642 -3.29783,-0.8517 -0.78236,0.2259 -0.91395,-1.04134 -0.98923,-1.73976 -0.77991,-7.23498 -0.087,-14.63968 -1.03205,-21.85591 -0.9714,-7.4171 -2.86441,-14.40055 -6.95765,-20.27649 -0.99667,-1.43076 -3.54679,-5.56859 -3.92389,-3.70274 z"
       style="color:#000000;clip-rule:nonzero;display:inline;overflow:visible;visibility:visible;opacity:1;isolation:auto;mix-blend-mode:normal;color-interpolation:sRGB;color-interpolation-filters:linearRGB;solid-color:#000000;solid-opacity:1;fill:#ffffff;fill-opacity:1;fill-rule:evenodd;stroke:none;stroke-width:0.58092737px;stroke-linecap:butt;stroke-linejoin:miter;stroke-miterlimit:4;stroke-dasharray:none;stroke-dashoffset:0;stroke-opacity:1;marker:none;color-rendering:auto;image-rendering:auto;shape-rendering:auto;text-rendering:auto;enable-background:accumulate" />
    <path
       sodipodi:nodetypes="sssssssssss"
       inkscape:connector-curvature="0"
       id="path4241"
       d="m 165.99452,222.08015 c 2.73729,-10.10036 0.56534,-6.93115 2.31154,-13.41611 1.74621,-6.48501 4.51722,-7.71661 8.26768,-6.88032 3.75046,0.83625 5.92704,5.43491 7.95807,13.67599 2.03102,8.2411 2.09879,24.26402 -9.24533,36.85389 -8.21386,9.11584 -10.5126,0.89434 -11.57192,-6.74439 -1.43721,-10.36388 0.68529,-17.60486 2.27996,-23.48906 z m 7.92401,-3.34301 c 3.76256,0.50472 6.24331,7.87316 5.31177,13.20017 -1.77619,10.15711 -6.43811,16.46933 -9.43613,8.86531 -2.99802,-7.60403 0.46005,-22.55699 4.12436,-22.06548 z"
       style="color:#000000;clip-rule:nonzero;display:inline;overflow:visible;visibility:visible;opacity:1;isolation:auto;mix-blend-mode:normal;color-interpolation:sRGB;color-interpolation-filters:linearRGB;solid-color:#000000;solid-opacity:1;fill:#ffffff;fill-opacity:1;fill-rule:evenodd;stroke:none;stroke-width:0.58092737px;stroke-linecap:butt;stroke-linejoin:miter;stroke-miterlimit:4;stroke-dasharray:none;stroke-dashoffset:0;stroke-opacity:1;marker:none;color-rendering:auto;image-rendering:auto;shape-rendering:auto;text-rendering:auto;enable-background:accumulate" />
    <text
       xml:space="preserve"
       style="font-style:normal;font-variant:normal;font-weight:bold;font-stretch:normal;font-size:4.85649109px;line-height:125%;font-family:Tiny;-inkscape-font-specification:'Tiny Bold';letter-spacing:0px;word-spacing:0px;fill:#ffffff;fill-opacity:1;stroke:none;stroke-width:0.28018215px;stroke-linecap:butt;stroke-linejoin:miter;stroke-opacity:1"
       x="1.0690782"
       y="111.90797"
       id="text1563"><tspan
         sodipodi:role="line"
         id="tspan1561"
         x="1.0690782"
         y="111.90797"
         style="font-size:53.7949791px;fill:#ffffff;fill-opacity:1;stroke-width:0.28018215px">A-Mazing</tspan></text>
  </g>
</svg>
