encog,NEATPopulation,java,3.4.0,1,1557945748336
[NEAT-POPULATION]
[NEAT-POPULATION:CONFIG]
cycles=40
neatAct=ActivationSteepenedSigmoid
inputCount=7
outputCount=2
cycles=40
populationSize=100
survivalRate=0.7
[NEAT-POPULATION:INNOVATIONS]
"l:4:22",96,-1
"l:7:14",123,-1
"l:7:15",104,-1
"l:7:12",133,-1
"l:4:21",106,-1
"l:4:20",100,-1
"l:7:11",122,-1
"l:5:0",21,-1
"l:5:1",22,-1
"l:1:0",13,-1
"l:1:1",14,-1
"ns:4:9",72,19
"l:23:9",132,-1
"ns:0:8",53,15
"ns:0:9",59,16
"l:15:9",98,-1
"l:2:11",135,-1
"l:2:12",38,-1
"l:15:8",55,-1
"n:1",1,1
"l:9:8",30,-1
"n:3",3,3
"l:19:9",74,-1
"n:2",2,2
"l:9:9",50,-1
"l:19:8",129,-1
"n:5",5,5
"l:5:8",46,-1
"l:2:17",65,-1
"n:4",4,4
"n:7",7,7
"n:6",6,6
"l:5:9",116,-1
"n:9",9,9
"l:1:8",75,-1
"n:8",8,8
"l:2:15",109,-1
"l:1:9",31,-1
"l:21:21",139,-1
"l:11:9",34,-1
"l:2:20",99,-1
"l:5:12",92,-1
"l:2:21",118,-1
"l:5:15",114,-1
"l:2:22",121,-1
"l:5:14",48,-1
"l:15:15",126,-1
"l:4:1",20,-1
"l:4:0",19,-1
"l:0:1",12,-1
"l:0:0",11,-1
"ns:3:8",82,22
"l:22:8",84,-1
"ns:3:9",32,11
"l:22:9",87,-1
"l:8:18",68,-1
"l:18:8",69,-1
"l:14:9",49,-1
"l:8:15",107,-1
"l:8:9",29,-1
"l:5:20",97,-1
"l:8:8",27,-1
"ns:8:8",67,18
"l:8:12",62,-1
"l:5:22",94,-1
"ns:8:9",130,23
"l:5:21",138,-1
"l:4:9",63,-1
"l:12:12",124,-1
"l:4:8",58,-1
"l:0:12",52,-1
"l:0:9",70,-1
"l:0:8",137,-1
"l:0:16",60,-1
"l:0:15",54,-1
"l:3:11",33,-1
"l:3:12",40,-1
"l:0:21",110,-1
"l:0:20",103,-1
"l:8:23",131,-1
"l:8:22",105,-1
"l:3:14",56,-1
"l:3:15",88,-1
"l:3:1",18,-1
"l:7:0",25,-1
"l:3:0",17,-1
"ns:2:9",37,12
"l:21:9",81,-1
"n:10",10,10
"l:8:20",89,-1
"ns:6:8",42,13
"ns:2:8",64,17
"l:21:8",119,-1
"l:17:9",71,-1
"l:6:15",134,-1
"l:17:8",66,-1
"l:3:22",83,-1
"l:6:13",43,-1
"l:6:11",117,-1
"l:6:12",45,-1
"l:7:9",108,-1
"l:3:9",35,-1
"l:14:14",112,-1
"l:7:8",51,-1
"l:7:1",26,-1
"l:13:8",44,-1
"l:9:15",90,-1
"l:6:22",93,-1
"l:6:20",102,-1
"l:6:21",111,-1
"l:9:12",115,-1
"l:1:12",113,-1
"l:11:11",120,-1
"l:6:1",24,-1
"l:6:0",23,-1
"l:2:1",16,-1
"l:2:0",15,-1
"ns:5:9",47,14
"ns:1:8",76,20
"l:20:8",78,-1
"l:22:22",125,-1
"ns:1:9",79,21
"l:20:9",101,-1
"l:4:12",127,-1
"l:16:9",61,-1
"l:4:11",136,-1
"l:1:22",128,-1
"l:1:21",80,-1
"l:1:20",77,-1
"l:4:19",73,-1
"l:6:9",28,-1
"l:6:8",57,-1
"l:4:15",91,-1
"l:2:9",36,-1
"l:2:8",41,-1
"l:9:22",86,-1
"l:9:20",95,-1
"l:12:9",39,-1
"l:12:8",85,-1
[NEAT-POPULATION:SPECIES]
"s",12,972.5678705663,12
"g",972.5678705663,972.5678705663,3835
"n",7,"ActivationSteepenedSigmoid","b",0
"n",0,"ActivationSteepenedSigmoid","i",1
"n",1,"ActivationSteepenedSigmoid","i",2
"n",2,"ActivationSteepenedSigmoid","i",3
"n",3,"ActivationSteepenedSigmoid","i",4
"n",4,"ActivationSteepenedSigmoid","i",5
"n",5,"ActivationSteepenedSigmoid","i",6
"n",6,"ActivationSteepenedSigmoid","i",7
"n",8,"ActivationSteepenedSigmoid","o",8
"n",9,"ActivationSteepenedSigmoid","o",9
"l",-1,1,7,8,-0.0459842182,10
"l",-1,1,7,9,-0.8795018739,11
"l",-1,1,0,8,-0.2694437122,12
"l",-1,1,1,9,0.4446759496,13
"l",-1,1,1,8,0.2455300581,14
"l",-1,1,2,9,-0.2840942628,15
"l",-1,1,3,8,0.4481703372,16
"l",-1,1,2,9,0.2047541206,17
"l",-1,1,3,8,0.7017242407,18
"l",-1,1,3,9,-0.0139990548,19
"l",-1,1,4,9,0.8064640939,20
"l",-1,1,5,9,0.5869310403,21
"l",-1,1,6,9,-0.6456135242,22
"s",0,-2326.3456836494,0
"g",-2326.3456836494,-2326.3456836494,4000
"n",7,"ActivationSteepenedSigmoid","b",0
"n",0,"ActivationSteepenedSigmoid","i",1
"n",1,"ActivationSteepenedSigmoid","i",2
"n",2,"ActivationSteepenedSigmoid","i",3
"n",3,"ActivationSteepenedSigmoid","i",4
"n",4,"ActivationSteepenedSigmoid","i",5
"n",5,"ActivationSteepenedSigmoid","i",6
"n",6,"ActivationSteepenedSigmoid","i",7
"n",8,"ActivationSteepenedSigmoid","o",8
"n",9,"ActivationSteepenedSigmoid","o",9
"l",-1,1,7,8,-0.0459842182,10
"l",-1,1,7,9,-0.8795018739,11
"l",-1,1,0,8,-0.2694437122,12
"l",-1,1,1,9,0.4446759496,13
"l",-1,1,1,8,0.2455300581,14
"l",-1,1,2,9,-0.2840942628,15
"l",-1,1,3,8,0.4481703372,16
"l",-1,1,2,9,0.20055143,17
"l",-1,1,3,8,0.7055468327,18
"l",-1,1,3,9,-0.0139990548,19
"l",-1,1,4,9,0.8064640939,20
"l",-1,1,5,9,0.5919254413,21
"l",-1,1,6,9,-0.6456135242,22
"s",3999,-10083.1831434436,3944
"g",-10083.1831434436,-10083.1831434436,56
"n",7,"ActivationSteepenedSigmoid","b",0
"n",0,"ActivationSteepenedSigmoid","i",1
"n",1,"ActivationSteepenedSigmoid","i",2
"n",2,"ActivationSteepenedSigmoid","i",3
"n",3,"ActivationSteepenedSigmoid","i",4
"n",4,"ActivationSteepenedSigmoid","i",5
"n",5,"ActivationSteepenedSigmoid","i",6
"n",6,"ActivationSteepenedSigmoid","i",7
"n",8,"ActivationSteepenedSigmoid","o",8
"n",9,"ActivationSteepenedSigmoid","o",9
"l",-1,1,7,8,-0.3075077894,10
"l",-1,1,7,9,-0.8760979978,11
"l",-1,1,0,8,-0.4817488998,12
"l",-1,1,1,9,0.4701352752,13
"l",-1,1,1,8,0.4384558188,14
"l",-1,1,2,9,-0.2956490782,15
"l",-1,1,3,8,0.9,16
"l",-1,1,2,9,0.2466421604,17
"l",-1,1,3,8,0.7400927179,18
"l",-1,1,3,9,-0.8974017822,19
"l",-1,1,4,9,0.8795848256,20
"l",-1,1,5,9,0.549271923,21
"l",-1,1,6,9,-0.7775757377,22
"s",0,-12452.7050443426,0
"g",-12452.7050443426,-12452.7050443426,4000
"n",7,"ActivationSteepenedSigmoid","b",0
"n",0,"ActivationSteepenedSigmoid","i",1
"n",1,"ActivationSteepenedSigmoid","i",2
"n",2,"ActivationSteepenedSigmoid","i",3
"n",3,"ActivationSteepenedSigmoid","i",4
"n",4,"ActivationSteepenedSigmoid","i",5
"n",5,"ActivationSteepenedSigmoid","i",6
"n",6,"ActivationSteepenedSigmoid","i",7
"n",8,"ActivationSteepenedSigmoid","o",8
"n",9,"ActivationSteepenedSigmoid","o",9
"l",-1,1,7,8,-0.0093304626,10
"l",-1,1,7,9,-0.8795018739,11
"l",-1,1,0,8,-0.2694437122,12
"l",-1,1,1,9,0.4446759496,13
"l",-1,1,1,8,0.2070372365,14
"l",-1,1,2,9,0.140635944,15
"l",-1,1,3,8,0.0961526582,16
"l",-1,1,2,9,0.2147110583,17
"l",-1,1,3,8,0.709614317,18
"l",-1,1,3,9,-0.0448391581,19
"l",-1,1,4,9,0.449425245,20
"l",-1,1,5,9,0.5873261171,21
"l",-1,1,6,9,-0.6456135242,22
"s",0,-17483.2974435797,0
"g",-17483.2974435797,-17483.2974435797,4000
"n",7,"ActivationSteepenedSigmoid","b",0
"n",0,"ActivationSteepenedSigmoid","i",1
"n",1,"ActivationSteepenedSigmoid","i",2
"n",2,"ActivationSteepenedSigmoid","i",3
"n",3,"ActivationSteepenedSigmoid","i",4
"n",4,"ActivationSteepenedSigmoid","i",5
"n",5,"ActivationSteepenedSigmoid","i",6
"n",6,"ActivationSteepenedSigmoid","i",7
"n",8,"ActivationSteepenedSigmoid","o",8
"n",9,"ActivationSteepenedSigmoid","o",9
"l",-1,1,7,8,-0.0459842182,10
"l",-1,1,7,9,-0.8795018739,11
"l",-1,1,0,8,-0.2694437122,12
"l",-1,1,1,9,0.4320686383,13
"l",-1,1,1,8,0.2243146676,14
"l",-1,1,2,9,-0.2840942628,15
"l",-1,1,3,8,-0.0423519564,16
"l",-1,1,2,9,0.1981468634,17
"l",-1,1,3,8,0.6928949086,18
"l",-1,1,3,9,-0.0139990548,19
"l",-1,1,4,9,0.8223028076,20
"l",-1,1,5,9,0.5869310403,21
"l",-1,1,6,9,-0.6456135242,22
"s",0,-21603.016347202,0
"g",-21603.016347202,-21603.016347202,4000
"n",7,"ActivationSteepenedSigmoid","b",0
"n",0,"ActivationSteepenedSigmoid","i",1
"n",1,"ActivationSteepenedSigmoid","i",2
"n",2,"ActivationSteepenedSigmoid","i",3
"n",3,"ActivationSteepenedSigmoid","i",4
"n",4,"ActivationSteepenedSigmoid","i",5
"n",5,"ActivationSteepenedSigmoid","i",6
"n",6,"ActivationSteepenedSigmoid","i",7
"n",8,"ActivationSteepenedSigmoid","o",8
"n",9,"ActivationSteepenedSigmoid","o",9
"l",-1,1,7,8,-0.3075077894,10
"l",-1,1,7,9,-0.8760979978,11
"l",-1,1,0,8,-0.4817488998,12
"l",-1,1,1,9,0.4701352752,13
"l",-1,1,1,8,0.4384558188,14
"l",-1,1,2,9,-0.283330118,15
"l",-1,1,3,8,0.8943969994,16
"l",-1,1,2,9,0.2602570442,17
"l",-1,1,3,8,0.7400927179,18
"l",-1,1,3,9,-0.8974017822,19
"l",-1,1,4,9,0.8795848256,20
"l",-1,1,5,9,0.5277981912,21
"l",-1,1,6,9,-0.7775757377,22
"s",0,-23794.6377790726,0
"g",-23794.6377790726,-23794.6377790726,4000
"n",7,"ActivationSteepenedSigmoid","b",0
"n",0,"ActivationSteepenedSigmoid","i",1
"n",1,"ActivationSteepenedSigmoid","i",2
"n",2,"ActivationSteepenedSigmoid","i",3
"n",3,"ActivationSteepenedSigmoid","i",4
"n",4,"ActivationSteepenedSigmoid","i",5
"n",5,"ActivationSteepenedSigmoid","i",6
"n",6,"ActivationSteepenedSigmoid","i",7
"n",8,"ActivationSteepenedSigmoid","o",8
"n",9,"ActivationSteepenedSigmoid","o",9
"l",-1,1,7,8,-0.0701461945,10
"l",-1,1,7,9,-0.8795018739,11
"l",-1,1,0,8,-0.259780201,12
"l",-1,1,1,9,0.4446759496,13
"l",-1,1,1,8,0.2455300581,14
"l",-1,1,2,9,0.2966429243,15
"l",-1,1,3,8,0.4290569145,16
"l",-1,1,2,9,0.2195961666,17
"l",-1,1,3,8,0.7017242407,18
"l",-1,1,3,9,-0.0011902327,19
"l",-1,1,4,9,0.8064640939,20
"l",-1,1,5,9,0.2394755129,21
"l",-1,1,6,9,-0.6546801114,22
"s",0,-39363.5128493869,0
"g",-39363.5128493869,-39363.5128493869,4000
"n",7,"ActivationSteepenedSigmoid","b",0
"n",0,"ActivationSteepenedSigmoid","i",1
"n",1,"ActivationSteepenedSigmoid","i",2
"n",2,"ActivationSteepenedSigmoid","i",3
"n",3,"ActivationSteepenedSigmoid","i",4
"n",4,"ActivationSteepenedSigmoid","i",5
"n",5,"ActivationSteepenedSigmoid","i",6
"n",6,"ActivationSteepenedSigmoid","i",7
"n",8,"ActivationSteepenedSigmoid","o",8
"n",9,"ActivationSteepenedSigmoid","o",9
"l",-1,1,7,8,-0.3497012806,10
"l",-1,1,7,9,-0.8649485871,11
"l",-1,1,0,8,-0.2694437122,12
"l",-1,1,1,9,0.4446759496,13
"l",-1,1,1,8,-0.1816278799,14
"l",-1,1,2,9,-0.3026425908,15
"l",-1,1,3,8,0.4300862595,16
"l",-1,1,2,9,-0.1839374088,17
"l",-1,1,3,8,0.707881752,18
"l",-1,1,3,9,0.0031517705,19
"l",-1,1,4,9,0.9,20
"l",-1,1,5,9,0.5869310403,21
"l",-1,1,6,9,-0.6456135242,22
"s",0,-44777.3807477442,0
"g",-44777.3807477442,-44777.3807477442,4000
"n",7,"ActivationSteepenedSigmoid","b",0
"n",0,"ActivationSteepenedSigmoid","i",1
"n",1,"ActivationSteepenedSigmoid","i",2
"n",2,"ActivationSteepenedSigmoid","i",3
"n",3,"ActivationSteepenedSigmoid","i",4
"n",4,"ActivationSteepenedSigmoid","i",5
"n",5,"ActivationSteepenedSigmoid","i",6
"n",6,"ActivationSteepenedSigmoid","i",7
"n",8,"ActivationSteepenedSigmoid","o",8
"n",9,"ActivationSteepenedSigmoid","o",9
"l",-1,1,7,8,0.2801612611,10
"l",-1,1,7,9,-0.9,11
"l",-1,1,0,8,0.4934609471,12
"l",-1,1,1,9,-0.7720608604,13
"l",-1,1,1,8,-0.9,14
"l",-1,1,2,9,0.9,15
"l",-1,1,3,8,-0.8217038906,16
"l",-1,1,2,9,0.5437873693,17
"l",-1,1,3,8,0.9,18
"l",-1,1,3,9,-0.6942691257,19
"l",-1,1,4,9,-0.2797554237,20
"l",-1,1,5,9,-0.9,21
"l",-1,1,6,9,-0.8950234143,22
"s",0,-45449.314090831,0
"g",-45449.314090831,-45449.314090831,4000
"n",7,"ActivationSteepenedSigmoid","b",0
"n",0,"ActivationSteepenedSigmoid","i",1
"n",1,"ActivationSteepenedSigmoid","i",2
"n",2,"ActivationSteepenedSigmoid","i",3
"n",3,"ActivationSteepenedSigmoid","i",4
"n",4,"ActivationSteepenedSigmoid","i",5
"n",5,"ActivationSteepenedSigmoid","i",6
"n",6,"ActivationSteepenedSigmoid","i",7
"n",8,"ActivationSteepenedSigmoid","o",8
"n",9,"ActivationSteepenedSigmoid","o",9
"l",-1,1,7,8,-0.3099359427,10
"l",-1,1,7,9,-0.8760979978,11
"l",-1,1,0,8,-0.4900697378,12
"l",-1,1,1,9,0.4701352752,13
"l",-1,1,1,8,0.4384558188,14
"l",-1,1,2,9,-0.2956490782,15
"l",-1,1,3,8,0.9,16
"l",-1,1,2,9,0.2466421604,17
"l",-1,1,3,8,0.7400927179,18
"l",-1,1,3,9,-0.8974017822,19
"l",-1,1,4,9,0.8795848256,20
"l",-1,1,5,9,0.5826755176,21
"l",-1,1,6,9,-0.7775757377,22
"s",0,-45487.1921997219,0
"g",-45487.1921997219,-45487.1921997219,4000
"n",7,"ActivationSteepenedSigmoid","b",0
"n",0,"ActivationSteepenedSigmoid","i",1
"n",1,"ActivationSteepenedSigmoid","i",2
"n",2,"ActivationSteepenedSigmoid","i",3
"n",3,"ActivationSteepenedSigmoid","i",4
"n",4,"ActivationSteepenedSigmoid","i",5
"n",5,"ActivationSteepenedSigmoid","i",6
"n",6,"ActivationSteepenedSigmoid","i",7
"n",8,"ActivationSteepenedSigmoid","o",8
"n",9,"ActivationSteepenedSigmoid","o",9
"l",-1,1,7,8,-0.1034426276,10
"l",-1,1,7,9,0.3217444206,11
"l",-1,1,0,8,-0.2382965436,12
"l",-1,1,1,9,-0.5156873498,13
"l",-1,1,1,8,-0.8525949478,14
"l",-1,1,2,9,-0.3756726252,15
"l",-1,1,3,8,0.630898339,16
"l",-1,1,2,9,-0.7648973944,17
"l",-1,1,3,8,0.4557145293,18
"l",-1,1,3,9,-0.9,19
"l",-1,1,4,9,-0.5614892946,20
"l",-1,1,5,9,-0.9,21
"l",-1,1,6,9,-0.5233429176,22
"l",-1,1,6,8,0.0186860636,57
"l",-1,1,0,9,0.0307624325,70
"s",0,-47093.84017402,0
"g",-47093.84017402,-47093.84017402,4000
"n",7,"ActivationSteepenedSigmoid","b",0
"n",0,"ActivationSteepenedSigmoid","i",1
"n",1,"ActivationSteepenedSigmoid","i",2
"n",2,"ActivationSteepenedSigmoid","i",3
"n",3,"ActivationSteepenedSigmoid","i",4
"n",4,"ActivationSteepenedSigmoid","i",5
"n",5,"ActivationSteepenedSigmoid","i",6
"n",6,"ActivationSteepenedSigmoid","i",7
"n",8,"ActivationSteepenedSigmoid","o",8
"n",9,"ActivationSteepenedSigmoid","o",9
"l",-1,1,7,8,-0.9,10
"l",-1,1,7,9,-0.8817567162,11
"l",-1,1,0,8,-0.6194836204,12
"l",-1,1,1,9,0.1673761587,13
"l",-1,1,1,8,-0.7853143835,14
"l",-1,1,2,9,-0.8565002705,15
"l",-1,1,3,8,-0.5382595295,16
"l",-1,1,2,9,0.8621171932,17
"l",-1,1,3,8,-0.9,18
"l",-1,1,3,9,0.9,19
"l",-1,1,4,9,-0.8952477059,20
"l",-1,1,5,9,0.6384213052,21
"l",-1,1,6,9,-0.5344179709,22
"l",-1,1,6,8,0.6036413981,57
"s",0,-47531.7637239986,0
"g",-47531.7637239986,-47531.7637239986,4000
"n",7,"ActivationSteepenedSigmoid","b",0
"n",0,"ActivationSteepenedSigmoid","i",1
"n",1,"ActivationSteepenedSigmoid","i",2
"n",2,"ActivationSteepenedSigmoid","i",3
"n",3,"ActivationSteepenedSigmoid","i",4
"n",4,"ActivationSteepenedSigmoid","i",5
"n",5,"ActivationSteepenedSigmoid","i",6
"n",6,"ActivationSteepenedSigmoid","i",7
"n",8,"ActivationSteepenedSigmoid","o",8
"n",9,"ActivationSteepenedSigmoid","o",9
"l",-1,1,7,8,0.1605950004,10
"l",-1,1,7,9,-0.8983326585,11
"l",-1,1,0,8,-0.1636822812,12
"l",-1,1,1,8,0.9,14
"l",-1,1,2,9,0.1429652287,15
"l",-1,1,3,8,0.8565112125,16
"l",-1,1,2,9,-0.9,17
"l",-1,1,3,8,-0.1458401286,18
"l",-1,1,3,9,0.9,19
"l",-1,1,4,9,-0.2910035384,20
"l",-1,1,5,9,0.8311796469,21
"l",-1,1,6,9,-0.613557818,22
"s",0,-50277.1752537387,0
"g",-50277.1752537387,-50277.1752537387,4000
"n",7,"ActivationSteepenedSigmoid","b",0
"n",0,"ActivationSteepenedSigmoid","i",1
"n",1,"ActivationSteepenedSigmoid","i",2
"n",2,"ActivationSteepenedSigmoid","i",3
"n",3,"ActivationSteepenedSigmoid","i",4
"n",4,"ActivationSteepenedSigmoid","i",5
"n",5,"ActivationSteepenedSigmoid","i",6
"n",6,"ActivationSteepenedSigmoid","i",7
"n",8,"ActivationSteepenedSigmoid","o",8
"n",9,"ActivationSteepenedSigmoid","o",9
"l",-1,1,7,8,-0.5466024592,10
"l",-1,1,0,8,-0.8592283136,12
"l",-1,1,1,9,0.8988854775,13
"l",-1,1,1,8,-0.8983776196,14
"l",-1,1,2,9,-0.0576993067,15
"l",-1,1,3,8,-0.8942214989,16
"l",-1,1,2,9,0.5875362805,17
"l",-1,1,3,8,0.4397828118,18
"l",-1,1,3,9,-0.6275944213,19
"l",-1,1,4,9,-0.9,20
"l",-1,1,5,9,-0.488777874,21
"l",-1,1,6,9,-0.9,22
"s",0,-50718.0661806793,0
"g",-50718.0661806793,-50718.0661806793,4000
"n",7,"ActivationSteepenedSigmoid","b",0
"n",0,"ActivationSteepenedSigmoid","i",1
"n",1,"ActivationSteepenedSigmoid","i",2
"n",2,"ActivationSteepenedSigmoid","i",3
"n",3,"ActivationSteepenedSigmoid","i",4
"n",4,"ActivationSteepenedSigmoid","i",5
"n",5,"ActivationSteepenedSigmoid","i",6
"n",6,"ActivationSteepenedSigmoid","i",7
"n",8,"ActivationSteepenedSigmoid","o",8
"n",9,"ActivationSteepenedSigmoid","o",9
"l",-1,1,7,8,-0.0459842182,10
"l",-1,1,7,9,-0.5523488468,11
"l",-1,1,0,8,-0.2694437122,12
"l",-1,1,1,9,0.9,13
"l",-1,1,1,8,0.7586698616,14
"l",-1,1,2,9,-0.2575641708,15
"l",-1,1,3,8,0.3716491897,16
"l",-1,1,2,9,0.2047541206,17
"l",-1,1,3,8,0.7017242407,18
"l",-1,1,3,9,0.0255276099,19
"l",-1,1,4,9,0.9,20
"l",-1,1,5,9,0.2499295934,21
"l",-1,1,6,9,-0.9,22
"s",0,-52000.5106048803,0
"g",-52000.5106048803,-52000.5106048803,4000
"n",7,"ActivationSteepenedSigmoid","b",0
"n",0,"ActivationSteepenedSigmoid","i",1
"n",1,"ActivationSteepenedSigmoid","i",2
"n",2,"ActivationSteepenedSigmoid","i",3
"n",3,"ActivationSteepenedSigmoid","i",4
"n",4,"ActivationSteepenedSigmoid","i",5
"n",5,"ActivationSteepenedSigmoid","i",6
"n",6,"ActivationSteepenedSigmoid","i",7
"n",8,"ActivationSteepenedSigmoid","o",8
"n",9,"ActivationSteepenedSigmoid","o",9
"l",-1,1,7,8,0.9,10
"l",-1,1,7,9,-0.7660689225,11
"l",-1,1,0,8,0.8589349468,12
"l",-1,1,1,9,0.4763957685,13
"l",-1,1,1,8,0.3790947276,14
"l",-1,1,2,9,-0.8837433952,15
"l",-1,1,3,8,-0.717392365,16
"l",-1,1,2,9,-0.1104387456,17
"l",-1,1,3,8,-0.8830790091,18
"l",-1,1,3,9,-0.1320739656,19
"l",-1,1,4,9,-0.8869198403,20
"l",-1,1,5,9,-0.0790638221,21
"l",-1,1,6,9,-0.7895588728,22
"l",-1,1,5,8,0.4074874773,46
"s",0,-52646.1700803679,0
"g",-52646.1700803679,-52646.1700803679,4000
"n",7,"ActivationSteepenedSigmoid","b",0
"n",0,"ActivationSteepenedSigmoid","i",1
"n",1,"ActivationSteepenedSigmoid","i",2
"n",2,"ActivationSteepenedSigmoid","i",3
"n",3,"ActivationSteepenedSigmoid","i",4
"n",4,"ActivationSteepenedSigmoid","i",5
"n",5,"ActivationSteepenedSigmoid","i",6
"n",6,"ActivationSteepenedSigmoid","i",7
"n",8,"ActivationSteepenedSigmoid","o",8
"n",9,"ActivationSteepenedSigmoid","o",9
"l",-1,1,7,8,-0.9,10
"l",-1,1,7,9,-0.8115949895,11
"l",-1,1,0,8,-0.5807166946,12
"l",-1,1,1,9,0.2779124811,13
"l",-1,1,1,8,-0.9,14
"l",-1,1,2,9,-0.442048571,15
"l",-1,1,3,8,0.8792184406,16
"l",-1,1,2,9,0.4032288406,17
"l",-1,1,3,8,0.3873628484,18
"l",-1,1,3,9,-0.2682938903,19
"l",-1,1,4,9,-0.8968597046,20
"l",-1,1,5,9,0.9,21
"l",-1,1,6,9,-0.9,22
"l",-1,1,2,8,-0.6936795931,41
"s",0,-52773.5873650137,0
"g",-52773.5873650137,-52773.5873650137,4000
"n",7,"ActivationSteepenedSigmoid","b",0
"n",0,"ActivationSteepenedSigmoid","i",1
"n",1,"ActivationSteepenedSigmoid","i",2
"n",2,"ActivationSteepenedSigmoid","i",3
"n",3,"ActivationSteepenedSigmoid","i",4
"n",4,"ActivationSteepenedSigmoid","i",5
"n",5,"ActivationSteepenedSigmoid","i",6
"n",6,"ActivationSteepenedSigmoid","i",7
"n",8,"ActivationSteepenedSigmoid","o",8
"n",9,"ActivationSteepenedSigmoid","o",9
"l",-1,1,7,8,0.2143293688,10
"l",-1,1,7,9,-0.2037068298,11
"l",-1,1,0,8,0.9,12
"l",-1,1,1,9,0.891223836,13
"l",-1,1,1,8,-0.654433234,14
"l",-1,1,2,9,0.0239297522,15
"l",-1,1,3,8,0.9,16
"l",-1,1,2,9,0.8736266084,17
"l",-1,1,3,8,-0.9,18
"l",-1,1,3,9,-0.9,19
"l",-1,1,4,9,-0.793720522,20
"l",-1,1,5,9,-0.9,21
"l",-1,1,6,9,-0.9,22
"s",0,-53751.1066819836,0
"g",-53751.1066819836,-53751.1066819836,4000
"n",7,"ActivationSteepenedSigmoid","b",0
"n",0,"ActivationSteepenedSigmoid","i",1
"n",1,"ActivationSteepenedSigmoid","i",2
"n",2,"ActivationSteepenedSigmoid","i",3
"n",3,"ActivationSteepenedSigmoid","i",4
"n",4,"ActivationSteepenedSigmoid","i",5
"n",5,"ActivationSteepenedSigmoid","i",6
"n",6,"ActivationSteepenedSigmoid","i",7
"n",8,"ActivationSteepenedSigmoid","o",8
"n",9,"ActivationSteepenedSigmoid","o",9
"l",-1,1,7,8,-0.9,10
"l",-1,1,7,9,-0.8692426674,11
"l",-1,1,0,8,-0.4781868822,12
"l",-1,1,1,9,0.4701352752,13
"l",-1,1,1,8,0.4384558188,14
"l",-1,1,2,9,-0.1256449952,15
"l",-1,1,3,8,0.724785905,16
"l",-1,1,2,9,0.2466421604,17
"l",-1,1,3,8,0.6288196228,18
"l",-1,1,3,9,-0.9,19
"l",-1,1,4,9,0.8795848256,20
"l",-1,1,5,9,-0.9,21
"l",-1,1,6,9,-0.9,22
"s",0,-53862.4598419489,0
"g",-53862.4598419489,-53862.4598419489,4000
"n",7,"ActivationSteepenedSigmoid","b",0
"n",0,"ActivationSteepenedSigmoid","i",1
"n",1,"ActivationSteepenedSigmoid","i",2
"n",2,"ActivationSteepenedSigmoid","i",3
"n",3,"ActivationSteepenedSigmoid","i",4
"n",4,"ActivationSteepenedSigmoid","i",5
"n",5,"ActivationSteepenedSigmoid","i",6
"n",6,"ActivationSteepenedSigmoid","i",7
"n",8,"ActivationSteepenedSigmoid","o",8
"n",9,"ActivationSteepenedSigmoid","o",9
"l",-1,1,7,8,0.9,10
"l",-1,1,7,9,-0.9,11
"l",-1,1,0,8,0.3256204919,12
"l",-1,1,1,9,-0.2642423671,13
"l",-1,1,1,8,0.9,14
"l",-1,1,2,9,-0.2799750031,15
"l",-1,1,3,8,0.1471495315,16
"l",-1,1,2,9,0.3330257541,17
"l",-1,1,3,8,0.9,18
"l",-1,1,3,9,-0.0383490954,19
"l",-1,1,4,9,0.2611768178,20
"l",-1,1,5,9,0.5919418924,21
"l",-1,1,6,9,-0.8844526032,22
"s",0,-54518.7847698335,0
"g",-54518.7847698335,-54518.7847698335,4000
"n",7,"ActivationSteepenedSigmoid","b",0
"n",0,"ActivationSteepenedSigmoid","i",1
"n",1,"ActivationSteepenedSigmoid","i",2
"n",2,"ActivationSteepenedSigmoid","i",3
"n",3,"ActivationSteepenedSigmoid","i",4
"n",4,"ActivationSteepenedSigmoid","i",5
"n",5,"ActivationSteepenedSigmoid","i",6
"n",6,"ActivationSteepenedSigmoid","i",7
"n",8,"ActivationSteepenedSigmoid","o",8
"n",9,"ActivationSteepenedSigmoid","o",9
"l",-1,1,7,8,-0.276879452,10
"l",-1,1,7,9,-0.9,11
"l",-1,1,0,8,0.4027596466,12
"l",-1,1,1,9,0.9,13
"l",-1,1,1,8,0.4930702704,14
"l",-1,1,2,9,-0.2840942628,15
"l",-1,1,3,8,0.4481703372,16
"l",-1,1,2,9,-0.9,17
"l",-1,1,3,8,-0.8936228908,18
"l",-1,1,3,9,0.2340564755,19
"l",-1,1,4,9,-0.7125841418,20
"l",-1,1,5,9,0.5946867411,21
"l",-1,1,6,9,-0.6456135242,22
"s",0,-54814.4001769867,0
"g",-54814.4001769867,-54814.4001769867,4000
"n",7,"ActivationSteepenedSigmoid","b",0
"n",0,"ActivationSteepenedSigmoid","i",1
"n",1,"ActivationSteepenedSigmoid","i",2
"n",2,"ActivationSteepenedSigmoid","i",3
"n",3,"ActivationSteepenedSigmoid","i",4
"n",4,"ActivationSteepenedSigmoid","i",5
"n",5,"ActivationSteepenedSigmoid","i",6
"n",6,"ActivationSteepenedSigmoid","i",7
"n",8,"ActivationSteepenedSigmoid","o",8
"n",9,"ActivationSteepenedSigmoid","o",9
"l",-1,1,7,8,-0.5241810262,10
"l",-1,1,7,9,-0.0978394895,11
"l",-1,1,0,8,0.680797853,12
"l",-1,1,1,9,-0.0518565609,13
"l",-1,1,1,8,0.1234448773,14
"l",-1,1,2,9,0.2712307678,15
"l",-1,1,3,8,0.860655576,16
"l",-1,1,2,9,0.6061285966,17
"l",-1,1,3,8,0.5196908544,18
"l",-1,1,3,9,-0.6544449163,19
"l",-1,1,4,9,-0.855750531,20
"l",-1,1,5,9,-0.8135730234,21
"l",-1,1,6,9,-0.7265263504,22
"l",-1,1,2,8,0.7944209793,41
"l",-1,1,9,9,-0.6691471168,50
"l",-1,1,6,8,0.1891668877,57
"s",0,-54928.9626348743,0
"g",-54928.9626348743,-54928.9626348743,4000
"n",7,"ActivationSteepenedSigmoid","b",0
"n",0,"ActivationSteepenedSigmoid","i",1
"n",1,"ActivationSteepenedSigmoid","i",2
"n",2,"ActivationSteepenedSigmoid","i",3
"n",3,"ActivationSteepenedSigmoid","i",4
"n",4,"ActivationSteepenedSigmoid","i",5
"n",5,"ActivationSteepenedSigmoid","i",6
"n",6,"ActivationSteepenedSigmoid","i",7
"n",8,"ActivationSteepenedSigmoid","o",8
"n",9,"ActivationSteepenedSigmoid","o",9
"l",-1,1,7,8,0.2221936431,10
"l",-1,1,7,9,-0.8906177824,11
"l",-1,1,0,8,0.7811882495,12
"l",-1,1,1,9,0.8937362443,13
"l",-1,1,1,8,0.3574477192,14
"l",-1,1,2,9,-0.9,15
"l",-1,1,3,8,-0.4408968477,16
"l",-1,1,2,9,0.5387440385,17
"l",-1,1,3,8,0.5921263952,18
"l",-1,1,3,9,-0.5919845405,19
"l",-1,1,4,9,0.001985019,20
"l",-1,1,5,9,-0.7903859066,21
"l",-1,1,6,9,-0.8383835584,22
"l",-1,1,4,8,-0.2769227196,58
"s",0,-56033.7111659817,0
"g",-56033.7111659817,-56033.7111659817,4000
"n",7,"ActivationSteepenedSigmoid","b",0
"n",0,"ActivationSteepenedSigmoid","i",1
"n",1,"ActivationSteepenedSigmoid","i",2
"n",2,"ActivationSteepenedSigmoid","i",3
"n",3,"ActivationSteepenedSigmoid","i",4
"n",4,"ActivationSteepenedSigmoid","i",5
"n",5,"ActivationSteepenedSigmoid","i",6
"n",6,"ActivationSteepenedSigmoid","i",7
"n",8,"ActivationSteepenedSigmoid","o",8
"n",9,"ActivationSteepenedSigmoid","o",9
"l",-1,1,7,8,-0.835309552,10
"l",-1,1,7,9,-0.9,11
"l",-1,1,0,8,-0.4817488998,12
"l",-1,1,1,9,0.4701352752,13
"l",-1,1,1,8,0.9,14
"l",-1,1,2,9,-0.2956490782,15
"l",-1,1,3,8,0.9,16
"l",-1,1,2,9,0.2466421604,17
"l",-1,1,3,8,0.9,18
"l",-1,1,3,9,-0.8726114684,19
"l",-1,1,4,9,0.8795848256,20
"l",-1,1,5,9,0.9,21
"l",-1,1,6,9,-0.7986652042,22
"s",0,-57988.2707356952,0
"g",-57988.2707356952,-57988.2707356952,4000
"n",7,"ActivationSteepenedSigmoid","b",0
"n",0,"ActivationSteepenedSigmoid","i",1
"n",1,"ActivationSteepenedSigmoid","i",2
"n",2,"ActivationSteepenedSigmoid","i",3
"n",3,"ActivationSteepenedSigmoid","i",4
"n",4,"ActivationSteepenedSigmoid","i",5
"n",5,"ActivationSteepenedSigmoid","i",6
"n",6,"ActivationSteepenedSigmoid","i",7
"n",8,"ActivationSteepenedSigmoid","o",8
"n",9,"ActivationSteepenedSigmoid","o",9
"l",-1,1,7,8,-0.9,10
"l",-1,1,7,9,-0.9,11
"l",-1,1,0,8,0.1140506117,12
"l",-1,1,1,9,0.9,13
"l",-1,1,1,8,-0.4596237509,14
"l",-1,1,2,9,-0.2840942628,15
"l",-1,1,3,8,-0.0253726045,16
"l",-1,1,2,9,-0.7705274984,17
"l",-1,1,3,8,-0.7025845156,18
"l",-1,1,3,9,-0.0139990548,19
"l",-1,1,4,9,-0.8392775696,20
"l",-1,1,5,9,0.9,21
"l",-1,1,6,9,-0.5048760204,22
"s",0,-58238.4897584356,0
"g",-58238.4897584356,-58238.4897584356,4000
"n",7,"ActivationSteepenedSigmoid","b",0
"n",0,"ActivationSteepenedSigmoid","i",1
"n",1,"ActivationSteepenedSigmoid","i",2
"n",2,"ActivationSteepenedSigmoid","i",3
"n",3,"ActivationSteepenedSigmoid","i",4
"n",4,"ActivationSteepenedSigmoid","i",5
"n",5,"ActivationSteepenedSigmoid","i",6
"n",6,"ActivationSteepenedSigmoid","i",7
"n",8,"ActivationSteepenedSigmoid","o",8
"n",9,"ActivationSteepenedSigmoid","o",9
"l",-1,1,7,8,0.244537165,10
"l",-1,1,7,9,0.8848731209,11
"l",-1,1,0,8,-0.0266119997,12
"l",-1,1,1,9,0.4056573077,13
"l",-1,1,1,8,0.4468530555,14
"l",-1,1,2,9,0.103598764,15
"l",-1,1,3,8,0.9,16
"l",-1,1,2,9,-0.0801822197,17
"l",-1,1,3,8,0.3517930347,18
"l",-1,1,3,9,-0.5754897678,19
"l",-1,1,4,9,-0.9,20
"l",-1,1,5,9,-0.9,21
"l",-1,1,6,9,0.4304936563,22
"s",0,-58568.8064983517,0
"g",-58568.8064983517,-58568.8064983517,4000
"n",7,"ActivationSteepenedSigmoid","b",0
"n",0,"ActivationSteepenedSigmoid","i",1
"n",1,"ActivationSteepenedSigmoid","i",2
"n",2,"ActivationSteepenedSigmoid","i",3
"n",3,"ActivationSteepenedSigmoid","i",4
"n",4,"ActivationSteepenedSigmoid","i",5
"n",5,"ActivationSteepenedSigmoid","i",6
"n",6,"ActivationSteepenedSigmoid","i",7
"n",8,"ActivationSteepenedSigmoid","o",8
"n",9,"ActivationSteepenedSigmoid","o",9
"l",-1,1,7,8,-0.0459842182,10
"l",-1,1,7,9,-0.8795018739,11
"l",-1,1,0,8,-0.2498591707,12
"l",-1,1,1,9,0.9,13
"l",-1,1,1,8,-0.0796717906,14
"l",-1,1,2,9,-0.2840942628,15
"l",-1,1,3,8,0.5283016856,16
"l",-1,1,2,9,0.562085102,17
"l",-1,1,3,8,0.7017242407,18
"l",-1,1,3,9,-0.9,19
"l",-1,1,4,9,-0.9,20
"l",-1,1,5,9,0.9,21
"l",-1,1,6,9,-0.6456135242,22
"s",0,-59950.1138876495,0
"g",-59950.1138876495,-59950.1138876495,4000
"n",7,"ActivationSteepenedSigmoid","b",0
"n",0,"ActivationSteepenedSigmoid","i",1
"n",1,"ActivationSteepenedSigmoid","i",2
"n",2,"ActivationSteepenedSigmoid","i",3
"n",3,"ActivationSteepenedSigmoid","i",4
"n",4,"ActivationSteepenedSigmoid","i",5
"n",5,"ActivationSteepenedSigmoid","i",6
"n",6,"ActivationSteepenedSigmoid","i",7
"n",8,"ActivationSteepenedSigmoid","o",8
"n",9,"ActivationSteepenedSigmoid","o",9
"l",-1,1,7,8,0.5593177318,10
"l",-1,1,7,9,0.8410771673,11
"l",-1,1,0,8,0.0664078627,12
"l",-1,1,1,9,-0.9,13
"l",-1,1,1,8,0.7822470855,14
"l",-1,1,2,9,0.9,15
"l",-1,1,3,8,0.1796520866,16
"l",-1,1,2,9,-0.384255899,17
"l",-1,1,3,8,0.9,18
"l",-1,1,3,9,0.4285608569,19
"l",-1,1,4,9,0.6090268691,20
"l",-1,1,5,9,-0.6127977576,21
"l",-1,1,6,9,-0.9,22
"l",-1,1,8,9,-0.653708589,29
"l",-1,1,2,8,-0.0127612461,41
"s",0,-60577.8336854626,0
"g",-60577.8336854626,-60577.8336854626,4000
"n",7,"ActivationSteepenedSigmoid","b",0
"n",0,"ActivationSteepenedSigmoid","i",1
"n",1,"ActivationSteepenedSigmoid","i",2
"n",2,"ActivationSteepenedSigmoid","i",3
"n",3,"ActivationSteepenedSigmoid","i",4
"n",4,"ActivationSteepenedSigmoid","i",5
"n",5,"ActivationSteepenedSigmoid","i",6
"n",6,"ActivationSteepenedSigmoid","i",7
"n",8,"ActivationSteepenedSigmoid","o",8
"n",9,"ActivationSteepenedSigmoid","o",9
"l",-1,1,7,8,0.9,10
"l",-1,1,7,9,-0.9,11
"l",-1,1,0,8,-0.7590993945,12
"l",-1,1,1,9,-0.0413209413,13
"l",-1,1,1,8,0.2633226073,14
"l",-1,1,2,9,-0.744310077,15
"l",-1,1,3,8,0.4257018501,16
"l",-1,1,2,9,0.2047541206,17
"l",-1,1,3,8,0.6749560606,18
"l",-1,1,3,9,0.8511271172,19
"l",-1,1,4,9,0.8578071827,20
"l",-1,1,5,9,0.8919805078,21
"l",-1,1,6,9,-0.8698203305,22
"l",-1,1,0,9,0.5606899689,70
"s",0,-61177.2916688471,0
"g",-61177.2916688471,-61177.2916688471,4000
"n",7,"ActivationSteepenedSigmoid","b",0
"n",0,"ActivationSteepenedSigmoid","i",1
"n",1,"ActivationSteepenedSigmoid","i",2
"n",2,"ActivationSteepenedSigmoid","i",3
"n",3,"ActivationSteepenedSigmoid","i",4
"n",4,"ActivationSteepenedSigmoid","i",5
"n",5,"ActivationSteepenedSigmoid","i",6
"n",6,"ActivationSteepenedSigmoid","i",7
"n",8,"ActivationSteepenedSigmoid","o",8
"n",9,"ActivationSteepenedSigmoid","o",9
"l",-1,1,7,8,-0.9,10
"l",-1,1,7,9,-0.7162681855,11
"l",-1,1,0,8,0.207077958,12
"l",-1,1,1,9,0.9,13
"l",-1,1,1,8,0.8199643202,14
"l",-1,1,2,9,0.7357718671,15
"l",-1,1,3,8,-0.7855432077,16
"l",-1,1,2,9,-0.4861847744,17
"l",-1,1,3,8,-0.8955811878,18
"l",-1,1,3,9,-0.9,19
"l",-1,1,4,9,-0.9,20
"l",-1,1,5,9,0.7873964499,21
"l",-1,1,6,9,-0.9,22
"l",-1,1,2,8,0.9,41
"s",0,-61439.6424300963,0
"g",-61439.6424300963,-61439.6424300963,4000
"n",7,"ActivationSteepenedSigmoid","b",0
"n",0,"ActivationSteepenedSigmoid","i",1
"n",1,"ActivationSteepenedSigmoid","i",2
"n",2,"ActivationSteepenedSigmoid","i",3
"n",3,"ActivationSteepenedSigmoid","i",4
"n",4,"ActivationSteepenedSigmoid","i",5
"n",5,"ActivationSteepenedSigmoid","i",6
"n",6,"ActivationSteepenedSigmoid","i",7
"n",8,"ActivationSteepenedSigmoid","o",8
"n",9,"ActivationSteepenedSigmoid","o",9
"l",-1,1,7,8,0.9,10
"l",-1,1,7,9,-0.0686118082,11
"l",-1,1,0,8,-0.5100010707,12
"l",-1,1,1,9,-0.1264531472,13
"l",-1,1,1,8,-0.0288388224,14
"l",-1,1,2,9,-0.2210468306,15
"l",-1,1,3,8,0.8903451657,16
"l",-1,1,2,9,-0.5291696954,17
"l",-1,1,3,8,0.7109899699,18
"l",-1,1,3,9,-0.9,19
"l",-1,1,4,9,0.9,20
"l",-1,1,5,9,0.9,21
"l",-1,1,6,9,-0.9,22
"s",0,-61819.6510440476,0
"g",-61819.6510440476,-61819.6510440476,4000
"n",7,"ActivationSteepenedSigmoid","b",0
"n",0,"ActivationSteepenedSigmoid","i",1
"n",1,"ActivationSteepenedSigmoid","i",2
"n",2,"ActivationSteepenedSigmoid","i",3
"n",3,"ActivationSteepenedSigmoid","i",4
"n",4,"ActivationSteepenedSigmoid","i",5
"n",5,"ActivationSteepenedSigmoid","i",6
"n",6,"ActivationSteepenedSigmoid","i",7
"n",8,"ActivationSteepenedSigmoid","o",8
"n",9,"ActivationSteepenedSigmoid","o",9
"l",-1,1,7,8,0.9,10
"l",-1,1,7,9,-0.9,11
"l",-1,1,0,8,-0.9,12
"l",-1,1,1,9,0.2492595069,13
"l",-1,1,1,8,-0.9,14
"l",-1,1,2,9,0.0248074018,15
"l",-1,1,3,8,-0.9,16
"l",-1,1,2,9,-0.7298976883,17
"l",-1,1,3,8,0.8609444896,18
"l",-1,1,3,9,-0.8113646444,19
"l",-1,1,4,9,-0.6099701576,20
"l",-1,1,5,9,-0.0689224129,21
"l",-1,1,6,9,0.038122551,22
"l",-1,1,8,9,0.4664605165,29
"l",-1,1,9,9,0.8882018223,50
"s",0,-62621.1590135248,0
"g",-62621.1590135248,-62621.1590135248,4000
"n",7,"ActivationSteepenedSigmoid","b",0
"n",0,"ActivationSteepenedSigmoid","i",1
"n",1,"ActivationSteepenedSigmoid","i",2
"n",2,"ActivationSteepenedSigmoid","i",3
"n",3,"ActivationSteepenedSigmoid","i",4
"n",4,"ActivationSteepenedSigmoid","i",5
"n",5,"ActivationSteepenedSigmoid","i",6
"n",6,"ActivationSteepenedSigmoid","i",7
"n",8,"ActivationSteepenedSigmoid","o",8
"n",9,"ActivationSteepenedSigmoid","o",9
"l",-1,1,7,8,0.0401607298,10
"l",-1,1,7,9,-0.8760979978,11
"l",-1,1,0,8,-0.4914884676,12
"l",-1,1,1,9,0.0333354611,13
"l",-1,1,1,8,-0.3518885315,14
"l",-1,1,2,9,-0.255270636,15
"l",-1,1,3,8,0.0360902142,16
"l",-1,1,2,9,0.2466421604,17
"l",-1,1,3,8,0.7182286763,18
"l",-1,1,3,9,-0.840978283,19
"l",-1,1,4,9,0.6144089198,20
"l",-1,1,5,9,-0.9,21
"l",-1,1,6,9,-0.3898839208,22
"s",0,-62929.4660882318,0
"g",-62929.4660882318,-62929.4660882318,4000
"n",7,"ActivationSteepenedSigmoid","b",0
"n",0,"ActivationSteepenedSigmoid","i",1
"n",1,"ActivationSteepenedSigmoid","i",2
"n",2,"ActivationSteepenedSigmoid","i",3
"n",3,"ActivationSteepenedSigmoid","i",4
"n",4,"ActivationSteepenedSigmoid","i",5
"n",5,"ActivationSteepenedSigmoid","i",6
"n",6,"ActivationSteepenedSigmoid","i",7
"n",8,"ActivationSteepenedSigmoid","o",8
"n",9,"ActivationSteepenedSigmoid","o",9
"l",-1,1,7,8,0.4671091394,10
"l",-1,1,7,9,-0.9,11
"l",-1,1,0,8,-0.5207536567,12
"l",-1,1,1,9,-0.2370649262,13
"l",-1,1,1,8,0.3816499668,14
"l",-1,1,2,9,-0.5447223515,15
"l",-1,1,3,8,-0.8932264953,16
"l",-1,1,2,9,-0.5816069526,17
"l",-1,1,3,8,0.4683914315,18
"l",-1,1,3,9,0.2085237857,19
"l",-1,1,4,9,0.2809747104,20
"l",-1,1,5,9,0.8634807551,21
"l",-1,1,6,9,-0.9,22
"l",-1,1,8,8,-0.5747059294,27
"l",-1,1,0,9,-0.4077882735,70
"s",0,-66487.8174246363,0
"g",-66487.8174246363,-66487.8174246363,4000
"n",7,"ActivationSteepenedSigmoid","b",0
"n",0,"ActivationSteepenedSigmoid","i",1
"n",1,"ActivationSteepenedSigmoid","i",2
"n",2,"ActivationSteepenedSigmoid","i",3
"n",3,"ActivationSteepenedSigmoid","i",4
"n",4,"ActivationSteepenedSigmoid","i",5
"n",5,"ActivationSteepenedSigmoid","i",6
"n",6,"ActivationSteepenedSigmoid","i",7
"n",8,"ActivationSteepenedSigmoid","o",8
"n",9,"ActivationSteepenedSigmoid","o",9
"l",-1,1,7,8,-0.9,10
"l",-1,1,7,9,-0.3610166448,11
"l",-1,1,0,8,0.8251164749,12
"l",-1,1,1,9,0.4314563371,13
"l",-1,1,1,8,0.8759193844,14
"l",-1,1,2,9,-0.9,15
"l",-1,1,3,8,-0.4241707576,16
"l",-1,1,2,9,-0.0797694798,17
"l",-1,1,3,8,0.9,18
"l",-1,1,3,9,0.9,19
"l",-1,1,4,9,-0.9,20
"l",-1,1,5,9,-0.3472899669,21
"l",-1,1,6,9,0.7262459706,22
"l",-1,1,9,8,-0.8115565637,30
"s",0,-67561.6921183846,0
"g",-67561.6921183846,-67561.6921183846,4000
"n",7,"ActivationSteepenedSigmoid","b",0
"n",0,"ActivationSteepenedSigmoid","i",1
"n",1,"ActivationSteepenedSigmoid","i",2
"n",2,"ActivationSteepenedSigmoid","i",3
"n",3,"ActivationSteepenedSigmoid","i",4
"n",4,"ActivationSteepenedSigmoid","i",5
"n",5,"ActivationSteepenedSigmoid","i",6
"n",6,"ActivationSteepenedSigmoid","i",7
"n",8,"ActivationSteepenedSigmoid","o",8
"n",9,"ActivationSteepenedSigmoid","o",9
"l",-1,1,7,8,0.038303393,10
"l",-1,1,7,9,-0.8643737579,11
"l",-1,1,0,8,-0.9,12
"l",-1,1,1,9,0.8846087453,13
"l",-1,1,1,8,-0.5264799226,14
"l",-1,1,2,9,0.9,15
"l",-1,1,3,8,0.7300802794,16
"l",-1,1,2,9,0.1806481297,17
"l",-1,1,3,8,-0.3260101663,18
"l",-1,1,3,9,-0.8951120429,19
"l",-1,1,4,9,0.1718829609,20
"l",-1,1,5,9,0.310873051,21
"l",-1,1,6,9,-0.578871556,22
"s",0,-68831.3269848592,0
"g",-68831.3269848592,-68831.3269848592,4000
"n",7,"ActivationSteepenedSigmoid","b",0
"n",0,"ActivationSteepenedSigmoid","i",1
"n",1,"ActivationSteepenedSigmoid","i",2
"n",2,"ActivationSteepenedSigmoid","i",3
"n",3,"ActivationSteepenedSigmoid","i",4
"n",4,"ActivationSteepenedSigmoid","i",5
"n",5,"ActivationSteepenedSigmoid","i",6
"n",6,"ActivationSteepenedSigmoid","i",7
"n",8,"ActivationSteepenedSigmoid","o",8
"n",9,"ActivationSteepenedSigmoid","o",9
"l",-1,1,7,8,-0.6255937457,10
"l",-1,1,7,9,-0.8795018739,11
"l",-1,1,0,8,-0.2609155424,12
"l",-1,1,1,9,0.4526651029,13
"l",-1,1,1,8,0.8721710001,14
"l",-1,1,2,9,-0.816785097,15
"l",-1,1,3,8,0.4481703372,16
"l",-1,1,2,9,0.2529091457,17
"l",-1,1,3,8,-0.1634186926,18
"l",-1,1,3,9,-0.0235260083,19
"l",-1,1,4,9,0.8055250667,20
"l",-1,1,5,9,0.5814410967,21
"l",-1,1,6,9,-0.8554382724,22
"l",-1,1,8,8,-0.2230254103,27
"s",0,-69031.4367837655,0
"g",-69031.4367837655,-69031.4367837655,4000
"n",7,"ActivationSteepenedSigmoid","b",0
"n",0,"ActivationSteepenedSigmoid","i",1
"n",1,"ActivationSteepenedSigmoid","i",2
"n",2,"ActivationSteepenedSigmoid","i",3
"n",3,"ActivationSteepenedSigmoid","i",4
"n",4,"ActivationSteepenedSigmoid","i",5
"n",5,"ActivationSteepenedSigmoid","i",6
"n",6,"ActivationSteepenedSigmoid","i",7
"n",8,"ActivationSteepenedSigmoid","o",8
"n",9,"ActivationSteepenedSigmoid","o",9
"l",-1,1,7,8,-0.2277793851,10
"l",-1,1,7,9,-0.8366949814,11
"l",-1,1,0,8,-0.9,12
"l",-1,1,1,9,-0.9,13
"l",-1,1,1,8,-0.7580182007,14
"l",-1,1,2,9,0.8251960695,15
"l",-1,1,3,8,0.1467504488,16
"l",-1,1,2,9,-0.0729568709,17
"l",-1,1,3,8,0.9,18
"l",-1,1,3,9,-0.9,19
"l",-1,1,4,9,-0.0355571896,20
"l",-1,1,5,9,0.9,21
"l",-1,1,6,9,0.2457480324,22
"s",0,-69093.4142629514,0
"g",-69093.4142629514,-69093.4142629514,4000
"n",7,"ActivationSteepenedSigmoid","b",0
"n",0,"ActivationSteepenedSigmoid","i",1
"n",1,"ActivationSteepenedSigmoid","i",2
"n",2,"ActivationSteepenedSigmoid","i",3
"n",3,"ActivationSteepenedSigmoid","i",4
"n",4,"ActivationSteepenedSigmoid","i",5
"n",5,"ActivationSteepenedSigmoid","i",6
"n",6,"ActivationSteepenedSigmoid","i",7
"n",8,"ActivationSteepenedSigmoid","o",8
"n",9,"ActivationSteepenedSigmoid","o",9
"l",-1,1,7,8,0.8239841881,10
"l",-1,1,7,9,-0.9,11
"l",-1,1,0,8,0.221682075,12
"l",-1,1,1,9,0.4802338801,13
"l",-1,1,1,8,-0.0125905895,14
"l",-1,1,2,9,0.2551578577,15
"l",-1,1,3,8,0.6524343322,16
"l",-1,1,2,9,0.2333354315,17
"l",-1,1,3,8,0.7017242407,18
"l",-1,1,3,9,0.8821693042,19
"l",-1,1,4,9,0.9,20
"l",-1,1,5,9,0.3426603878,21
"l",-1,1,6,9,0.2400354287,22
"s",0,-72234.2906589182,0
"g",-72234.2906589182,-72234.2906589182,4000
"n",7,"ActivationSteepenedSigmoid","b",0
"n",0,"ActivationSteepenedSigmoid","i",1
"n",1,"ActivationSteepenedSigmoid","i",2
"n",2,"ActivationSteepenedSigmoid","i",3
"n",3,"ActivationSteepenedSigmoid","i",4
"n",4,"ActivationSteepenedSigmoid","i",5
"n",5,"ActivationSteepenedSigmoid","i",6
"n",6,"ActivationSteepenedSigmoid","i",7
"n",8,"ActivationSteepenedSigmoid","o",8
"n",9,"ActivationSteepenedSigmoid","o",9
"l",-1,1,7,8,-0.0459842182,10
"l",-1,1,7,9,-0.9,11
"l",-1,1,0,8,0.4020620774,12
"l",-1,1,1,9,-0.0847864725,13
"l",-1,1,1,8,0.2535159966,14
"l",-1,1,2,9,-0.0410764164,15
"l",-1,1,3,8,0.0575499813,16
"l",-1,1,2,9,-0.7535067102,17
"l",-1,1,3,8,0.9,18
"l",-1,1,3,9,0.2877910769,19
"l",-1,1,4,9,0.9,20
"l",-1,1,5,9,0.3847714719,21
"l",-1,1,6,9,-0.8690215556,22
"s",0,-72670.0305420888,0
"g",-72670.0305420888,-72670.0305420888,4000
"n",7,"ActivationSteepenedSigmoid","b",0
"n",0,"ActivationSteepenedSigmoid","i",1
"n",1,"ActivationSteepenedSigmoid","i",2
"n",2,"ActivationSteepenedSigmoid","i",3
"n",3,"ActivationSteepenedSigmoid","i",4
"n",4,"ActivationSteepenedSigmoid","i",5
"n",5,"ActivationSteepenedSigmoid","i",6
"n",6,"ActivationSteepenedSigmoid","i",7
"n",8,"ActivationSteepenedSigmoid","o",8
"n",9,"ActivationSteepenedSigmoid","o",9
"l",-1,1,7,8,-0.0459842182,10
"l",-1,1,7,9,0.9,11
"l",-1,1,0,8,-0.0258028673,12
"l",-1,1,1,9,0.547334567,13
"l",-1,1,1,8,-0.9,14
"l",-1,1,2,9,-0.9,15
"l",-1,1,3,8,0.9,16
"l",-1,1,2,9,-0.6286550311,17
"l",-1,1,3,8,0.7161954022,18
"l",-1,1,3,9,-0.0683662488,19
"l",-1,1,4,9,-0.5026878648,20
"l",-1,1,5,9,0.8515194207,21
"l",-1,1,6,9,0.1108545111,22
"s",0,-74349.8166216653,0
"g",-74349.8166216653,-74349.8166216653,4000
"n",7,"ActivationSteepenedSigmoid","b",0
"n",0,"ActivationSteepenedSigmoid","i",1
"n",1,"ActivationSteepenedSigmoid","i",2
"n",2,"ActivationSteepenedSigmoid","i",3
"n",3,"ActivationSteepenedSigmoid","i",4
"n",4,"ActivationSteepenedSigmoid","i",5
"n",5,"ActivationSteepenedSigmoid","i",6
"n",6,"ActivationSteepenedSigmoid","i",7
"n",8,"ActivationSteepenedSigmoid","o",8
"n",9,"ActivationSteepenedSigmoid","o",9
"l",-1,1,7,8,0.9,10
"l",-1,1,7,9,-0.5916506747,11
"l",-1,1,0,8,0.2997875911,12
"l",-1,1,1,9,-0.5844930216,13
"l",-1,1,1,8,0.9,14
"l",-1,1,2,9,-0.9,15
"l",-1,1,3,8,0.9,16
"l",-1,1,2,9,0.9,17
"l",-1,1,3,8,0.0666392611,18
"l",-1,1,3,9,0.1918726998,19
"l",-1,1,4,9,0.9,20
"l",-1,1,5,9,-0.7056360806,21
"l",-1,1,6,9,0.9,22
"s",0,-74464.9097074337,0
"g",-74464.9097074337,-74464.9097074337,4000
"n",7,"ActivationSteepenedSigmoid","b",0
"n",0,"ActivationSteepenedSigmoid","i",1
"n",1,"ActivationSteepenedSigmoid","i",2
"n",2,"ActivationSteepenedSigmoid","i",3
"n",3,"ActivationSteepenedSigmoid","i",4
"n",4,"ActivationSteepenedSigmoid","i",5
"n",5,"ActivationSteepenedSigmoid","i",6
"n",6,"ActivationSteepenedSigmoid","i",7
"n",8,"ActivationSteepenedSigmoid","o",8
"n",9,"ActivationSteepenedSigmoid","o",9
"l",-1,1,7,8,0.9,10
"l",-1,1,7,9,-0.9,11
"l",-1,1,0,8,0.9,12
"l",-1,1,1,9,-0.0666874899,13
"l",-1,1,1,8,0.9,14
"l",-1,1,2,9,-0.2437732859,15
"l",-1,1,3,8,-0.9,16
"l",-1,1,2,9,-0.6110381416,17
"l",-1,1,3,8,0.5056886617,18
"l",-1,1,3,9,-0.9,19
"l",-1,1,4,9,0.8323452819,20
"l",-1,1,5,9,0.059021032,21
"l",-1,1,6,9,0.1674145267,22
"s",0,-75816.3650851643,0
"g",-75816.3650851643,-75816.3650851643,4000
"n",7,"ActivationSteepenedSigmoid","b",0
"n",0,"ActivationSteepenedSigmoid","i",1
"n",1,"ActivationSteepenedSigmoid","i",2
"n",2,"ActivationSteepenedSigmoid","i",3
"n",3,"ActivationSteepenedSigmoid","i",4
"n",4,"ActivationSteepenedSigmoid","i",5
"n",5,"ActivationSteepenedSigmoid","i",6
"n",6,"ActivationSteepenedSigmoid","i",7
"n",8,"ActivationSteepenedSigmoid","o",8
"n",9,"ActivationSteepenedSigmoid","o",9
"l",-1,1,7,8,0.1650729018,10
"l",-1,1,7,9,0.9,11
"l",-1,1,0,8,0.7435726165,12
"l",-1,1,1,9,0.0426495828,13
"l",-1,1,1,8,-0.0858291278,14
"l",-1,1,2,9,0.9,15
"l",-1,1,3,8,0.7159185038,16
"l",-1,1,2,9,-0.9,17
"l",-1,1,3,8,0.7881342666,18
"l",-1,1,3,9,-0.8550598108,19
"l",-1,1,4,9,-0.9,20
"l",-1,1,5,9,0.3453805678,21
"l",-1,1,6,9,-0.1259919383,22
"s",0,-76310.395813913,0
"g",-76310.395813913,-76310.395813913,4000
"n",7,"ActivationSteepenedSigmoid","b",0
"n",0,"ActivationSteepenedSigmoid","i",1
"n",1,"ActivationSteepenedSigmoid","i",2
"n",2,"ActivationSteepenedSigmoid","i",3
"n",3,"ActivationSteepenedSigmoid","i",4
"n",4,"ActivationSteepenedSigmoid","i",5
"n",5,"ActivationSteepenedSigmoid","i",6
"n",6,"ActivationSteepenedSigmoid","i",7
"n",8,"ActivationSteepenedSigmoid","o",8
"n",9,"ActivationSteepenedSigmoid","o",9
"l",-1,1,7,8,0.4827476513,10
"l",-1,1,7,9,-0.9,11
"l",-1,1,0,8,-0.2496794662,12
"l",-1,1,1,9,0.9,13
"l",-1,1,1,8,-0.9,14
"l",-1,1,2,9,-0.1288363792,15
"l",-1,1,3,8,0.9,16
"l",-1,1,2,9,0.6494489604,17
"l",-1,1,3,8,-0.5474470983,18
"l",-1,1,3,9,-0.494162514,19
"l",-1,1,4,9,0.9,20
"l",-1,1,5,9,-0.8922544521,21
"l",-1,1,6,9,-0.9,22
"s",0,-77768.1441801552,0
"g",-77768.1441801552,-77768.1441801552,4000
"n",7,"ActivationSteepenedSigmoid","b",0
"n",0,"ActivationSteepenedSigmoid","i",1
"n",1,"ActivationSteepenedSigmoid","i",2
"n",2,"ActivationSteepenedSigmoid","i",3
"n",3,"ActivationSteepenedSigmoid","i",4
"n",4,"ActivationSteepenedSigmoid","i",5
"n",5,"ActivationSteepenedSigmoid","i",6
"n",6,"ActivationSteepenedSigmoid","i",7
"n",8,"ActivationSteepenedSigmoid","o",8
"n",9,"ActivationSteepenedSigmoid","o",9
"l",-1,1,7,8,-0.0459842182,10
"l",-1,1,7,9,-0.8795018739,11
"l",-1,1,0,8,-0.6555686829,12
"l",-1,1,1,9,0.4446759496,13
"l",-1,1,1,8,0.2455300581,14
"l",-1,1,2,9,-0.2971771335,15
"l",-1,1,3,8,0.4481703372,16
"l",-1,1,2,9,0.2047541206,17
"l",-1,1,3,8,0.7017242407,18
"l",-1,1,3,9,0.9,19
"l",-1,1,4,9,0.8064640939,20
"l",-1,1,5,9,0.5698038884,21
"l",-1,1,6,9,-0.6456135242,22
"s",0,-78253.5999479517,0
"g",-78253.5999479517,-78253.5999479517,4000
"n",7,"ActivationSteepenedSigmoid","b",0
"n",0,"ActivationSteepenedSigmoid","i",1
"n",1,"ActivationSteepenedSigmoid","i",2
"n",2,"ActivationSteepenedSigmoid","i",3
"n",3,"ActivationSteepenedSigmoid","i",4
"n",4,"ActivationSteepenedSigmoid","i",5
"n",5,"ActivationSteepenedSigmoid","i",6
"n",6,"ActivationSteepenedSigmoid","i",7
"n",8,"ActivationSteepenedSigmoid","o",8
"n",9,"ActivationSteepenedSigmoid","o",9
"l",-1,1,7,8,-0.9,10
"l",-1,1,7,9,-0.2950738363,11
"l",-1,1,0,8,0.9,12
"l",-1,1,1,9,0.9,13
"l",-1,1,1,8,0.9,14
"l",-1,1,2,9,0.9,15
"l",-1,1,3,8,0.9,16
"l",-1,1,2,9,-0.9,17
"l",-1,1,3,8,-0.7069711834,18
"l",-1,1,3,9,-0.1267421452,19
"l",-1,1,4,9,-0.7725285386,20
"l",-1,1,5,9,-0.9,21
"l",-1,1,6,9,0.6064710886,22
"l",-1,1,5,8,-0.9,46
"l",-1,1,9,9,0.0672642233,50
"l",-1,1,4,8,0.0280435982,58
"s",0,-79452.6739153929,0
"g",-79452.6739153929,-79452.6739153929,4000
"n",7,"ActivationSteepenedSigmoid","b",0
"n",0,"ActivationSteepenedSigmoid","i",1
"n",1,"ActivationSteepenedSigmoid","i",2
"n",2,"ActivationSteepenedSigmoid","i",3
"n",3,"ActivationSteepenedSigmoid","i",4
"n",4,"ActivationSteepenedSigmoid","i",5
"n",5,"ActivationSteepenedSigmoid","i",6
"n",6,"ActivationSteepenedSigmoid","i",7
"n",8,"ActivationSteepenedSigmoid","o",8
"n",9,"ActivationSteepenedSigmoid","o",9
"l",-1,1,7,8,-0.9,10
"l",-1,1,7,9,0.4826786832,11
"l",-1,1,0,8,0.9,12
"l",-1,1,1,9,0.4161459231,13
"l",-1,1,1,8,-0.7869638562,14
"l",-1,1,2,9,0.5543065571,15
"l",-1,1,3,8,0.6958543053,16
"l",-1,1,2,9,0.9,17
"l",-1,1,3,8,-0.2179538969,18
"l",-1,1,3,9,0.9,19
"l",-1,1,4,9,0.3079146359,20
"l",-1,1,5,9,0.9,21
"l",-1,1,6,9,0.6647980348,22
"l",-1,1,8,9,0.4024082518,29
"s",0,-80675.4133654705,0
"g",-80675.4133654705,-80675.4133654705,4000
"n",7,"ActivationSteepenedSigmoid","b",0
"n",0,"ActivationSteepenedSigmoid","i",1
"n",1,"ActivationSteepenedSigmoid","i",2
"n",2,"ActivationSteepenedSigmoid","i",3
"n",3,"ActivationSteepenedSigmoid","i",4
"n",4,"ActivationSteepenedSigmoid","i",5
"n",5,"ActivationSteepenedSigmoid","i",6
"n",6,"ActivationSteepenedSigmoid","i",7
"n",8,"ActivationSteepenedSigmoid","o",8
"n",9,"ActivationSteepenedSigmoid","o",9
"l",-1,1,7,8,-0.0262423221,10
"l",-1,1,7,9,-0.9,11
"l",-1,1,0,8,-0.9,12
"l",-1,1,1,9,0.4449189808,13
"l",-1,1,1,8,0.9,14
"l",-1,1,2,9,0.5569296395,15
"l",-1,1,3,8,0.4013896754,16
"l",-1,1,2,9,-0.043225156,17
"l",-1,1,3,8,0.0528466505,18
"l",-1,1,3,9,-0.452949162,19
"l",-1,1,4,9,0.8391763596,20
"l",-1,1,5,9,0.5869310403,21
"l",-1,1,6,9,-0.9,22
"s",0,-81245.0869347585,0
"g",-81245.0869347585,-81245.0869347585,4000
"n",7,"ActivationSteepenedSigmoid","b",0
"n",0,"ActivationSteepenedSigmoid","i",1
"n",1,"ActivationSteepenedSigmoid","i",2
"n",2,"ActivationSteepenedSigmoid","i",3
"n",3,"ActivationSteepenedSigmoid","i",4
"n",4,"ActivationSteepenedSigmoid","i",5
"n",5,"ActivationSteepenedSigmoid","i",6
"n",6,"ActivationSteepenedSigmoid","i",7
"n",8,"ActivationSteepenedSigmoid","o",8
"n",9,"ActivationSteepenedSigmoid","o",9
"l",-1,1,7,8,0.2303281118,10
"l",-1,1,7,9,-0.9,11
"l",-1,1,0,8,-0.9,12
"l",-1,1,1,9,0.9,13
"l",-1,1,1,8,0.9,14
"l",-1,1,2,9,0.062988747,15
"l",-1,1,3,8,0.9,16
"l",-1,1,2,9,-0.707189856,17
"l",-1,1,3,8,-0.5073114036,18
"l",-1,1,3,9,-0.9,19
"l",-1,1,4,9,0.8186724449,20
"l",-1,1,5,9,-0.0046615478,21
"l",-1,1,6,9,-0.5862016258,22
"l",-1,1,8,9,0.9,29
"s",0,-83379.7796142768,0
"g",-83379.7796142768,-83379.7796142768,4000
"n",7,"ActivationSteepenedSigmoid","b",0
"n",0,"ActivationSteepenedSigmoid","i",1
"n",1,"ActivationSteepenedSigmoid","i",2
"n",2,"ActivationSteepenedSigmoid","i",3
"n",3,"ActivationSteepenedSigmoid","i",4
"n",4,"ActivationSteepenedSigmoid","i",5
"n",5,"ActivationSteepenedSigmoid","i",6
"n",6,"ActivationSteepenedSigmoid","i",7
"n",8,"ActivationSteepenedSigmoid","o",8
"n",9,"ActivationSteepenedSigmoid","o",9
"l",-1,1,7,8,0.087228457,10
"l",-1,1,7,9,-0.9,11
"l",-1,1,0,8,0.9,12
"l",-1,1,1,9,-0.9,13
"l",-1,1,1,8,0.3970643401,14
"l",-1,1,2,9,0.7933034813,15
"l",-1,1,3,8,0.9,16
"l",-1,1,2,9,-0.0172191257,17
"l",-1,1,3,8,0.9,18
"l",-1,1,3,9,0.8696252179,19
"l",-1,1,4,9,0.878447883,20
"l",-1,1,5,9,0.8563012577,21
"l",-1,1,6,9,-0.0011469138,22
"s",0,-85913.2609496055,0
"g",-85913.2609496055,-85913.2609496055,4000
"n",7,"ActivationSteepenedSigmoid","b",0
"n",0,"ActivationSteepenedSigmoid","i",1
"n",1,"ActivationSteepenedSigmoid","i",2
"n",2,"ActivationSteepenedSigmoid","i",3
"n",3,"ActivationSteepenedSigmoid","i",4
"n",4,"ActivationSteepenedSigmoid","i",5
"n",5,"ActivationSteepenedSigmoid","i",6
"n",6,"ActivationSteepenedSigmoid","i",7
"n",8,"ActivationSteepenedSigmoid","o",8
"n",9,"ActivationSteepenedSigmoid","o",9
"l",-1,1,7,8,-0.0529846449,10
"l",-1,1,7,9,0.9,11
"l",-1,1,0,8,0.6322304552,12
"l",-1,1,1,9,0.4691937645,13
"l",-1,1,1,8,0.2407203966,14
"l",-1,1,2,9,-0.2840942628,15
"l",-1,1,3,8,0.4459089789,16
"l",-1,1,2,9,0.1944084861,17
"l",-1,1,3,8,0.0375312404,18
"l",-1,1,3,9,-0.011096955,19
"l",-1,1,4,9,0.7313631258,20
"l",-1,1,5,9,0.0512307994,21
"l",-1,1,6,9,-0.6609624529,22
"s",0,-86744.7296914019,0
"g",-86744.7296914019,-86744.7296914019,4000
"n",7,"ActivationSteepenedSigmoid","b",0
"n",0,"ActivationSteepenedSigmoid","i",1
"n",1,"ActivationSteepenedSigmoid","i",2
"n",2,"ActivationSteepenedSigmoid","i",3
"n",3,"ActivationSteepenedSigmoid","i",4
"n",4,"ActivationSteepenedSigmoid","i",5
"n",5,"ActivationSteepenedSigmoid","i",6
"n",6,"ActivationSteepenedSigmoid","i",7
"n",8,"ActivationSteepenedSigmoid","o",8
"n",9,"ActivationSteepenedSigmoid","o",9
"n",21,"ActivationSteepenedSigmoid","h",79
"l",-1,1,7,8,0.8868494769,10
"l",-1,1,7,9,-0.1150337075,11
"l",-1,1,0,8,-0.9,12
"l",-1,0,1,9,0.9,13
"l",-1,1,1,8,-0.858384969,14
"l",-1,1,2,9,0.9,15
"l",-1,1,3,8,0.2089200867,16
"l",-1,1,2,9,-0.9,17
"l",-1,1,3,8,0.9,18
"l",-1,1,3,9,0.9,19
"l",-1,1,4,9,0.9,20
"l",-1,1,5,9,-0.1041739851,21
"l",-1,1,6,9,0.2930110001,22
"l",-1,1,9,9,-0.2905617204,50
"l",-1,1,1,21,0.9,80
"l",-1,1,21,9,0.9,81
"l",-1,1,0,21,0.7058374394,110
"s",0,-86960.3444454474,0
"g",-86960.3444454474,-86960.3444454474,4000
"n",7,"ActivationSteepenedSigmoid","b",0
"n",0,"ActivationSteepenedSigmoid","i",1
"n",1,"ActivationSteepenedSigmoid","i",2
"n",2,"ActivationSteepenedSigmoid","i",3
"n",3,"ActivationSteepenedSigmoid","i",4
"n",4,"ActivationSteepenedSigmoid","i",5
"n",5,"ActivationSteepenedSigmoid","i",6
"n",6,"ActivationSteepenedSigmoid","i",7
"n",8,"ActivationSteepenedSigmoid","o",8
"n",9,"ActivationSteepenedSigmoid","o",9
"l",-1,1,7,8,0.8886629878,10
"l",-1,1,7,9,0.8759626578,11
"l",-1,1,0,8,-0.8923587356,12
"l",-1,1,1,9,0.5233622656,13
"l",-1,1,1,8,0.3762068821,14
"l",-1,1,2,9,0.9,15
"l",-1,1,3,8,0.859221068,16
"l",-1,1,2,9,-0.9,17
"l",-1,1,3,8,0.4582947899,18
"l",-1,1,3,9,-0.9,19
"l",-1,1,4,9,0.0525391686,20
"l",-1,1,5,9,0.8917350597,21
"l",-1,1,6,9,0.9,22
"s",0,-87005.323734119,0
"g",-87005.323734119,-87005.323734119,4000
"n",7,"ActivationSteepenedSigmoid","b",0
"n",0,"ActivationSteepenedSigmoid","i",1
"n",1,"ActivationSteepenedSigmoid","i",2
"n",2,"ActivationSteepenedSigmoid","i",3
"n",3,"ActivationSteepenedSigmoid","i",4
"n",4,"ActivationSteepenedSigmoid","i",5
"n",5,"ActivationSteepenedSigmoid","i",6
"n",6,"ActivationSteepenedSigmoid","i",7
"n",8,"ActivationSteepenedSigmoid","o",8
"n",9,"ActivationSteepenedSigmoid","o",9
"l",-1,1,7,8,-0.0286517829,10
"l",-1,1,7,9,-0.8795018739,11
"l",-1,1,0,8,0.9,12
"l",-1,1,1,9,0.3957696132,13
"l",-1,1,1,8,0.5013039804,14
"l",-1,1,2,9,-0.342162604,15
"l",-1,1,3,8,0.4483571834,16
"l",-1,1,2,9,0.8462513508,17
"l",-1,1,3,8,0.9,18
"l",-1,1,3,9,0.9,19
"l",-1,1,4,9,0.8686278412,20
"l",-1,1,5,9,0.4052567948,21
"l",-1,1,6,9,-0.6476666337,22
"l",-1,1,4,8,0.4758148928,58
"s",0,-89364.8575191407,0
"g",-89364.8575191407,-89364.8575191407,4000
"n",7,"ActivationSteepenedSigmoid","b",0
"n",0,"ActivationSteepenedSigmoid","i",1
"n",1,"ActivationSteepenedSigmoid","i",2
"n",2,"ActivationSteepenedSigmoid","i",3
"n",3,"ActivationSteepenedSigmoid","i",4
"n",4,"ActivationSteepenedSigmoid","i",5
"n",5,"ActivationSteepenedSigmoid","i",6
"n",6,"ActivationSteepenedSigmoid","i",7
"n",8,"ActivationSteepenedSigmoid","o",8
"n",9,"ActivationSteepenedSigmoid","o",9
"l",-1,1,7,8,0.2502772612,10
"l",-1,1,7,9,-0.9,11
"l",-1,1,0,8,-0.8721633663,12
"l",-1,1,1,9,0.9,13
"l",-1,1,1,8,0.242040852,14
"l",-1,1,2,9,-0.4304232421,15
"l",-1,1,3,8,-0.9,16
"l",-1,1,2,9,-0.9,17
"l",-1,1,3,8,-0.3808110943,18
"l",-1,1,3,9,0.9,19
"l",-1,1,4,9,0.9,20
"l",-1,1,5,9,0.8939753852,21
"l",-1,1,6,9,0.2577073557,22
"l",-1,1,8,8,-0.9,27
"l",-1,1,8,9,-0.9,29
"s",0,-90042.083199302,0
"g",-90042.083199302,-90042.083199302,4000
"n",7,"ActivationSteepenedSigmoid","b",0
"n",0,"ActivationSteepenedSigmoid","i",1
"n",1,"ActivationSteepenedSigmoid","i",2
"n",2,"ActivationSteepenedSigmoid","i",3
"n",3,"ActivationSteepenedSigmoid","i",4
"n",4,"ActivationSteepenedSigmoid","i",5
"n",5,"ActivationSteepenedSigmoid","i",6
"n",6,"ActivationSteepenedSigmoid","i",7
"n",8,"ActivationSteepenedSigmoid","o",8
"n",9,"ActivationSteepenedSigmoid","o",9
"l",-1,1,7,8,-0.0459842182,10
"l",-1,1,7,9,-0.8795018739,11
"l",-1,1,0,8,-0.2694437122,12
"l",-1,1,1,9,0.4446759496,13
"l",-1,1,1,8,0.2455300581,14
"l",-1,1,2,9,-0.2840942628,15
"l",-1,1,3,8,0.4481703372,16
"l",-1,1,2,9,0.2047541206,17
"l",-1,1,3,8,0.7017242407,18
"l",-1,1,3,9,-0.0139990548,19
"l",-1,1,4,9,0.8064640939,20
"l",-1,1,5,9,0.5869310403,21
"l",-1,1,6,9,0.9,22
"s",0,-90050.8527508204,0
"g",-90050.8527508204,-90050.8527508204,4000
"n",7,"ActivationSteepenedSigmoid","b",0
"n",0,"ActivationSteepenedSigmoid","i",1
"n",1,"ActivationSteepenedSigmoid","i",2
"n",2,"ActivationSteepenedSigmoid","i",3
"n",3,"ActivationSteepenedSigmoid","i",4
"n",4,"ActivationSteepenedSigmoid","i",5
"n",5,"ActivationSteepenedSigmoid","i",6
"n",6,"ActivationSteepenedSigmoid","i",7
"n",8,"ActivationSteepenedSigmoid","o",8
"n",9,"ActivationSteepenedSigmoid","o",9
"l",-1,1,7,8,0.0555833117,10
"l",-1,1,7,9,-0.0732900208,11
"l",-1,1,0,8,-0.5200834351,12
"l",-1,1,1,9,0.9,13
"l",-1,1,1,8,0.095713269,14
"l",-1,1,2,9,-0.9,15
"l",-1,1,3,8,0.9,16
"l",-1,1,2,9,-0.9,17
"l",-1,1,3,8,-0.8586643642,18
"l",-1,1,3,9,-0.53397363,19
"l",-1,1,4,9,0.0937673807,20
"l",-1,1,5,9,-0.3504132147,21
"l",-1,1,6,9,0.1675943217,22
"s",0,-91390.0267463601,0
"g",-91390.0267463601,-91390.0267463601,4000
"n",7,"ActivationSteepenedSigmoid","b",0
"n",0,"ActivationSteepenedSigmoid","i",1
"n",1,"ActivationSteepenedSigmoid","i",2
"n",2,"ActivationSteepenedSigmoid","i",3
"n",3,"ActivationSteepenedSigmoid","i",4
"n",4,"ActivationSteepenedSigmoid","i",5
"n",5,"ActivationSteepenedSigmoid","i",6
"n",6,"ActivationSteepenedSigmoid","i",7
"n",8,"ActivationSteepenedSigmoid","o",8
"n",9,"ActivationSteepenedSigmoid","o",9
"l",-1,1,7,8,0.9,10
"l",-1,1,7,9,-0.3899455585,11
"l",-1,1,0,8,-0.7958267405,12
"l",-1,1,1,9,0.9,13
"l",-1,1,1,8,-0.3715679321,14
"l",-1,1,2,9,-0.9,15
"l",-1,1,3,8,-0.8520833834,16
"l",-1,1,2,9,0.8453349525,17
"l",-1,1,3,8,0.9,18
"l",-1,1,3,9,0.9,19
"l",-1,1,4,9,0.9,20
"l",-1,1,5,9,-0.8943883207,21
"l",-1,1,6,9,-0.2729954893,22
"l",-1,1,8,8,0.2498555313,27
"l",-1,1,4,8,0.1814866469,58
"s",0,-91551.6064940008,0
"g",-91551.6064940008,-91551.6064940008,4000
"n",7,"ActivationSteepenedSigmoid","b",0
"n",0,"ActivationSteepenedSigmoid","i",1
"n",1,"ActivationSteepenedSigmoid","i",2
"n",2,"ActivationSteepenedSigmoid","i",3
"n",3,"ActivationSteepenedSigmoid","i",4
"n",4,"ActivationSteepenedSigmoid","i",5
"n",5,"ActivationSteepenedSigmoid","i",6
"n",6,"ActivationSteepenedSigmoid","i",7
"n",8,"ActivationSteepenedSigmoid","o",8
"n",9,"ActivationSteepenedSigmoid","o",9
"l",-1,1,7,8,0.9,10
"l",-1,1,7,9,-0.9,11
"l",-1,1,0,8,-0.4409616265,12
"l",-1,1,1,9,0.9,13
"l",-1,1,1,8,0.4275959803,14
"l",-1,1,2,9,0.9,15
"l",-1,1,3,8,0.9,16
"l",-1,1,2,9,0.9,17
"l",-1,1,3,8,-0.614837935,18
"l",-1,1,3,9,0.8660570285,19
"l",-1,1,4,9,0.8859329282,20
"l",-1,1,5,9,-0.1585035481,21
"l",-1,1,6,9,-0.7437239534,22
"s",0,-91813.155011483,0
"g",-91813.155011483,-91813.155011483,4000
"n",7,"ActivationSteepenedSigmoid","b",0
"n",0,"ActivationSteepenedSigmoid","i",1
"n",1,"ActivationSteepenedSigmoid","i",2
"n",2,"ActivationSteepenedSigmoid","i",3
"n",3,"ActivationSteepenedSigmoid","i",4
"n",4,"ActivationSteepenedSigmoid","i",5
"n",5,"ActivationSteepenedSigmoid","i",6
"n",6,"ActivationSteepenedSigmoid","i",7
"n",8,"ActivationSteepenedSigmoid","o",8
"n",9,"ActivationSteepenedSigmoid","o",9
"l",-1,1,7,8,-0.3128228329,10
"l",-1,1,7,9,-0.8760979978,11
"l",-1,1,0,8,-0.1236338832,12
"l",-1,1,1,9,0.4508891953,13
"l",-1,1,1,8,0.4384558188,14
"l",-1,1,2,9,-0.309345774,15
"l",-1,1,3,8,0.8850252297,16
"l",-1,1,2,9,0.254134157,17
"l",-1,1,3,8,-0.6573724196,18
"l",-1,1,3,9,-0.8974017822,19
"l",-1,1,4,9,0.8795848256,20
"l",-1,1,5,9,-0.0207166997,21
"l",-1,1,6,9,0.1792921556,22
"s",0,-92003.3242092859,0
"g",-92003.3242092859,-92003.3242092859,4000
"n",7,"ActivationSteepenedSigmoid","b",0
"n",0,"ActivationSteepenedSigmoid","i",1
"n",1,"ActivationSteepenedSigmoid","i",2
"n",2,"ActivationSteepenedSigmoid","i",3
"n",3,"ActivationSteepenedSigmoid","i",4
"n",4,"ActivationSteepenedSigmoid","i",5
"n",5,"ActivationSteepenedSigmoid","i",6
"n",6,"ActivationSteepenedSigmoid","i",7
"n",8,"ActivationSteepenedSigmoid","o",8
"n",9,"ActivationSteepenedSigmoid","o",9
"l",-1,1,7,8,0.1668526269,10
"l",-1,1,7,9,-0.9,11
"l",-1,1,0,8,-0.9,12
"l",-1,1,1,9,0.7857798034,13
"l",-1,1,1,8,0.2813826939,14
"l",-1,1,2,9,0.9,15
"l",-1,1,3,8,-0.0048308108,16
"l",-1,1,2,9,0.5798622795,17
"l",-1,1,3,8,0.6868243125,18
"l",-1,1,3,9,-0.884551422,19
"l",-1,1,4,9,0.9,20
"l",-1,1,5,9,-0.0692503435,21
"l",-1,1,6,9,-0.8923670426,22
"l",-1,1,9,8,-0.2053212872,30
"l",-1,1,5,8,0.0320403168,46
"s",0,-92445.0441850312,0
"g",-92445.0441850312,-92445.0441850312,4000
"n",7,"ActivationSteepenedSigmoid","b",0
"n",0,"ActivationSteepenedSigmoid","i",1
"n",1,"ActivationSteepenedSigmoid","i",2
"n",2,"ActivationSteepenedSigmoid","i",3
"n",3,"ActivationSteepenedSigmoid","i",4
"n",4,"ActivationSteepenedSigmoid","i",5
"n",5,"ActivationSteepenedSigmoid","i",6
"n",6,"ActivationSteepenedSigmoid","i",7
"n",8,"ActivationSteepenedSigmoid","o",8
"n",9,"ActivationSteepenedSigmoid","o",9
"l",-1,1,7,8,-0.3077441976,10
"l",-1,1,7,9,-0.8874578841,11
"l",-1,1,0,8,-0.4817488998,12
"l",-1,1,1,9,0.4701352752,13
"l",-1,1,1,8,0.7555265262,14
"l",-1,1,2,9,-0.2956490782,15
"l",-1,1,3,8,0.9,16
"l",-1,1,2,9,0.2097730892,17
"l",-1,1,3,8,-0.0283601786,18
"l",-1,1,3,9,-0.8974017822,19
"l",-1,1,4,9,0.8795848256,20
"l",-1,1,5,9,0.549271923,21
"l",-1,1,6,9,0.3488160196,22
"s",0,-92476.6704094811,0
"g",-92476.6704094811,-92476.6704094811,4000
"n",7,"ActivationSteepenedSigmoid","b",0
"n",0,"ActivationSteepenedSigmoid","i",1
"n",1,"ActivationSteepenedSigmoid","i",2
"n",2,"ActivationSteepenedSigmoid","i",3
"n",3,"ActivationSteepenedSigmoid","i",4
"n",4,"ActivationSteepenedSigmoid","i",5
"n",5,"ActivationSteepenedSigmoid","i",6
"n",6,"ActivationSteepenedSigmoid","i",7
"n",8,"ActivationSteepenedSigmoid","o",8
"n",9,"ActivationSteepenedSigmoid","o",9
"l",-1,1,7,8,-0.0119880835,10
"l",-1,1,7,9,0.0432299865,11
"l",-1,1,0,8,-0.9,12
"l",-1,1,1,9,0.5662809355,13
"l",-1,1,1,8,-0.8481909143,14
"l",-1,1,2,9,-0.2923994193,15
"l",-1,1,3,8,0.8981877551,16
"l",-1,1,2,9,-0.9,17
"l",-1,1,3,8,-0.4081745591,18
"l",-1,1,3,9,-0.9,19
"l",-1,1,4,9,0.8986606583,20
"l",-1,1,5,9,0.5333254835,21
"l",-1,1,6,9,0.4276176248,22
"s",0,-93308.0734101307,0
"g",-93308.0734101307,-93308.0734101307,4000
"n",7,"ActivationSteepenedSigmoid","b",0
"n",0,"ActivationSteepenedSigmoid","i",1
"n",1,"ActivationSteepenedSigmoid","i",2
"n",2,"ActivationSteepenedSigmoid","i",3
"n",3,"ActivationSteepenedSigmoid","i",4
"n",4,"ActivationSteepenedSigmoid","i",5
"n",5,"ActivationSteepenedSigmoid","i",6
"n",6,"ActivationSteepenedSigmoid","i",7
"n",8,"ActivationSteepenedSigmoid","o",8
"n",9,"ActivationSteepenedSigmoid","o",9
"l",-1,1,7,8,-0.458251219,10
"l",-1,1,7,9,0.7984594465,11
"l",-1,1,0,8,-0.3868715154,12
"l",-1,1,1,9,-0.8243097137,13
"l",-1,1,1,8,-0.4606451035,14
"l",-1,1,2,9,-0.9,15
"l",-1,1,3,8,0.4116903531,16
"l",-1,1,2,9,0.7298562971,17
"l",-1,1,3,8,0.2469857262,18
"l",-1,1,3,9,0.6108638043,19
"l",-1,1,4,9,0.742682413,20
"l",-1,1,5,9,-0.6897872876,21
"l",-1,1,6,9,0.3874383615,22
"s",0,-93518.8933152606,0
"g",-93518.8933152606,-93518.8933152606,4000
"n",7,"ActivationSteepenedSigmoid","b",0
"n",0,"ActivationSteepenedSigmoid","i",1
"n",1,"ActivationSteepenedSigmoid","i",2
"n",2,"ActivationSteepenedSigmoid","i",3
"n",3,"ActivationSteepenedSigmoid","i",4
"n",4,"ActivationSteepenedSigmoid","i",5
"n",5,"ActivationSteepenedSigmoid","i",6
"n",6,"ActivationSteepenedSigmoid","i",7
"n",8,"ActivationSteepenedSigmoid","o",8
"n",9,"ActivationSteepenedSigmoid","o",9
"l",-1,1,7,8,0.5104748786,10
"l",-1,1,7,9,-0.9,11
"l",-1,1,0,8,-0.6340547733,12
"l",-1,1,1,9,0.1485562572,13
"l",-1,1,1,8,-0.3413584529,14
"l",-1,1,2,9,-0.8942543029,15
"l",-1,1,3,8,-0.2894905839,16
"l",-1,1,2,9,0.879023161,17
"l",-1,1,3,8,0.7260891788,18
"l",-1,1,3,9,-0.9,19
"l",-1,1,4,9,0.9,20
"l",-1,1,5,9,0.4843759372,21
"l",-1,1,6,9,-0.0591887867,22
"s",0,-93607.9843311604,0
"g",-93607.9843311604,-93607.9843311604,4000
"n",7,"ActivationSteepenedSigmoid","b",0
"n",0,"ActivationSteepenedSigmoid","i",1
"n",1,"ActivationSteepenedSigmoid","i",2
"n",2,"ActivationSteepenedSigmoid","i",3
"n",3,"ActivationSteepenedSigmoid","i",4
"n",4,"ActivationSteepenedSigmoid","i",5
"n",5,"ActivationSteepenedSigmoid","i",6
"n",6,"ActivationSteepenedSigmoid","i",7
"n",8,"ActivationSteepenedSigmoid","o",8
"n",9,"ActivationSteepenedSigmoid","o",9
"l",-1,1,7,8,-0.0360588174,10
"l",-1,1,7,9,-0.7158992218,11
"l",-1,1,0,8,-0.8196838019,12
"l",-1,1,1,9,-0.0152225117,13
"l",-1,1,1,8,-0.2823848068,14
"l",-1,1,3,8,-0.9,16
"l",-1,1,2,9,0.0327837578,17
"l",-1,1,3,8,-0.5032016065,18
"l",-1,1,3,9,-0.6317419268,19
"l",-1,1,4,9,0.8433133454,20
"l",-1,1,5,9,-0.6608435812,21
"l",-1,1,6,9,-0.5257231813,22
"s",0,-94611.0986373311,0
"g",-94611.0986373311,-94611.0986373311,4000
"n",7,"ActivationSteepenedSigmoid","b",0
"n",0,"ActivationSteepenedSigmoid","i",1
"n",1,"ActivationSteepenedSigmoid","i",2
"n",2,"ActivationSteepenedSigmoid","i",3
"n",3,"ActivationSteepenedSigmoid","i",4
"n",4,"ActivationSteepenedSigmoid","i",5
"n",5,"ActivationSteepenedSigmoid","i",6
"n",6,"ActivationSteepenedSigmoid","i",7
"n",8,"ActivationSteepenedSigmoid","o",8
"n",9,"ActivationSteepenedSigmoid","o",9
"l",-1,1,7,8,0.9,10
"l",-1,1,7,9,0.7741049894,11
"l",-1,1,0,8,-0.6650977198,12
"l",-1,1,1,9,0.9,13
"l",-1,1,1,8,-0.8983377768,14
"l",-1,1,2,9,-0.572013927,15
"l",-1,1,3,8,0.9,16
"l",-1,1,2,9,0.1971381249,17
"l",-1,1,3,8,-0.5127298613,18
"l",-1,1,3,9,-0.1321200107,19
"l",-1,1,4,9,0.8725045139,20
"l",-1,1,5,9,0.9,21
"l",-1,1,6,9,-0.9,22
"l",-1,1,6,8,-0.174019778,57
"l",-1,1,4,8,-0.5579299599,58
"s",0,-94905.227329945,0
"g",-94905.227329945,-94905.227329945,4000
"n",7,"ActivationSteepenedSigmoid","b",0
"n",0,"ActivationSteepenedSigmoid","i",1
"n",1,"ActivationSteepenedSigmoid","i",2
"n",2,"ActivationSteepenedSigmoid","i",3
"n",3,"ActivationSteepenedSigmoid","i",4
"n",4,"ActivationSteepenedSigmoid","i",5
"n",5,"ActivationSteepenedSigmoid","i",6
"n",6,"ActivationSteepenedSigmoid","i",7
"n",8,"ActivationSteepenedSigmoid","o",8
"n",9,"ActivationSteepenedSigmoid","o",9
"l",-1,1,7,8,0.2438477526,10
"l",-1,1,7,9,0.9,11
"l",-1,1,0,8,-0.9,12
"l",-1,1,1,9,0.9,13
"l",-1,1,1,8,-0.8925914501,14
"l",-1,1,2,9,-0.9,15
"l",-1,1,3,8,0.7345056244,16
"l",-1,1,2,9,0.5956193107,17
"l",-1,1,3,8,-0.5999524522,18
"l",-1,1,3,9,-0.2088909247,19
"l",-1,1,4,9,0.2572889054,20
"l",-1,1,5,9,0.8944155382,21
"l",-1,1,6,9,0.5559777928,22
"s",0,-95351.6411878779,0
"g",-95351.6411878779,-95351.6411878779,4000
"n",7,"ActivationSteepenedSigmoid","b",0
"n",0,"ActivationSteepenedSigmoid","i",1
"n",1,"ActivationSteepenedSigmoid","i",2
"n",2,"ActivationSteepenedSigmoid","i",3
"n",3,"ActivationSteepenedSigmoid","i",4
"n",4,"ActivationSteepenedSigmoid","i",5
"n",5,"ActivationSteepenedSigmoid","i",6
"n",6,"ActivationSteepenedSigmoid","i",7
"n",8,"ActivationSteepenedSigmoid","o",8
"n",9,"ActivationSteepenedSigmoid","o",9
"l",-1,1,7,8,0.1707742997,10
"l",-1,1,7,9,-0.1826252955,11
"l",-1,1,0,8,0.5174219473,12
"l",-1,1,1,9,-0.2282659556,13
"l",-1,1,1,8,0.7070907007,14
"l",-1,1,2,9,-0.9,15
"l",-1,1,3,8,-0.02551016,16
"l",-1,1,2,9,0.3512662417,17
"l",-1,1,3,8,0.9,18
"l",-1,1,3,9,-0.9,19
"l",-1,1,4,9,0.0510274771,20
"l",-1,1,5,9,0.245376587,21
"l",-1,1,6,9,0.2436126671,22
"l",-1,1,8,8,0.2625249193,27
"s",0,-95427.0078477662,0
"g",-95427.0078477662,-95427.0078477662,4000
"n",7,"ActivationSteepenedSigmoid","b",0
"n",0,"ActivationSteepenedSigmoid","i",1
"n",1,"ActivationSteepenedSigmoid","i",2
"n",2,"ActivationSteepenedSigmoid","i",3
"n",3,"ActivationSteepenedSigmoid","i",4
"n",4,"ActivationSteepenedSigmoid","i",5
"n",5,"ActivationSteepenedSigmoid","i",6
"n",6,"ActivationSteepenedSigmoid","i",7
"n",8,"ActivationSteepenedSigmoid","o",8
"n",9,"ActivationSteepenedSigmoid","o",9
"l",-1,1,7,8,0.273771087,10
"l",-1,1,7,9,-0.111479906,11
"l",-1,1,0,8,0.8849930908,12
"l",-1,1,1,9,0.8016736642,13
"l",-1,1,1,8,0.2022711265,14
"l",-1,1,2,9,0.7043001582,15
"l",-1,1,3,8,0.8970491362,16
"l",-1,1,2,9,-0.8776887302,17
"l",-1,1,3,8,-0.6265091458,18
"l",-1,1,3,9,-0.5571425795,19
"l",-1,1,4,9,-0.4320455675,20
"l",-1,1,5,9,0.2958814654,21
"l",-1,1,6,9,-0.5113647087,22
"s",0,-96028.3633756361,0
"g",-96028.3633756361,-96028.3633756361,4000
"n",7,"ActivationSteepenedSigmoid","b",0
"n",0,"ActivationSteepenedSigmoid","i",1
"n",1,"ActivationSteepenedSigmoid","i",2
"n",2,"ActivationSteepenedSigmoid","i",3
"n",3,"ActivationSteepenedSigmoid","i",4
"n",4,"ActivationSteepenedSigmoid","i",5
"n",5,"ActivationSteepenedSigmoid","i",6
"n",6,"ActivationSteepenedSigmoid","i",7
"n",8,"ActivationSteepenedSigmoid","o",8
"n",9,"ActivationSteepenedSigmoid","o",9
"n",12,"ActivationSteepenedSigmoid","h",37
"l",-1,1,7,8,0.9,10
"l",-1,1,7,9,0.7782934629,11
"l",-1,1,0,8,-0.9,12
"l",-1,1,1,9,0.8497451028,13
"l",-1,1,1,8,0.1873013706,14
"l",-1,0,2,9,0.9,15
"l",-1,1,3,8,-0.3618001335,16
"l",-1,1,2,9,0.9,17
"l",-1,1,3,8,0.9,18
"l",-1,1,3,9,-0.3371632668,19
"l",-1,1,4,9,0.6096417443,20
"l",-1,1,5,9,0.9,21
"l",-1,1,6,9,0.9,22
"l",-1,1,2,12,0.5020689521,38
"l",-1,1,12,9,-0.3882905054,39
"l",-1,1,2,8,-0.3338545112,41
"l",-1,1,1,12,0.4811142457,113
"s",0,-96148.603423776,0
"g",-96148.603423776,-96148.603423776,4000
"n",7,"ActivationSteepenedSigmoid","b",0
"n",0,"ActivationSteepenedSigmoid","i",1
"n",1,"ActivationSteepenedSigmoid","i",2
"n",2,"ActivationSteepenedSigmoid","i",3
"n",3,"ActivationSteepenedSigmoid","i",4
"n",4,"ActivationSteepenedSigmoid","i",5
"n",5,"ActivationSteepenedSigmoid","i",6
"n",6,"ActivationSteepenedSigmoid","i",7
"n",8,"ActivationSteepenedSigmoid","o",8
"n",9,"ActivationSteepenedSigmoid","o",9
"l",-1,1,7,8,-0.9,10
"l",-1,1,7,9,-0.9,11
"l",-1,1,0,8,0.3491845056,12
"l",-1,1,1,9,0.863250173,13
"l",-1,1,1,8,-0.2538841734,14
"l",-1,1,2,9,-0.9,15
"l",-1,1,3,8,-0.9,16
"l",-1,1,2,9,-0.8948336821,17
"l",-1,1,3,8,-0.9,18
"l",-1,1,3,9,-0.9,19
"l",-1,1,4,9,0.9,20
"l",-1,1,5,9,0.6748635341,21
"l",-1,1,6,9,0.9,22
"l",-1,1,0,9,0.9,70
"s",0,-96251.8044474546,0
"g",-96251.8044474546,-96251.8044474546,4000
"n",7,"ActivationSteepenedSigmoid","b",0
"n",0,"ActivationSteepenedSigmoid","i",1
"n",1,"ActivationSteepenedSigmoid","i",2
"n",2,"ActivationSteepenedSigmoid","i",3
"n",3,"ActivationSteepenedSigmoid","i",4
"n",4,"ActivationSteepenedSigmoid","i",5
"n",5,"ActivationSteepenedSigmoid","i",6
"n",6,"ActivationSteepenedSigmoid","i",7
"n",8,"ActivationSteepenedSigmoid","o",8
"n",9,"ActivationSteepenedSigmoid","o",9
"l",-1,1,7,8,0.9,10
"l",-1,1,7,9,-0.1030210006,11
"l",-1,1,0,8,-0.9,12
"l",-1,1,1,9,0.233269049,13
"l",-1,1,1,8,-0.3901593301,14
"l",-1,1,2,9,-0.7192167764,15
"l",-1,1,3,8,-0.2079863065,16
"l",-1,1,2,9,0.8924487773,17
"l",-1,1,3,8,0.6476373609,18
"l",-1,1,3,9,-0.8373614507,19
"l",-1,1,4,9,0.8880410073,20
"l",-1,1,5,9,0.0661103067,21
"l",-1,1,6,9,-0.0233289026,22
"l",-1,1,9,8,0.4702262728,30
"l",-1,1,2,8,0.9,41
"s",0,-96361.8858257946,0
"g",-96361.8858257946,-96361.8858257946,4000
"n",7,"ActivationSteepenedSigmoid","b",0
"n",0,"ActivationSteepenedSigmoid","i",1
"n",1,"ActivationSteepenedSigmoid","i",2
"n",2,"ActivationSteepenedSigmoid","i",3
"n",3,"ActivationSteepenedSigmoid","i",4
"n",4,"ActivationSteepenedSigmoid","i",5
"n",5,"ActivationSteepenedSigmoid","i",6
"n",6,"ActivationSteepenedSigmoid","i",7
"n",8,"ActivationSteepenedSigmoid","o",8
"n",9,"ActivationSteepenedSigmoid","o",9
"l",-1,1,7,8,-0.5125593092,10
"l",-1,1,7,9,-0.004430613,11
"l",-1,1,0,8,-0.0109744161,12
"l",-1,1,1,9,-0.9,13
"l",-1,1,1,8,-0.8642489117,14
"l",-1,1,2,9,0.0908477364,15
"l",-1,1,3,8,-0.7122423941,16
"l",-1,1,2,9,-0.6698913596,17
"l",-1,1,3,8,0.9,18
"l",-1,1,3,9,0.9,19
"l",-1,1,4,9,0.9,20
"l",-1,1,5,9,0.9,21
"l",-1,1,6,9,-0.8977779408,22
"s",0,-98280.6965631795,0
"g",-98280.6965631795,-98280.6965631795,4000
"n",7,"ActivationSteepenedSigmoid","b",0
"n",0,"ActivationSteepenedSigmoid","i",1
"n",1,"ActivationSteepenedSigmoid","i",2
"n",2,"ActivationSteepenedSigmoid","i",3
"n",3,"ActivationSteepenedSigmoid","i",4
"n",4,"ActivationSteepenedSigmoid","i",5
"n",5,"ActivationSteepenedSigmoid","i",6
"n",6,"ActivationSteepenedSigmoid","i",7
"n",8,"ActivationSteepenedSigmoid","o",8
"n",9,"ActivationSteepenedSigmoid","o",9
"l",-1,1,7,8,-0.3075077894,10
"l",-1,1,7,9,-0.8760979978,11
"l",-1,1,0,8,-0.490552009,12
"l",-1,1,1,9,0.2362137612,13
"l",-1,1,1,8,0.4384558188,14
"l",-1,1,2,9,-0.2956490782,15
"l",-1,1,3,8,0.9,16
"l",-1,1,2,9,0.2322666032,17
"l",-1,1,3,8,0.7337092468,18
"l",-1,1,3,9,0.0178212792,19
"l",-1,1,4,9,0.9,20
"l",-1,1,5,9,0.5565440406,21
"l",-1,1,6,9,0.3160542888,22
"s",0,-99110.3191553083,0
"g",-99110.3191553083,-99110.3191553083,4000
"n",7,"ActivationSteepenedSigmoid","b",0
"n",0,"ActivationSteepenedSigmoid","i",1
"n",1,"ActivationSteepenedSigmoid","i",2
"n",2,"ActivationSteepenedSigmoid","i",3
"n",3,"ActivationSteepenedSigmoid","i",4
"n",4,"ActivationSteepenedSigmoid","i",5
"n",5,"ActivationSteepenedSigmoid","i",6
"n",6,"ActivationSteepenedSigmoid","i",7
"n",8,"ActivationSteepenedSigmoid","o",8
"n",9,"ActivationSteepenedSigmoid","o",9
"l",-1,1,7,8,0.4522433628,10
"l",-1,1,7,9,0.7913965146,11
"l",-1,1,0,8,-0.9,12
"l",-1,1,1,9,-0.0880460851,13
"l",-1,1,1,8,-0.5549187555,14
"l",-1,1,2,9,-0.2654317769,15
"l",-1,1,3,8,0.2126393863,16
"l",-1,1,2,9,0.0814125613,17
"l",-1,1,3,8,-0.3061236617,18
"l",-1,1,3,9,-0.8994288126,19
"l",-1,1,4,9,0.4556827319,20
"l",-1,1,5,9,0.8882878942,21
"l",-1,1,6,9,-0.3061220109,22
"s",0,-99295.2771311382,0
"g",-99295.2771311382,-99295.2771311382,4000
"n",7,"ActivationSteepenedSigmoid","b",0
"n",0,"ActivationSteepenedSigmoid","i",1
"n",1,"ActivationSteepenedSigmoid","i",2
"n",2,"ActivationSteepenedSigmoid","i",3
"n",3,"ActivationSteepenedSigmoid","i",4
"n",4,"ActivationSteepenedSigmoid","i",5
"n",5,"ActivationSteepenedSigmoid","i",6
"n",6,"ActivationSteepenedSigmoid","i",7
"n",8,"ActivationSteepenedSigmoid","o",8
"n",9,"ActivationSteepenedSigmoid","o",9
"l",-1,1,7,8,-0.8982874918,10
"l",-1,1,7,9,-0.8966427415,11
"l",-1,1,0,8,0.1374720377,12
"l",-1,1,1,9,-0.0039099193,13
"l",-1,1,1,8,-0.0662558255,14
"l",-1,1,2,9,-0.9,15
"l",-1,1,3,8,0.9,16
"l",-1,1,2,9,-0.9,17
"l",-1,1,3,8,0.0264182248,18
"l",-1,1,3,9,-0.432045156,19
"l",-1,1,4,9,0.9,20
"l",-1,1,5,9,0.1494353039,21
"l",-1,1,6,9,0.839543831,22
"s",0,-99322.62296009,0
"g",-99322.62296009,-99322.62296009,4000
"n",7,"ActivationSteepenedSigmoid","b",0
"n",0,"ActivationSteepenedSigmoid","i",1
"n",1,"ActivationSteepenedSigmoid","i",2
"n",2,"ActivationSteepenedSigmoid","i",3
"n",3,"ActivationSteepenedSigmoid","i",4
"n",4,"ActivationSteepenedSigmoid","i",5
"n",5,"ActivationSteepenedSigmoid","i",6
"n",6,"ActivationSteepenedSigmoid","i",7
"n",8,"ActivationSteepenedSigmoid","o",8
"n",9,"ActivationSteepenedSigmoid","o",9
"l",-1,1,7,8,-0.9,10
"l",-1,1,7,9,-0.8760979978,11
"l",-1,1,0,8,-0.5214171323,12
"l",-1,1,1,9,0.71497597,13
"l",-1,1,1,8,0.4458157771,14
"l",-1,1,2,9,0.1232051863,15
"l",-1,1,3,8,0.9,16
"l",-1,1,2,9,0.2168964607,17
"l",-1,1,3,8,-0.8851427677,18
"l",-1,1,3,9,-0.9,19
"l",-1,1,4,9,0.9,20
"l",-1,1,5,9,0.549271923,21
"l",-1,1,6,9,-0.9,22
"s",0,-100231.9227498147,0
"g",-100231.9227498147,-100231.9227498147,4000
"n",7,"ActivationSteepenedSigmoid","b",0
"n",0,"ActivationSteepenedSigmoid","i",1
"n",1,"ActivationSteepenedSigmoid","i",2
"n",2,"ActivationSteepenedSigmoid","i",3
"n",3,"ActivationSteepenedSigmoid","i",4
"n",4,"ActivationSteepenedSigmoid","i",5
"n",5,"ActivationSteepenedSigmoid","i",6
"n",6,"ActivationSteepenedSigmoid","i",7
"n",8,"ActivationSteepenedSigmoid","o",8
"n",9,"ActivationSteepenedSigmoid","o",9
"l",-1,1,7,8,0.4846303407,10
"l",-1,1,7,9,0.0951951905,11
"l",-1,1,0,8,0.6605752445,12
"l",-1,1,1,9,0.8479454843,13
"l",-1,1,1,8,0.8605161758,14
"l",-1,1,2,9,-0.4851722464,15
"l",-1,1,3,8,0.9,16
"l",-1,1,2,9,0.5948120983,17
"l",-1,1,3,8,-0.3960709252,18
"l",-1,1,3,9,-0.9,19
"l",-1,1,4,9,-0.4819608682,20
"l",-1,1,5,9,0.8980335882,21
"l",-1,1,6,9,-0.8859820714,22
"l",-1,1,9,8,0.3438072988,30
"l",-1,1,5,8,-0.9,46
"s",0,-100639.2039553026,0
"g",-100639.2039553026,-100639.2039553026,4000
"n",7,"ActivationSteepenedSigmoid","b",0
"n",0,"ActivationSteepenedSigmoid","i",1
"n",1,"ActivationSteepenedSigmoid","i",2
"n",2,"ActivationSteepenedSigmoid","i",3
"n",3,"ActivationSteepenedSigmoid","i",4
"n",4,"ActivationSteepenedSigmoid","i",5
"n",5,"ActivationSteepenedSigmoid","i",6
"n",6,"ActivationSteepenedSigmoid","i",7
"n",8,"ActivationSteepenedSigmoid","o",8
"n",9,"ActivationSteepenedSigmoid","o",9
"l",-1,1,7,8,-0.9,10
"l",-1,1,7,9,-0.9,11
"l",-1,1,0,8,0.9,12
"l",-1,1,1,9,-0.0728471302,13
"l",-1,1,1,8,-0.8802107468,14
"l",-1,1,2,9,0.5145807819,15
"l",-1,1,3,8,0.8144881892,16
"l",-1,1,2,9,-0.3848569933,17
"l",-1,1,3,8,0.8878631014,18
"l",-1,1,3,9,-0.9,19
"l",-1,1,4,9,0.8943537365,20
"l",-1,1,5,9,-0.89357794,21
"l",-1,1,6,9,0.9,22
"s",0,-100654.7557158283,0
"g",-100654.7557158283,-100654.7557158283,4000
"n",7,"ActivationSteepenedSigmoid","b",0
"n",0,"ActivationSteepenedSigmoid","i",1
"n",1,"ActivationSteepenedSigmoid","i",2
"n",2,"ActivationSteepenedSigmoid","i",3
"n",3,"ActivationSteepenedSigmoid","i",4
"n",4,"ActivationSteepenedSigmoid","i",5
"n",5,"ActivationSteepenedSigmoid","i",6
"n",6,"ActivationSteepenedSigmoid","i",7
"n",8,"ActivationSteepenedSigmoid","o",8
"n",9,"ActivationSteepenedSigmoid","o",9
"l",-1,1,7,8,-0.1708905436,10
"l",-1,1,7,9,-0.6288221871,11
"l",-1,1,0,8,0.877624269,12
"l",-1,1,1,9,0.9,13
"l",-1,1,1,8,-0.6984699908,14
"l",-1,1,2,9,-0.9,15
"l",-1,1,3,8,0.539952437,16
"l",-1,1,2,9,-0.3237190297,17
"l",-1,1,3,8,0.7241683063,18
"l",-1,1,3,9,-0.9,19
"l",-1,1,4,9,0.9,20
"l",-1,1,5,9,0.9,21
"l",-1,1,6,9,-0.7595310572,22
"l",-1,1,6,8,-0.6849304568,57
"s",0,-100662.6410450611,0
"g",-100662.6410450611,-100662.6410450611,4000
"n",7,"ActivationSteepenedSigmoid","b",0
"n",0,"ActivationSteepenedSigmoid","i",1
"n",1,"ActivationSteepenedSigmoid","i",2
"n",2,"ActivationSteepenedSigmoid","i",3
"n",3,"ActivationSteepenedSigmoid","i",4
"n",4,"ActivationSteepenedSigmoid","i",5
"n",5,"ActivationSteepenedSigmoid","i",6
"n",6,"ActivationSteepenedSigmoid","i",7
"n",8,"ActivationSteepenedSigmoid","o",8
"n",9,"ActivationSteepenedSigmoid","o",9
"l",-1,1,7,8,-0.3075077894,10
"l",-1,1,7,9,-0.1441154172,11
"l",-1,1,0,8,-0.5258268937,12
"l",-1,1,1,9,0.4233953981,13
"l",-1,1,1,8,0.4573270025,14
"l",-1,1,2,9,0.3317020001,15
"l",-1,1,3,8,0.894997687,16
"l",-1,1,2,9,0.9,17
"l",-1,1,3,8,0.7026293189,18
"l",-1,1,3,9,-0.8974017822,19
"l",-1,1,4,9,-0.030666896,20
"l",-1,1,5,9,0.549271923,21
"l",-1,1,6,9,-0.8107826041,22
"s",0,-100711.8204593827,0
"g",-100711.8204593827,-100711.8204593827,4000
"n",7,"ActivationSteepenedSigmoid","b",0
"n",0,"ActivationSteepenedSigmoid","i",1
"n",1,"ActivationSteepenedSigmoid","i",2
"n",2,"ActivationSteepenedSigmoid","i",3
"n",3,"ActivationSteepenedSigmoid","i",4
"n",4,"ActivationSteepenedSigmoid","i",5
"n",5,"ActivationSteepenedSigmoid","i",6
"n",6,"ActivationSteepenedSigmoid","i",7
"n",8,"ActivationSteepenedSigmoid","o",8
"n",9,"ActivationSteepenedSigmoid","o",9
"l",-1,1,7,8,-0.9,10
"l",-1,1,7,9,0.4400004768,11
"l",-1,1,0,8,-0.3186962629,12
"l",-1,1,1,9,0.9,13
"l",-1,1,1,8,-0.9,14
"l",-1,1,2,9,-0.4389762679,15
"l",-1,1,3,8,-0.8286133299,16
"l",-1,1,2,9,-0.8916040506,17
"l",-1,1,3,8,0.046131336,18
"l",-1,1,3,9,-0.0742026791,19
"l",-1,1,4,9,0.9,20
"l",-1,1,5,9,-0.4877946029,21
"l",-1,1,6,9,-0.8687785577,22
"l",-1,1,9,8,-0.9,30
"l",-1,1,2,8,-0.9,41
"s",0,-101288.4229074963,0
"g",-101288.4229074963,-101288.4229074963,4000
"n",7,"ActivationSteepenedSigmoid","b",0
"n",0,"ActivationSteepenedSigmoid","i",1
"n",1,"ActivationSteepenedSigmoid","i",2
"n",2,"ActivationSteepenedSigmoid","i",3
"n",3,"ActivationSteepenedSigmoid","i",4
"n",4,"ActivationSteepenedSigmoid","i",5
"n",5,"ActivationSteepenedSigmoid","i",6
"n",6,"ActivationSteepenedSigmoid","i",7
"n",8,"ActivationSteepenedSigmoid","o",8
"n",9,"ActivationSteepenedSigmoid","o",9
"l",-1,1,7,8,-0.9,10
"l",-1,1,7,9,-0.8760979978,11
"l",-1,1,0,8,0.3721397691,12
"l",-1,1,1,9,0.4701352752,13
"l",-1,1,1,8,0.4384558188,14
"l",-1,1,2,9,-0.3466708621,15
"l",-1,1,3,8,-0.7638071821,16
"l",-1,1,2,9,0.2466421604,17
"l",-1,1,3,8,0.0006921473,18
"l",-1,1,3,9,-0.8704769467,19
"l",-1,1,4,9,0.866494972,20
"l",-1,1,5,9,0.549271923,21
"l",-1,1,6,9,-0.7798985444,22
"s",0,-102490.0019752761,0
"g",-102490.0019752761,-102490.0019752761,4000
"n",7,"ActivationSteepenedSigmoid","b",0
"n",0,"ActivationSteepenedSigmoid","i",1
"n",1,"ActivationSteepenedSigmoid","i",2
"n",2,"ActivationSteepenedSigmoid","i",3
"n",3,"ActivationSteepenedSigmoid","i",4
"n",4,"ActivationSteepenedSigmoid","i",5
"n",5,"ActivationSteepenedSigmoid","i",6
"n",6,"ActivationSteepenedSigmoid","i",7
"n",8,"ActivationSteepenedSigmoid","o",8
"n",9,"ActivationSteepenedSigmoid","o",9
"l",-1,1,7,8,-0.9,10
"l",-1,1,7,9,0.9,11
"l",-1,1,0,8,0.8306350584,12
"l",-1,1,1,9,-0.0922271839,13
"l",-1,1,1,8,0.6966212162,14
"l",-1,1,2,9,-0.0879322974,15
"l",-1,1,3,8,0.6428171728,16
"l",-1,1,2,9,-0.8756214951,17
"l",-1,1,3,8,0.9,18
"l",-1,1,3,9,-0.8433715052,19
"l",-1,1,4,9,0.7453439589,20
"l",-1,1,5,9,0.1318209272,21
"l",-1,1,6,9,-0.9,22
"s",0,-103334.907185749,0
"g",-103334.907185749,-103334.907185749,4000
"n",7,"ActivationSteepenedSigmoid","b",0
"n",0,"ActivationSteepenedSigmoid","i",1
"n",1,"ActivationSteepenedSigmoid","i",2
"n",2,"ActivationSteepenedSigmoid","i",3
"n",3,"ActivationSteepenedSigmoid","i",4
"n",4,"ActivationSteepenedSigmoid","i",5
"n",5,"ActivationSteepenedSigmoid","i",6
"n",6,"ActivationSteepenedSigmoid","i",7
"n",8,"ActivationSteepenedSigmoid","o",8
"n",9,"ActivationSteepenedSigmoid","o",9
"l",-1,1,7,8,0.7597620655,10
"l",-1,1,7,9,-0.9,11
"l",-1,1,0,8,-0.2326890326,12
"l",-1,1,1,9,0.0553718829,13
"l",-1,1,1,8,0.7313528902,14
"l",-1,1,2,9,-0.2153824212,15
"l",-1,1,3,8,0.9,16
"l",-1,1,2,9,0.2404045822,17
"l",-1,1,3,8,0.4476827846,18
"l",-1,1,3,9,-0.9,19
"l",-1,1,4,9,0.9,20
"l",-1,1,5,9,0.5702402339,21
"l",-1,1,6,9,-0.9,22
"s",0,-105058.8086531201,0
"g",-105058.8086531201,-105058.8086531201,4000
"n",7,"ActivationSteepenedSigmoid","b",0
"n",0,"ActivationSteepenedSigmoid","i",1
"n",1,"ActivationSteepenedSigmoid","i",2
"n",2,"ActivationSteepenedSigmoid","i",3
"n",3,"ActivationSteepenedSigmoid","i",4
"n",4,"ActivationSteepenedSigmoid","i",5
"n",5,"ActivationSteepenedSigmoid","i",6
"n",6,"ActivationSteepenedSigmoid","i",7
"n",8,"ActivationSteepenedSigmoid","o",8
"n",9,"ActivationSteepenedSigmoid","o",9
"l",-1,1,7,8,-0.8001431442,10
"l",-1,1,7,9,0.8969913348,11
"l",-1,1,0,8,0.6019975526,12
"l",-1,1,1,9,0.4409152177,13
"l",-1,1,1,8,0.8919390799,14
"l",-1,1,2,9,0.8920156159,15
"l",-1,1,3,8,0.9,16
"l",-1,1,2,9,0.7883633286,17
"l",-1,1,3,8,-0.3066430547,18
"l",-1,1,3,9,-0.448455382,19
"l",-1,1,4,9,0.9,20
"l",-1,1,5,9,-0.8935664499,21
"l",-1,1,6,9,-0.7045100913,22
"l",-1,1,6,8,0.8861680476,57
"s",0,-105179.7698107985,0
"g",-105179.7698107985,-105179.7698107985,4000
"n",7,"ActivationSteepenedSigmoid","b",0
"n",0,"ActivationSteepenedSigmoid","i",1
"n",1,"ActivationSteepenedSigmoid","i",2
"n",2,"ActivationSteepenedSigmoid","i",3
"n",3,"ActivationSteepenedSigmoid","i",4
"n",4,"ActivationSteepenedSigmoid","i",5
"n",5,"ActivationSteepenedSigmoid","i",6
"n",6,"ActivationSteepenedSigmoid","i",7
"n",8,"ActivationSteepenedSigmoid","o",8
"n",9,"ActivationSteepenedSigmoid","o",9
"l",-1,1,7,8,-0.3075077894,10
"l",-1,1,7,9,0.9,11
"l",-1,1,0,8,0.2674006073,12
"l",-1,1,1,9,0.4701352752,13
"l",-1,1,1,8,0.4384558188,14
"l",-1,1,2,9,-0.2956490782,15
"l",-1,1,3,8,0.9,16
"l",-1,1,2,9,0.2466421604,17
"l",-1,1,3,8,0.7400927179,18
"l",-1,1,3,9,0.7948644982,19
"l",-1,1,4,9,0.8795848256,20
"l",-1,1,5,9,0.558589169,21
"l",-1,1,6,9,0.6681034413,22
"s",0,-107017.4449200696,0
"g",-107017.4449200696,-107017.4449200696,4000
"n",7,"ActivationSteepenedSigmoid","b",0
"n",0,"ActivationSteepenedSigmoid","i",1
"n",1,"ActivationSteepenedSigmoid","i",2
"n",2,"ActivationSteepenedSigmoid","i",3
"n",3,"ActivationSteepenedSigmoid","i",4
"n",4,"ActivationSteepenedSigmoid","i",5
"n",5,"ActivationSteepenedSigmoid","i",6
"n",6,"ActivationSteepenedSigmoid","i",7
"n",8,"ActivationSteepenedSigmoid","o",8
"n",9,"ActivationSteepenedSigmoid","o",9
"l",-1,1,7,8,0.5276612897,10
"l",-1,1,7,9,0.0876877026,11
"l",-1,1,0,8,-0.9,12
"l",-1,1,1,9,-0.5544698813,13
"l",-1,1,1,8,0.655749817,14
"l",-1,1,2,9,0.9,15
"l",-1,1,3,8,0.9,16
"l",-1,1,2,9,0.4806010209,17
"l",-1,1,3,8,-0.5688201393,18
"l",-1,1,3,9,0.8695255394,19
"l",-1,1,4,9,-0.4555601995,20
"l",-1,1,5,9,0.70854761,21
"l",-1,1,6,9,0.9,22
"l",-1,1,8,9,-0.3742178852,29
"s",0,-109091.6671230047,0
"g",-109091.6671230047,-109091.6671230047,4000
"n",7,"ActivationSteepenedSigmoid","b",0
"n",0,"ActivationSteepenedSigmoid","i",1
"n",1,"ActivationSteepenedSigmoid","i",2
"n",2,"ActivationSteepenedSigmoid","i",3
"n",3,"ActivationSteepenedSigmoid","i",4
"n",4,"ActivationSteepenedSigmoid","i",5
"n",5,"ActivationSteepenedSigmoid","i",6
"n",6,"ActivationSteepenedSigmoid","i",7
"n",8,"ActivationSteepenedSigmoid","o",8
"n",9,"ActivationSteepenedSigmoid","o",9
"l",-1,1,7,8,0.1841761608,10
"l",-1,1,7,9,0.8585398411,11
"l",-1,1,0,8,0.8876588297,12
"l",-1,1,1,9,-0.5738471289,13
"l",-1,1,1,8,0.9,14
"l",-1,1,2,9,-0.7026898107,15
"l",-1,1,3,8,-0.9,16
"l",-1,1,2,9,0.9,17
"l",-1,1,3,8,0.3159257874,18
"l",-1,1,3,9,-0.2406702644,19
"l",-1,1,4,9,0.7952555928,20
"l",-1,1,5,9,-0.4776962059,21
"l",-1,1,6,9,-0.9,22
"l",-1,1,8,9,0.0283648462,29
"s",0,-109671.8537573149,0
"g",-109671.8537573149,-109671.8537573149,4000
"n",7,"ActivationSteepenedSigmoid","b",0
"n",0,"ActivationSteepenedSigmoid","i",1
"n",1,"ActivationSteepenedSigmoid","i",2
"n",2,"ActivationSteepenedSigmoid","i",3
"n",3,"ActivationSteepenedSigmoid","i",4
"n",4,"ActivationSteepenedSigmoid","i",5
"n",5,"ActivationSteepenedSigmoid","i",6
"n",6,"ActivationSteepenedSigmoid","i",7
"n",8,"ActivationSteepenedSigmoid","o",8
"n",9,"ActivationSteepenedSigmoid","o",9
"l",-1,1,7,8,-0.3075077894,10
"l",-1,1,7,9,-0.9,11
"l",-1,1,0,8,-0.1500301519,12
"l",-1,1,1,9,0.4701352752,13
"l",-1,1,1,8,0.9,14
"l",-1,1,2,9,0.9,15
"l",-1,1,3,8,0.9,16
"l",-1,1,2,9,-0.5431467563,17
"l",-1,1,3,8,0.9,18
"l",-1,1,3,9,0.4352374457,19
"l",-1,1,4,9,0.468993983,20
"l",-1,1,5,9,0.6827078361,21
"l",-1,1,6,9,-0.9,22
"s",0,-110543.8928104106,0
"g",-110543.8928104106,-110543.8928104106,4000
"n",7,"ActivationSteepenedSigmoid","b",0
"n",0,"ActivationSteepenedSigmoid","i",1
"n",1,"ActivationSteepenedSigmoid","i",2
"n",2,"ActivationSteepenedSigmoid","i",3
"n",3,"ActivationSteepenedSigmoid","i",4
"n",4,"ActivationSteepenedSigmoid","i",5
"n",5,"ActivationSteepenedSigmoid","i",6
"n",6,"ActivationSteepenedSigmoid","i",7
"n",8,"ActivationSteepenedSigmoid","o",8
"n",9,"ActivationSteepenedSigmoid","o",9
"l",-1,1,7,8,-0.15884421,10
"l",-1,1,7,9,0.9,11
"l",-1,1,0,8,-0.1542851532,12
"l",-1,1,1,9,0.9,13
"l",-1,1,1,8,-0.2430289317,14
"l",-1,1,2,9,-0.5160063391,15
"l",-1,1,3,8,0.3106047795,16
"l",-1,1,2,9,-0.2307725508,17
"l",-1,1,3,8,-0.9,18
"l",-1,1,3,9,-0.1184563864,19
"l",-1,1,4,9,0.5779559015,20
"l",-1,1,5,9,-0.3089167996,21
"l",-1,1,6,9,-0.2166099491,22
"l",-1,1,9,8,0.9,30
"l",-1,1,5,8,-0.3085298715,46
"s",0,-111557.361317309,0
"g",-111557.361317309,-111557.361317309,4000
"n",7,"ActivationSteepenedSigmoid","b",0
"n",0,"ActivationSteepenedSigmoid","i",1
"n",1,"ActivationSteepenedSigmoid","i",2
"n",2,"ActivationSteepenedSigmoid","i",3
"n",3,"ActivationSteepenedSigmoid","i",4
"n",4,"ActivationSteepenedSigmoid","i",5
"n",5,"ActivationSteepenedSigmoid","i",6
"n",6,"ActivationSteepenedSigmoid","i",7
"n",8,"ActivationSteepenedSigmoid","o",8
"n",9,"ActivationSteepenedSigmoid","o",9
"l",-1,1,7,8,0.0252477711,10
"l",-1,1,7,9,0.2113032921,11
"l",-1,1,0,8,0.6611840293,12
"l",-1,1,1,9,-0.9,13
"l",-1,1,1,8,0.6081234731,14
"l",-1,1,2,9,-0.0998912727,15
"l",-1,1,3,8,0.7075569973,16
"l",-1,1,2,9,0.1592374975,17
"l",-1,1,3,8,-0.5829451316,18
"l",-1,1,3,9,-0.8672771288,19
"l",-1,1,4,9,0.9,20
"l",-1,1,5,9,0.8975662887,21
"l",-1,1,6,9,-0.9,22
"s",0,-111777.4497773041,0
"g",-111777.4497773041,-111777.4497773041,4000
"n",7,"ActivationSteepenedSigmoid","b",0
"n",0,"ActivationSteepenedSigmoid","i",1
"n",1,"ActivationSteepenedSigmoid","i",2
"n",2,"ActivationSteepenedSigmoid","i",3
"n",3,"ActivationSteepenedSigmoid","i",4
"n",4,"ActivationSteepenedSigmoid","i",5
"n",5,"ActivationSteepenedSigmoid","i",6
"n",6,"ActivationSteepenedSigmoid","i",7
"n",8,"ActivationSteepenedSigmoid","o",8
"n",9,"ActivationSteepenedSigmoid","o",9
"l",-1,1,7,8,0.3395757789,10
"l",-1,1,7,9,0.6782458177,11
"l",-1,1,0,8,-0.6754513233,12
"l",-1,1,1,9,-0.623783605,13
"l",-1,1,1,8,-0.0747105261,14
"l",-1,1,2,9,-0.5850411699,15
"l",-1,1,3,8,0.3655683443,16
"l",-1,1,2,9,0.5271279368,17
"l",-1,1,3,8,-0.9,18
"l",-1,1,3,9,0.9,19
"l",-1,1,4,9,-0.5445726637,20
"l",-1,1,5,9,-0.3275787286,21
"l",-1,1,6,9,0.4581840599,22
"s",0,-115169.4413383173,0
"g",-115169.4413383173,-115169.4413383173,4000
"n",7,"ActivationSteepenedSigmoid","b",0
"n",0,"ActivationSteepenedSigmoid","i",1
"n",1,"ActivationSteepenedSigmoid","i",2
"n",2,"ActivationSteepenedSigmoid","i",3
"n",3,"ActivationSteepenedSigmoid","i",4
"n",4,"ActivationSteepenedSigmoid","i",5
"n",5,"ActivationSteepenedSigmoid","i",6
"n",6,"ActivationSteepenedSigmoid","i",7
"n",8,"ActivationSteepenedSigmoid","o",8
"n",9,"ActivationSteepenedSigmoid","o",9
"l",-1,1,7,8,-0.3275680436,10
"l",-1,1,7,9,-0.2106717389,11
"l",-1,1,0,8,-0.5073260556,12
"l",-1,1,1,9,0.3998277704,13
"l",-1,1,1,8,0.7183522324,14
"l",-1,1,2,9,-0.2956490782,15
"l",-1,1,3,8,0.1227284577,16
"l",-1,1,2,9,0.9,17
"l",-1,1,3,8,0.9,18
"l",-1,1,3,9,-0.478322364,19
"l",-1,1,4,9,-0.2352462634,20
"l",-1,1,5,9,0.8691474245,21
"l",-1,1,6,9,-0.7564024204,22
"l",-1,1,9,9,0.745625334,50
"s",0,-118087.6834515365,0
"g",-118087.6834515365,-118087.6834515365,4000
"n",7,"ActivationSteepenedSigmoid","b",0
"n",0,"ActivationSteepenedSigmoid","i",1
"n",1,"ActivationSteepenedSigmoid","i",2
"n",2,"ActivationSteepenedSigmoid","i",3
"n",3,"ActivationSteepenedSigmoid","i",4
"n",4,"ActivationSteepenedSigmoid","i",5
"n",5,"ActivationSteepenedSigmoid","i",6
"n",6,"ActivationSteepenedSigmoid","i",7
"n",8,"ActivationSteepenedSigmoid","o",8
"n",9,"ActivationSteepenedSigmoid","o",9
"l",-1,1,7,8,0.9,10
"l",-1,1,7,9,0.9,11
"l",-1,1,0,8,0.9,12
"l",-1,1,1,9,-0.2493104223,13
"l",-1,1,1,8,0.5931442846,14
"l",-1,1,2,9,-0.9,15
"l",-1,1,3,8,0.6768576554,16
"l",-1,1,2,9,0.4454910969,17
"l",-1,1,3,8,-0.1469666077,18
"l",-1,1,3,9,-0.8859324961,19
"l",-1,1,4,9,-0.3675761999,20
"l",-1,1,5,9,-0.7439574004,21
"l",-1,1,6,9,0.9,22
"s",0,-118780.5408883638,0
"g",-118780.5408883638,-118780.5408883638,4000
"n",7,"ActivationSteepenedSigmoid","b",0
"n",0,"ActivationSteepenedSigmoid","i",1
"n",1,"ActivationSteepenedSigmoid","i",2
"n",2,"ActivationSteepenedSigmoid","i",3
"n",3,"ActivationSteepenedSigmoid","i",4
"n",4,"ActivationSteepenedSigmoid","i",5
"n",5,"ActivationSteepenedSigmoid","i",6
"n",6,"ActivationSteepenedSigmoid","i",7
"n",8,"ActivationSteepenedSigmoid","o",8
"n",9,"ActivationSteepenedSigmoid","o",9
"l",-1,1,7,8,-0.4916228051,10
"l",-1,1,7,9,-0.9,11
"l",-1,1,0,8,0.1838878135,12
"l",-1,1,1,9,-0.691898272,13
"l",-1,1,1,8,-0.1246569021,14
"l",-1,1,2,9,-0.7440107179,15
"l",-1,1,3,8,-0.9,16
"l",-1,1,2,9,-0.9,17
"l",-1,1,3,8,0.7664626472,18
"l",-1,1,3,9,0.9,19
"l",-1,1,4,9,0.6883447895,20
"l",-1,1,5,9,0.8784101476,21
"l",-1,1,6,9,-0.7775757377,22
"s",0,-122489.9248736172,0
"g",-122489.9248736172,-122489.9248736172,4000
"n",7,"ActivationSteepenedSigmoid","b",0
"n",0,"ActivationSteepenedSigmoid","i",1
"n",1,"ActivationSteepenedSigmoid","i",2
"n",2,"ActivationSteepenedSigmoid","i",3
"n",3,"ActivationSteepenedSigmoid","i",4
"n",4,"ActivationSteepenedSigmoid","i",5
"n",5,"ActivationSteepenedSigmoid","i",6
"n",6,"ActivationSteepenedSigmoid","i",7
"n",8,"ActivationSteepenedSigmoid","o",8
"n",9,"ActivationSteepenedSigmoid","o",9
"l",-1,1,7,8,-0.0020942803,10
"l",-1,1,7,9,0.6258545177,11
"l",-1,1,0,8,0.8136507816,12
"l",-1,1,1,9,-0.15303598,13
"l",-1,1,1,8,0.4666611233,14
"l",-1,1,2,9,0.5441190485,15
"l",-1,1,3,8,-0.5915449722,16
"l",-1,1,2,9,0.8438206504,17
"l",-1,1,3,8,0.8859896913,18
"l",-1,1,3,9,-0.9,19
"l",-1,1,4,9,0.3087148001,20
"l",-1,1,5,9,0.9,21
"l",-1,1,6,9,0.612950547,22
"s",0,-131509.3139421827,0
"g",-131509.3139421827,-131509.3139421827,4000
"n",7,"ActivationSteepenedSigmoid","b",0
"n",0,"ActivationSteepenedSigmoid","i",1
"n",1,"ActivationSteepenedSigmoid","i",2
"n",2,"ActivationSteepenedSigmoid","i",3
"n",3,"ActivationSteepenedSigmoid","i",4
"n",4,"ActivationSteepenedSigmoid","i",5
"n",5,"ActivationSteepenedSigmoid","i",6
"n",6,"ActivationSteepenedSigmoid","i",7
"n",8,"ActivationSteepenedSigmoid","o",8
"n",9,"ActivationSteepenedSigmoid","o",9
"l",-1,1,7,8,-0.9,10
"l",-1,1,7,9,-0.4654603456,11
"l",-1,1,0,8,-0.9,12
"l",-1,1,1,9,0.9,13
"l",-1,1,1,8,0.0426689821,14
"l",-1,1,2,9,0.9,15
"l",-1,1,3,8,-0.0662961746,16
"l",-1,1,2,9,0.2296919095,17
"l",-1,1,3,8,0.9,18
"l",-1,1,3,9,-0.8173664819,19
"l",-1,1,4,9,0.4652983313,20
"l",-1,1,5,9,0.5701843129,21
"l",-1,1,6,9,0.3013052351,22
"l",-1,1,8,9,-0.9,29
