{"footer": [
	{"name": "Seznam", "link": "https://www.seznam.cz"},
	{"name": "Google", "link": "https://www.google.com"},
	{"name": "Bing", "link": "https://www.bing.com"},        
	{"name": "Yahoo", "link": "https://www.yahoo.com"} 
]}