{
  "shell_port": 34459,
  "iopub_port": 39911,
  "stdin_port": 56353,
  "control_port": 39007,
  "hb_port": 57183,
  "ip": "127.0.0.1",
  "key": "15b8cc1a-570fe6f7791a184af56bea1a",
  "transport": "tcp",
  "signature_scheme": "hmac-sha256",
  "kernel_name": ""
}