"","Age","Time","Sick","Sex","Nausea","Vomiting","Abdominals","Fever","Diarrhae","Potato","Fish","Mayo","Courgette","Cheese","Icecream"
"1",9,22,"Sick_y","F","Nausea_y","Vomit_n","Abdo_y","Fever_y","Diarrhea_y","Potato_y","Fish_y","Mayo_y","Courg_y","Cheese_y","Icecream_y"
"2",5,0,"Sick_n","F","Nausea_n","Vomit_n","Abdo_n","Fever_n","Diarrhea_n","Potato_y","Fish_y","Mayo_y","Courg_y","Cheese_n","Icecream_y"
"3",6,16,"Sick_y","F","Nausea_n","Vomit_y","Abdo_y","Fever_y","Diarrhea_y","Potato_y","Fish_y","Mayo_y","Courg_y","Cheese_y","Icecream_y"
"4",9,0,"Sick_n","F","Nausea_n","Vomit_n","Abdo_n","Fever_n","Diarrhea_n","Potato_y","Fish_y","Mayo_n","Courg_y","Cheese_y","Icecream_y"
"5",7,14,"Sick_y","M","Nausea_n","Vomit_y","Abdo_y","Fever_y","Diarrhea_y","Potato_y","Fish_y","Mayo_y","Courg_y","Cheese_y","Icecream_y"
"6",72,9,"Sick_y","M","Nausea_n","Vomit_n","Abdo_y","Fever_y","Diarrhea_y","Potato_y","Fish_n","Mayo_y","Courg_y","Cheese_y","Icecream_y"
"7",5,16,"Sick_y","F","Nausea_n","Vomit_y","Abdo_y","Fever_y","Diarrhea_y","Potato_y","Fish_y","Mayo_y","Courg_y","Cheese_y","Icecream_y"
"8",10,8,"Sick_y","F","Nausea_y","Vomit_y","Abdo_y","Fever_y","Diarrhea_y","Potato_y","Fish_y","Mayo_y","Courg_y","Cheese_y","Icecream_y"
"9",5,20,"Sick_y","M","Nausea_y","Vomit_n","Abdo_y","Fever_y","Diarrhea_y","Potato_y","Fish_y","Mayo_y","Courg_y","Cheese_y","Icecream_y"
"10",11,12,"Sick_y","M","Nausea_n","Vomit_y","Abdo_n","Fever_y","Diarrhea_y","Potato_y","Fish_y","Mayo_y","Courg_y","Cheese_y","Icecream_y"
"11",7,17,"Sick_y","F","Nausea_y","Vomit_y","Abdo_y","Fever_y","Diarrhea_y","Potato_y","Fish_y","Mayo_y","Courg_y","Cheese_y","Icecream_y"
"12",10,16,"Sick_y","F","Nausea_n","Vomit_y","Abdo_y","Fever_n","Diarrhea_n","Potato_y","Fish_y","Mayo_y","Courg_y","Cheese_y","Icecream_y"
"13",36,19,"Sick_y","F","Nausea_n","Vomit_n","Abdo_y","Fever_y","Diarrhea_y","Potato_y","Fish_y","Mayo_y","Courg_y","Cheese_y","Icecream_y"
"14",9,0,"Sick_n","F","Nausea_n","Vomit_n","Abdo_n","Fever_n","Diarrhea_n","Potato_y","Fish_y","Mayo_n","Courg_y","Cheese_y","Icecream_y"
"15",8,0,"Sick_n","M","Nausea_n","Vomit_n","Abdo_n","Fever_n","Diarrhea_n","Potato_y","Fish_y","Mayo_n","Courg_y","Cheese_n","Icecream_y"
"16",6,6,"Sick_y","F","Nausea_n","Vomit_y","Abdo_y","Fever_y","Diarrhea_y","Potato_y","Fish_y","Mayo_y","Courg_y","Cheese_y","Icecream_y"
"17",7,10,"Sick_y","M","Nausea_n","Vomit_y","Abdo_y","Fever_y","Diarrhea_y","Potato_y","Fish_y","Mayo_y","Courg_y","Cheese_n","Icecream_y"
"18",5,15,"Sick_y","M","Nausea_y","Vomit_y","Abdo_y","Fever_y","Diarrhea_y","Potato_y","Fish_y","Mayo_y","Courg_y","Cheese_y","Icecream_y"
"19",11,14,"Sick_y","F","Nausea_n","Vomit_y","Abdo_y","Fever_y","Diarrhea_y","Potato_y","Fish_y","Mayo_y","Courg_y","Cheese_y","Icecream_y"
"20",11,0,"Sick_n","F","Nausea_n","Vomit_n","Abdo_n","Fever_n","Diarrhea_n","Potato_y","Fish_y","Mayo_n","Courg_y","Cheese_y","Icecream_y"
"21",10,18,"Sick_y","M","Nausea_n","Vomit_n","Abdo_y","Fever_y","Diarrhea_y","Potato_y","Fish_y","Mayo_y","Courg_y","Cheese_y","Icecream_y"
"22",8,14,"Sick_y","F","Nausea_n","Vomit_n","Abdo_y","Fever_y","Diarrhea_y","Potato_y","Fish_y","Mayo_y","Courg_y","Cheese_y","Icecream_n"
"23",8,21,"Sick_y","F","Nausea_n","Vomit_y","Abdo_y","Fever_y","Diarrhea_y","Potato_y","Fish_y","Mayo_y","Courg_n","Cheese_y","Icecream_y"
"24",11,13,"Sick_y","M","Nausea_n","Vomit_y","Abdo_y","Fever_n","Diarrhea_y","Potato_y","Fish_y","Mayo_y","Courg_y","Cheese_y","Icecream_y"
"25",45,10,"Sick_y","F","Nausea_n","Vomit_n","Abdo_y","Fever_y","Diarrhea_y","Potato_y","Fish_y","Mayo_y","Courg_y","Cheese_n","Icecream_y"
"26",9,0,"Sick_n","M","Nausea_n","Vomit_n","Abdo_n","Fever_n","Diarrhea_n","Potato_y","Fish_y","Mayo_y","Courg_y","Cheese_y","Icecream_y"
"27",5,12,"Sick_y","F","Nausea_n","Vomit_y","Abdo_y","Fever_y","Diarrhea_n","Potato_y","Fish_y","Mayo_y","Courg_y","Cheese_y","Icecream_y"
"28",85,9,"Sick_y","M","Nausea_n","Vomit_y","Abdo_y","Fever_y","Diarrhea_y","Potato_y","Fish_y","Mayo_n","Courg_n","Cheese_y","Icecream_y"
"29",88,0,"Sick_n","F","Nausea_n","Vomit_n","Abdo_n","Fever_n","Diarrhea_n","Potato_y","Fish_y","Mayo_y","Courg_y","Cheese_y","Icecream_y"
"30",79,17,"Sick_y","F","Nausea_y","Vomit_y","Abdo_y","Fever_y","Diarrhea_y","Potato_y","Fish_y","Mayo_y","Courg_y","Cheese_y","Icecream_y"
"31",9,9,"Sick_y","F","Nausea_n","Vomit_n","Abdo_y","Fever_y","Diarrhea_y","Potato_y","Fish_y","Mayo_n","Courg_y","Cheese_y","Icecream_y"
"32",6,0,"Sick_n","M","Nausea_n","Vomit_n","Abdo_n","Fever_n","Diarrhea_n","Potato_y","Fish_y","Mayo_n","Courg_y","Cheese_n","Icecream_y"
"33",8,0,"Sick_n","F","Nausea_n","Vomit_n","Abdo_n","Fever_n","Diarrhea_n","Potato_y","Fish_y","Mayo_y","Courg_y","Cheese_y","Icecream_y"
"34",8,0,"Sick_n","M","Nausea_n","Vomit_n","Abdo_n","Fever_n","Diarrhea_n","Potato_y","Fish_y","Mayo_y","Courg_y","Cheese_y","Icecream_y"
"35",7,15,"Sick_y","F","Nausea_y","Vomit_n","Abdo_y","Fever_y","Diarrhea_y","Potato_n","Fish_y","Mayo_y","Courg_y","Cheese_y","Icecream_y"
"36",9,19,"Sick_y","M","Nausea_y","Vomit_y","Abdo_y","Fever_y","Diarrhea_y","Potato_y","Fish_y","Mayo_y","Courg_y","Cheese_y","Icecream_y"
"37",9,11,"Sick_y","M","Nausea_y","Vomit_n","Abdo_y","Fever_n","Diarrhea_y","Potato_n","Fish_y","Mayo_y","Courg_y","Cheese_y","Icecream_y"
"38",6,0,"Sick_n","F","Nausea_n","Vomit_n","Abdo_n","Fever_n","Diarrhea_n","Potato_y","Fish_y","Mayo_y","Courg_n","Cheese_n","Icecream_y"
"39",5,17,"Sick_y","M","Nausea_n","Vomit_n","Abdo_y","Fever_y","Diarrhea_y","Potato_n","Fish_y","Mayo_y","Courg_y","Cheese_y","Icecream_y"
"40",6,16,"Sick_y","M","Nausea_y","Vomit_y","Abdo_y","Fever_y","Diarrhea_y","Potato_y","Fish_y","Mayo_y","Courg_y","Cheese_y","Icecream_y"
"41",4,12,"Sick_y","M","Nausea_y","Vomit_n","Abdo_y","Fever_y","Diarrhea_y","Potato_y","Fish_y","Mayo_y","Courg_y","Cheese_y","Icecream_y"
"42",7,0,"Sick_n","M","Nausea_n","Vomit_n","Abdo_n","Fever_n","Diarrhea_n","Potato_y","Fish_y","Mayo_y","Courg_y","Cheese_y","Icecream_y"
"43",82,20,"Sick_y","F","Nausea_n","Vomit_n","Abdo_y","Fever_y","Diarrhea_y","Potato_y","Fish_y","Mayo_y","Courg_y","Cheese_y","Icecream_y"
"44",5,4,"Sick_y","F","Nausea_y","Vomit_y","Abdo_y","Fever_y","Diarrhea_y","Potato_y","Fish_y","Mayo_y","Courg_n","Cheese_y","Icecream_n"
"45",5,20,"Sick_y","M","Nausea_n","Vomit_y","Abdo_y","Fever_y","Diarrhea_y","Potato_y","Fish_y","Mayo_y","Courg_n","Cheese_y","Icecream_y"
"46",6,16,"Sick_y","M","Nausea_n","Vomit_n","Abdo_y","Fever_y","Diarrhea_y","Potato_y","Fish_y","Mayo_y","Courg_y","Cheese_y","Icecream_y"
"47",10,0,"Sick_n","M","Nausea_n","Vomit_n","Abdo_n","Fever_n","Diarrhea_n","Potato_y","Fish_y","Mayo_n","Courg_y","Cheese_y","Icecream_n"
"48",83,0,"Sick_n","M","Nausea_n","Vomit_n","Abdo_n","Fever_n","Diarrhea_n","Potato_y","Fish_y","Mayo_y","Courg_y","Cheese_y","Icecream_y"
"49",8,0,"Sick_n","F","Nausea_n","Vomit_n","Abdo_n","Fever_n","Diarrhea_n","Potato_y","Fish_y","Mayo_y","Courg_y","Cheese_y","Icecream_y"
"50",7,22,"Sick_y","F","Nausea_n","Vomit_n","Abdo_y","Fever_y","Diarrhea_y","Potato_y","Fish_y","Mayo_y","Courg_y","Cheese_y","Icecream_y"
"51",10,0,"Sick_n","M","Nausea_n","Vomit_n","Abdo_n","Fever_n","Diarrhea_n","Potato_y","Fish_y","Mayo_n","Courg_y","Cheese_y","Icecream_y"
"52",11,17,"Sick_y","M","Nausea_n","Vomit_n","Abdo_y","Fever_y","Diarrhea_y","Potato_y","Fish_y","Mayo_y","Courg_y","Cheese_y","Icecream_y"
"53",6,0,"Sick_n","F","Nausea_n","Vomit_n","Abdo_n","Fever_n","Diarrhea_n","Potato_y","Fish_y","Mayo_n","Courg_y","Cheese_n","Icecream_n"
"54",10,19,"Sick_y","M","Nausea_n","Vomit_y","Abdo_y","Fever_y","Diarrhea_n","Potato_y","Fish_y","Mayo_y","Courg_y","Cheese_y","Icecream_y"
"55",7,14,"Sick_y","M","Nausea_n","Vomit_y","Abdo_y","Fever_y","Diarrhea_y","Potato_y","Fish_y","Mayo_y","Courg_y","Cheese_y","Icecream_y"
