%YAML 1.1
%TAG !u! tag:unity3d.com,2011:
--- !u!1045 &1
EditorBuildSettings:
  m_ObjectHideFlags: 0
  serializedVersion: 2
  m_Scenes:
  - enabled: 0
    path: Assets/Scenes/SampleScene.unity
    guid: 99c9720ab356a0642a771bea13969a05
  - enabled: 0
    path: Assets/Scenes/SubwayLOD.unity
    guid: 9ddaf8708fc88ff4099aeea98854feb5
  - enabled: 0
    path: Assets/Scenes/SubwayRoom4.unity
    guid: 0b53ca07d9fbe5f45b9a655d692e6ab2
  - enabled: 0
    path: Assets/Scenes/SubwayRoom5.unity
    guid: caa73fd960d4b6440a35d3b135feeb2d
  - enabled: 1
    path: Assets/Scenes/SubwayLOD3.unity
    guid: cce1cb469a5497f4889680666cb3b750
  m_configObjects: {}
