{"frames": {

"arcade.png":
{
	"frame": {"x":3,"y":3,"w":1017,"h":1155},
	"rotated": false,
	"trimmed": true,
	"spriteSourceSize": {"x":1,"y":1,"w":1017,"h":1155},
	"sourceSize": {"w":1024,"h":1157},
	"pivot": {"x":0.5,"y":0.5}
},
"buttons/button_jump.png":
{
	"frame": {"x":425,"y":1646,"w":200,"h":200},
	"rotated": false,
	"trimmed": false,
	"spriteSourceSize": {"x":0,"y":0,"w":200,"h":200},
	"sourceSize": {"w":200,"h":200},
	"pivot": {"x":0.5,"y":0.5}
},
"buttons/button_move.png":
{
	"frame": {"x":629,"y":1646,"w":200,"h":200},
	"rotated": false,
	"trimmed": false,
	"spriteSourceSize": {"x":0,"y":0,"w":200,"h":200},
	"sourceSize": {"w":200,"h":200},
	"pivot": {"x":0.5,"y":0.5}
},
"buttons/button_pause.png":
{
	"frame": {"x":859,"y":1295,"w":150,"h":150},
	"rotated": false,
	"trimmed": false,
	"spriteSourceSize": {"x":0,"y":0,"w":150,"h":150},
	"sourceSize": {"w":150,"h":150},
	"pivot": {"x":0.5,"y":0.5}
},
"buttons/button_shoot.png":
{
	"frame": {"x":833,"y":1646,"w":200,"h":200},
	"rotated": false,
	"trimmed": false,
	"spriteSourceSize": {"x":0,"y":0,"w":200,"h":200},
	"sourceSize": {"w":200,"h":200},
	"pivot": {"x":0.5,"y":0.5}
},
"icons/shield.png":
{
	"frame": {"x":859,"y":1449,"w":85,"h":100},
	"rotated": false,
	"trimmed": false,
	"spriteSourceSize": {"x":0,"y":0,"w":85,"h":100},
	"sourceSize": {"w":85,"h":100},
	"pivot": {"x":0.5,"y":0.5}
},
"icons/speed.png":
{
	"frame": {"x":859,"y":1162,"w":158,"h":129},
	"rotated": false,
	"trimmed": false,
	"spriteSourceSize": {"x":0,"y":0,"w":158,"h":129},
	"sourceSize": {"w":158,"h":129},
	"pivot": {"x":0.5,"y":0.5}
},
"splashScreen.jpg":
{
	"frame": {"x":3,"y":1162,"w":852,"h":480},
	"rotated": false,
	"trimmed": false,
	"spriteSourceSize": {"x":0,"y":0,"w":852,"h":480},
	"sourceSize": {"w":852,"h":480},
	"pivot": {"x":0.5,"y":0.5}
},
"splashscreen_old.png":
{
	"frame": {"x":3,"y":1646,"w":418,"h":221},
	"rotated": false,
	"trimmed": true,
	"spriteSourceSize": {"x":18,"y":9,"w":418,"h":221},
	"sourceSize": {"w":450,"h":250},
	"pivot": {"x":0.5,"y":0.5}
}},
"meta": {
	"app": "http://www.codeandweb.com/texturepacker",
	"version": "1.0",
	"image": "game-0.png",
	"format": "RGBA8888",
	"size": {"w":1036,"h":1870},
	"scale": "1",
	"smartupdate": "$TexturePacker:SmartUpdate:96e6ebab216288050e7796d0964ab4ca:40faaabaf33778370fe5d9e2a295b658:38199ca19f82add9c84e07ddaa08f6e1$"
}
}
