%YAML 1.1
%TAG !u! tag:unity3d.com,2011:
--- !u!114 &11400000
MonoBehaviour:
  m_ObjectHideFlags: 0
  m_CorrespondingSourceObject: {fileID: 0}
  m_PrefabInstance: {fileID: 0}
  m_PrefabAsset: {fileID: 0}
  m_GameObject: {fileID: 0}
  m_Enabled: 1
  m_EditorHideFlags: 0
  m_Script: {fileID: 11500000, guid: 10b12dcfb7c2e1643b238742932dc733, type: 3}
  m_Name: Gun
  m_EditorClassIdentifier: 
  lootSprite: {fileID: 21300000, guid: 2828ab74a98aad64b869c52928857d02, type: 3}
  lootName: Gun
  dropChance: 33
