%YAML 1.1
%TAG !u! tag:unity3d.com,2011:
--- !u!1045 &1
EditorBuildSettings:
  m_ObjectHideFlags: 0
  serializedVersion: 2
  m_Scenes:
  - enabled: 1
    path: Assets/Scenes/StarGame.unity
    guid: 0e580c2077a7ade4d94c85eb525936f2
  - enabled: 1
    path: Assets/Scenes/Mode1.unity
    guid: 2cda990e2423bbf4892e6590ba056729
  - enabled: 1
    path: Assets/Scenes/Mode2.unity
    guid: 20a308a9bd2803c4b9b7e02fcb0430e3
  - enabled: 1
    path: Assets/Scenes/Lost.unity
    guid: 5aa8c1d04c3a0da4d9b16431e9974c1f
  - enabled: 1
    path: Assets/Scenes/Win.unity
    guid: e996380d7374afe478c334e674c5e5ce
  m_configObjects: {}
