{
    "server": {
        "logs": {
            "logFile": "/logs/monitor.log",
            "errFile": "/logs/monitor_err.log",
            "serverLogFile": "/logs/server.log",
            "serverErrFile": "/logs/server_err.log"
        },
        "pids": {
            "server": "/pids/server.pid"
        },
        "key": ""
    }
}