^C:\USERS\LUCAS\SOURCE\REPOS\RAYLIBTEST\RAYLIBTEST\DEBUG\PONGGAME.OBJ
/OUT:"C:\USERS\LUCAS\SOURCE\REPOS\RAYLIBTEST\DEBUG\RAYLIBTEST.EXE" /INCREMENTAL /NOLOGO /LIBPATH:C:\USERS\LUCAS\SOURCE\REPOS\RAYLIBTEST\RAYLIB\LIB RAYLIB.LIB KERNEL32.LIB USER32.LIB GDI32.LIB WINSPOOL.LIB COMDLG32.LIB ADVAPI32.LIB SHELL32.LIB OLE32.LIB OLEAUT32.LIB UUID.LIB ODBC32.LIB ODBCCP32.LIB /MANIFEST /MANIFESTUAC:"level='asInvoker' uiAccess='false'" /manifest:embed /DEBUG:FASTLINK /PDB:"C:\USERS\LUCAS\SOURCE\REPOS\RAYLIBTEST\DEBUG\RAYLIBTEST.PDB" /SUBSYSTEM:CONSOLE /TLBID:1 /DYNAMICBASE /NXCOMPAT /IMPLIB:"C:\USERS\LUCAS\SOURCE\REPOS\RAYLIBTEST\DEBUG\RAYLIBTEST.LIB" /MACHINE:X86 DEBUG\PONGGAME.OBJ
^C:\USERS\LUCAS\SOURCE\REPOS\RAYLIBTEST\RAYLIBTEST\DEBUG\MAINMENU.OBJ|C:\USERS\LUCAS\SOURCE\REPOS\RAYLIBTEST\RAYLIBTEST\DEBUG\PONGGAME.OBJ
/OUT:"C:\USERS\LUCAS\SOURCE\REPOS\RAYLIBTEST\DEBUG\RAYLIBTEST.EXE" /INCREMENTAL /NOLOGO /LIBPATH:C:\USERS\LUCAS\SOURCE\REPOS\RAYLIBTEST\RAYLIB\LIB RAYLIB.LIB KERNEL32.LIB USER32.LIB GDI32.LIB WINSPOOL.LIB COMDLG32.LIB ADVAPI32.LIB SHELL32.LIB OLE32.LIB OLEAUT32.LIB UUID.LIB ODBC32.LIB ODBCCP32.LIB /MANIFEST /MANIFESTUAC:"level='asInvoker' uiAccess='false'" /manifest:embed /DEBUG:FASTLINK /PDB:"C:\USERS\LUCAS\SOURCE\REPOS\RAYLIBTEST\DEBUG\RAYLIBTEST.PDB" /SUBSYSTEM:CONSOLE /TLBID:1 /DYNAMICBASE /NXCOMPAT /IMPLIB:"C:\USERS\LUCAS\SOURCE\REPOS\RAYLIBTEST\DEBUG\RAYLIBTEST.LIB" /MACHINE:X86 DEBUG\MAINMENU.OBJ
DEBUG\PONGGAME.OBJ
^C:\USERS\LUCAS\ONEDRIVE\ESCRITORIO\JUEGO\RAYLIBTEST\DEBUG\MAINMENU.OBJ|C:\USERS\LUCAS\ONEDRIVE\ESCRITORIO\JUEGO\RAYLIBTEST\DEBUG\PONGGAME.OBJ|C:\USERS\LUCAS\ONEDRIVE\ESCRITORIO\JUEGO\RAYLIBTEST\DEBUG\SONIDO.OBJ
/OUT:"C:\USERS\LUCAS\ONEDRIVE\ESCRITORIO\JUEGO\DEBUG\RAYLIBTEST.EXE" /INCREMENTAL /NOLOGO /LIBPATH:C:\USERS\LUCAS\ONEDRIVE\ESCRITORIO\JUEGO\RAYLIB\LIB RAYLIB.LIB KERNEL32.LIB USER32.LIB GDI32.LIB WINSPOOL.LIB COMDLG32.LIB ADVAPI32.LIB SHELL32.LIB OLE32.LIB OLEAUT32.LIB UUID.LIB ODBC32.LIB ODBCCP32.LIB /MANIFEST /MANIFESTUAC:"level='asInvoker' uiAccess='false'" /manifest:embed /DEBUG:FASTLINK /PDB:"C:\USERS\LUCAS\ONEDRIVE\ESCRITORIO\JUEGO\DEBUG\RAYLIBTEST.PDB" /SUBSYSTEM:CONSOLE /TLBID:1 /DYNAMICBASE /NXCOMPAT /IMPLIB:"C:\USERS\LUCAS\ONEDRIVE\ESCRITORIO\JUEGO\DEBUG\RAYLIBTEST.LIB" /MACHINE:X86 DEBUG\MAINMENU.OBJ
DEBUG\PONGGAME.OBJ
DEBUG\SONIDO.OBJ
^C:\USERS\LUCAS\ONEDRIVE\DOCUMENTOS\GITHUB\DSVJ1_2020_PONG\RAYLIBTEST\DEBUG\ITEM.OBJ|C:\USERS\LUCAS\ONEDRIVE\DOCUMENTOS\GITHUB\DSVJ1_2020_PONG\RAYLIBTEST\DEBUG\MAIN.OBJ|C:\USERS\LUCAS\ONEDRIVE\DOCUMENTOS\GITHUB\DSVJ1_2020_PONG\RAYLIBTEST\DEBUG\MENUPRINCIPAL.OBJ|C:\USERS\LUCAS\ONEDRIVE\DOCUMENTOS\GITHUB\DSVJ1_2020_PONG\RAYLIBTEST\DEBUG\PELOTA.OBJ|C:\USERS\LUCAS\ONEDRIVE\DOCUMENTOS\GITHUB\DSVJ1_2020_PONG\RAYLIBTEST\DEBUG\PLAYER.OBJ|C:\USERS\LUCAS\ONEDRIVE\DOCUMENTOS\GITHUB\DSVJ1_2020_PONG\RAYLIBTEST\DEBUG\PONGGAME.OBJ|C:\USERS\LUCAS\ONEDRIVE\DOCUMENTOS\GITHUB\DSVJ1_2020_PONG\RAYLIBTEST\DEBUG\SONIDO.OBJ
/OUT:"C:\USERS\LUCAS\ONEDRIVE\DOCUMENTOS\GITHUB\DSVJ1_2020_PONG\\BIN\DEBUG\RAYLIBTEST.EXE" /INCREMENTAL /NOLOGO /LIBPATH:C:\USERS\LUCAS\ONEDRIVE\DOCUMENTOS\GITHUB\DSVJ1_2020_PONG\RAYLIB\LIB RAYLIB.LIB KERNEL32.LIB USER32.LIB GDI32.LIB WINSPOOL.LIB COMDLG32.LIB ADVAPI32.LIB SHELL32.LIB OLE32.LIB OLEAUT32.LIB UUID.LIB ODBC32.LIB ODBCCP32.LIB /MANIFEST /MANIFESTUAC:"level='asInvoker' uiAccess='false'" /manifest:embed /DEBUG:FASTLINK /PDB:"C:\USERS\LUCAS\ONEDRIVE\DOCUMENTOS\GITHUB\DSVJ1_2020_PONG\\BIN\DEBUG\RAYLIBTEST.PDB" /SUBSYSTEM:CONSOLE /TLBID:1 /DYNAMICBASE /NXCOMPAT /IMPLIB:"C:\USERS\LUCAS\ONEDRIVE\DOCUMENTOS\GITHUB\DSVJ1_2020_PONG\\BIN\DEBUG\RAYLIBTEST.LIB" /MACHINE:X86 DEBUG\ITEM.OBJ
DEBUG\MAIN.OBJ
DEBUG\MENUPRINCIPAL.OBJ
DEBUG\PELOTA.OBJ
DEBUG\PLAYER.OBJ
DEBUG\PONGGAME.OBJ
DEBUG\SONIDO.OBJ
