^C:\USERS\LUCAS\ONEDRIVE\DOCUMENTOS\GITHUB\DSVJ1_2020_BREAKOUT\SRC\MAIN.CPP
C:\USERS\LUCAS\ONEDRIVE\DOCUMENTOS\GITHUB\DSVJ1_2020_BREAKOUT\OBJ\X64\DEBUG\VC142.PDB
C:\USERS\LUCAS\ONEDRIVE\DOCUMENTOS\GITHUB\DSVJ1_2020_BREAKOUT\OBJ\X64\DEBUG\VC142.IDB
C:\USERS\LUCAS\ONEDRIVE\DOCUMENTOS\GITHUB\DSVJ1_2020_BREAKOUT\OBJ\X64\DEBUG\MAIN.OBJ
