%YAML 1.1
%TAG !u! tag:unity3d.com,2011:
--- !u!1045 &1
EditorBuildSettings:
  m_ObjectHideFlags: 0
  serializedVersion: 2
  m_Scenes:
  - enabled: 1
    path: Assets/_Scenes/LauncherRhum.unity
    guid: 60f0f0e9b19afbb46a081e91f9b3ba13
  - enabled: 1
    path: Assets/_Scenes/Playroom.unity
    guid: 2cda990e2423bbf4892e6590ba056729
  m_configObjects: {}
