{
  "categories": [
    {
      "title": "História dos FastFoods",
      "link": "https://www.youtube.com/watch?v=FpKsaJxI__U",
      "color": "#FFF",
      "extraLink": {
        "text": "",
        "url": "https://www.alura.com.br/cursos-online-front-end"
      },
      "videos": [
        {
          "title": "TOP 6: MELHORES FAST FOODS DOS ESTADOS UNIDOS QUE VOCÊ PRECISA PROVAR",
          "url": "https://www.youtube.com/watch?v=FpKsaJxI__U"
        },
        {
          "title": "SEO com React",
          "url": "https://www.youtube.com/watch?v=C3moesGWeUY"
        },
        {
          "title": "Componentização com VanillaJS #AluraMais",
          "url": "https://www.youtube.com/watch?v=ZXpQMbVQ31A"
        },
        {
          "title": "Pare de chutar e aprenda a display: inline #01",
          "url": "https://www.youtube.com/watch?v=fUYeTDAaJzQ"
        },
        {
          "title": "Template String: Interpolando strings com JavaScript #AluraMais",
          "url": "https://www.youtube.com/watch?v=qwpO1XjIpFI"
        },
        {
          "title": "Qual é a melhor linguagem de programação? #HipstersPontoTube",
          "url": "https://www.youtube.com/watch?v=nX2Ya0q-7-U"
        } 
      ]
    },
    {
      "title": "Back End",
      "color": "#FFF",
      "extraLink": {
        "text": "Cursos de Back End na Alura",
        "url": "https://www.alura.com.br/cursos-online-programacao"
      },
      "videos": [
        {
          "title": "PERCURSO em NÍVEL em ÁRVORE BINÁRIA | Estruturas de Dados #14",
          "url": "https://www.youtube.com/watch?v=UOK7nS2E9xM"
        },
        {
          "title": "Coders4Tips - S01E04: GitHub CLI - Uma Nova Experiência no Github!",
          "url": "https://www.youtube.com/watch?v=6o6-bKOZOEY"
        },
        {
          "title": "Programei 4 robôs que criam vídeos para mim no YouTube",
          "url": "https://www.youtube.com/watch?v=kjhu1LEmRpY"
        },
        {
          "title": "API: Dicionário do Programador",
          "url": "https://www.youtube.com/watch?v=vGuqKIRWosk"
        },
        {
          "title": "Usando Git Direito",
          "url": "https://www.youtube.com/watch?v=6OokP-NE49k"
        }
      ]
    },
    {
      "title": "Data Science e Inteligência Artificial",
      "color": "#FFF",
      "extraLink": {
        "text": "Cursos de Data Science na Alura",
        "url": "https://www.alura.com.br/formacao-data-science"
      },
      "videos": [
        {
          "title": "Teste de Turing",
          "url": "https://www.youtube.com/watch?v=BaPGU4JWa34"
        },
        {
          "title": "O que é Data Science?",
          "url": "https://www.youtube.com/watch?v=5b9Z8toVaAU&t=9s"
        },
        {
          "title": "Melhor forma de aprender Python",
          "url": "https://www.youtube.com/watch?v=Gojqw9BQ5qY"
        },
        {
          "title": "Como ingressar no mercado de Data Science?",
          "url": "https://www.youtube.com/watch?v=gxyjGmOV540"
        }
      ]
    },
    {
      "title": "Filmes",
      "color": "#FFF",
      "videos": [
        {
          "title": "Interestellar",
          "url": "https://www.youtube.com/watch?v=frD_IiY_A3E"
        },
        {
          "title": "Gattaca",
          "url": "https://www.youtube.com/watch?v=Dl0tYLbrhhs"
        },
        {
          "title": "A Chegada",
          "url": "https://www.youtube.com/watch?v=rNciXGzYZms"
        },
        {
          "title": "Feitiço do Tempo",
          "url": "https://www.youtube.com/watch?v=zi8d69P9NvI"
        }
      ]
    },
    {
      "title": "Games",
      "color": "#FFF",
      "extraLink": {
        "text": "Formação de Jogos na Alura",
        "url": "https://www.alura.com.br/formacao-jogos-unity"
      },
      "videos": [
        {
          "title": "Final Fantasy 7",
          "url": "https://www.youtube.com/watch?v=I_ATSCTnUD8"
        },
        {
          "title": "Assassins Creed Valhalla",
          "url": "https://www.youtube.com/watch?v=KDfdjB9uL0U"
        },
        {
          "title": "God of War 4",
          "url": "https://www.youtube.com/watch?v=FyIwEFXOcaE"
        },
        {
          "title": "Resident Evil 8",
          "url": "https://www.youtube.com/watch?v=JSapXD9vxYA"
        },
        {
          "title": "Pokémon Let's Go Pikachu/Eevee",
          "url": "https://www.youtube.com/watch?v=L56q_k2ydrs"
        }
      ]
    },
    {
      "title": "Aprendendo a aprender tecnologia",
      "color": "#FFF",
      "extraLink": {
        "text": "Curso sobre aprendizado na Alura",
        "url": "https://alura.com.br/curso-online-aprender-a-aprender-tecnicas-para-seu-autodesenvolvimento"
      },
      "videos": [
        {
          "title": "Como estudar melhor?",
          "url": "https://www.youtube.com/watch?v=Is6c9KSGCbk&feature=youtu.be"
        },
        {
          "title": "Faculdade",
          "url": "https://www.youtube.com/watch?v=jw06H8esyzQ&feature=youtu.be"
        },
        {
          "title": "Frameworks",
          "url": "https://www.youtube.com/watch?v=QzDjdlF1BQI"
        },
        {
          "title": "A mágica do Aprendizado",
          "url": "https://www.youtube.com/watch?v=oTEXzpfEpPY"
        },
        {
          "title": "Como aprender a programar?",
          "url": "https://www.youtube.com/watch?v=MwCx2qKdbDw&feature=youtu.be"
        }
      ]
    }
  ]
}
