verifToken,stimuli_id,source_id,media_a_id,source_a,created_at,source_name_vote,reversed,source_position_vote,bl,bd,nb_replay
a04glgdc,1090,5570,44540,diss_car13.mp4,1648027399,1,,1,8,180,1
a04glgdc,1099,5560,44530,diss_StreetBasketball1.mp4,1648027438,1,,1,8,180,2
a04glgdc,1081,5553,44523,diss_Basketball.mp4,1648027449,1,,1,8,180,1
a04glgdc,1095,5557,44527,diss_ManRunning2.mp4,1648027462,1,,1,8,180,1
a04glgdc,1089,5569,44539,diss_car12.mp4,1648027482,1,,1,8,180,1
a04glgdc,1085,5565,44535,diss_building2.mp4,1648027499,1,,1,8,180,2
a04glgdc,1093,5555,44525,diss_Girl2.mp4,1648027514,1,,1,8,180,1
a04glgdc,1087,5567,44537,diss_building4.mp4,1648027527,1,,1,8,180,1
a04glgdc,1091,5571,44541,diss_car15.mp4,1648027553,1,,1,8,180,2
a04glgdc,1084,5564,44534,diss_building1.mp4,1648027573,1,,1,8,180,1
a04glgdc,1101,5574,44544,diss_truck3.mp4,1648027598,1,,1,8,180,1
a04glgdc,1102,5561,44531,diss_Walking.mp4,1648027620,1,,1,8,180,1
a04glgdc,1088,5568,44538,diss_car11.mp4,1648027645,1,,1,8,180,1
a04glgdc,1086,5566,44536,diss_building3.mp4,1648027670,1,,1,8,180,1
a04glgdc,1097,5558,44528,diss_Soccer1.mp4,1648027694,1,,1,8,180,1
a04glgdc,1100,5573,44543,diss_truck2.mp4,1648027725,1,,1,8,180,1
a04glgdc,1094,5556,44526,diss_ManRunning1.mp4,1648027761,1,,1,8,180,1
a04glgdc,1083,5563,44533,diss_bike3.mp4,1648027781,1,,1,8,180,1
a04glgdc,1098,5559,44529,diss_Soccer2.mp4,1648027799,1,,1,8,180,1
a04glgdc,1082,5562,44532,diss_bike2.mp4,1648027822,1,,1,8,180,2
a04glgdc,1092,5554,44524,diss_Girl1.mp4,1648027843,1,,1,8,180,1
a04glgdc,1096,5572,44542,diss_person22.mp4,1648027862,1,,1,8,180,1
