timestamp,stimuli_id,mouseX,mouseY,stimuli
0,1069,645,357,diss_bike2.mp4
16,1069,648,353,diss_bike2.mp4
31,1069,658,348,diss_bike2.mp4
54,1069,675,336,diss_bike2.mp4
70,1069,689,330,diss_bike2.mp4
86,1069,704,324,diss_bike2.mp4
104,1069,720,317,diss_bike2.mp4
118,1069,739,312,diss_bike2.mp4
138,1069,755,308,diss_bike2.mp4
152,1069,770,303,diss_bike2.mp4
169,1069,783,297,diss_bike2.mp4
185,1069,792,291,diss_bike2.mp4
202,1069,802,286,diss_bike2.mp4
216,1069,811,281,diss_bike2.mp4
232,1069,816,279,diss_bike2.mp4
256,1069,820,277,diss_bike2.mp4
460,1069,819,277,diss_bike2.mp4
484,1069,818,277,diss_bike2.mp4
559,1069,817,277,diss_bike2.mp4
666,1069,816,277,diss_bike2.mp4
675,1069,815,277,diss_bike2.mp4
697,1069,814,277,diss_bike2.mp4
713,1069,813,277,diss_bike2.mp4
737,1069,811,277,diss_bike2.mp4
878,1069,811,276,diss_bike2.mp4
894,1069,811,275,diss_bike2.mp4
904,1069,811,274,diss_bike2.mp4
925,1069,810,270,diss_bike2.mp4
941,1069,809,267,diss_bike2.mp4
958,1069,809,266,diss_bike2.mp4
964,1069,808,266,diss_bike2.mp4
986,1069,808,264,diss_bike2.mp4
993,1069,808,263,diss_bike2.mp4
1022,1069,807,261,diss_bike2.mp4
1085,1069,805,261,diss_bike2.mp4
1100,1069,804,261,diss_bike2.mp4
1122,1069,802,261,diss_bike2.mp4
1138,1069,800,261,diss_bike2.mp4
1154,1069,798,261,diss_bike2.mp4
1170,1069,794,261,diss_bike2.mp4
1186,1069,790,261,diss_bike2.mp4
1202,1069,783,261,diss_bike2.mp4
1218,1069,777,262,diss_bike2.mp4
1236,1069,772,264,diss_bike2.mp4
1252,1069,766,264,diss_bike2.mp4
1271,1069,763,265,diss_bike2.mp4
1286,1069,759,267,diss_bike2.mp4
1303,1069,755,268,diss_bike2.mp4
1316,1069,750,270,diss_bike2.mp4
1333,1069,744,272,diss_bike2.mp4
1350,1069,737,276,diss_bike2.mp4
1372,1069,725,282,diss_bike2.mp4
1388,1069,715,287,diss_bike2.mp4
1404,1069,701,298,diss_bike2.mp4
1420,1069,682,313,diss_bike2.mp4
1436,1069,661,332,diss_bike2.mp4
1452,1069,639,352,diss_bike2.mp4
1470,1069,621,369,diss_bike2.mp4
1485,1069,611,380,diss_bike2.mp4
1502,1069,606,385,diss_bike2.mp4
1516,1069,603,389,diss_bike2.mp4
1526,1069,603,390,diss_bike2.mp4
1828,1069,604,390,diss_bike2.mp4
1838,1069,606,390,diss_bike2.mp4
1862,1069,614,390,diss_bike2.mp4
1877,1069,618,389,diss_bike2.mp4
1885,1069,620,388,diss_bike2.mp4
1902,1069,622,388,diss_bike2.mp4
2574,1069,622,387,diss_bike2.mp4
2589,1069,610,380,diss_bike2.mp4
2605,1069,582,365,diss_bike2.mp4
2621,1069,551,348,diss_bike2.mp4
2638,1069,527,336,diss_bike2.mp4
2654,1069,505,321,diss_bike2.mp4
2671,1069,482,308,diss_bike2.mp4
2687,1069,461,292,diss_bike2.mp4
2702,1069,439,278,diss_bike2.mp4
2719,1069,420,262,diss_bike2.mp4
2735,1069,401,249,diss_bike2.mp4
2758,1069,382,238,diss_bike2.mp4
2774,1069,374,233,diss_bike2.mp4
2791,1069,366,228,diss_bike2.mp4
2807,1069,358,224,diss_bike2.mp4
2823,1069,349,217,diss_bike2.mp4
2839,1069,346,215,diss_bike2.mp4
2855,1069,345,213,diss_bike2.mp4
2872,1069,343,212,diss_bike2.mp4
2888,1069,341,211,diss_bike2.mp4
2904,1069,339,209,diss_bike2.mp4
2911,1069,338,207,diss_bike2.mp4
2929,1069,336,205,diss_bike2.mp4
2944,1069,336,204,diss_bike2.mp4
2970,1069,335,203,diss_bike2.mp4
2977,1069,335,202,diss_bike2.mp4
3162,1069,335,201,diss_bike2.mp4
3170,1069,335,200,diss_bike2.mp4
3195,1069,335,196,diss_bike2.mp4
3216,1069,336,189,diss_bike2.mp4
3235,1069,337,184,diss_bike2.mp4
3258,1069,337,180,diss_bike2.mp4
3274,1069,338,176,diss_bike2.mp4
3284,1069,338,175,diss_bike2.mp4
3299,1069,338,174,diss_bike2.mp4
3317,1069,338,173,diss_bike2.mp4
3343,1069,338,172,diss_bike2.mp4
3437,1069,338,171,diss_bike2.mp4
3485,1069,337,170,diss_bike2.mp4
3509,1069,328,167,diss_bike2.mp4
3527,1069,313,165,diss_bike2.mp4
3540,1069,289,164,diss_bike2.mp4
3557,1069,262,163,diss_bike2.mp4
3573,1069,233,163,diss_bike2.mp4
3597,1069,201,163,diss_bike2.mp4
3605,1069,192,164,diss_bike2.mp4
3620,1069,179,164,diss_bike2.mp4
3638,1069,164,164,diss_bike2.mp4
3653,1069,153,164,diss_bike2.mp4
3669,1069,146,164,diss_bike2.mp4
3692,1069,139,164,diss_bike2.mp4
3708,1069,135,164,diss_bike2.mp4
3724,1069,131,164,diss_bike2.mp4
3740,1069,125,164,diss_bike2.mp4
3758,1069,119,164,diss_bike2.mp4
3772,1069,115,164,diss_bike2.mp4
3791,1069,111,164,diss_bike2.mp4
3808,1069,108,164,diss_bike2.mp4
3823,1069,102,165,diss_bike2.mp4
3839,1069,96,165,diss_bike2.mp4
3855,1069,91,167,diss_bike2.mp4
3870,1069,88,170,diss_bike2.mp4
3897,1069,85,176,diss_bike2.mp4
3914,1069,85,182,diss_bike2.mp4
3920,1069,84,185,diss_bike2.mp4
3934,1069,82,189,diss_bike2.mp4
3958,1069,82,195,diss_bike2.mp4
3974,1069,83,198,diss_bike2.mp4
3990,1069,87,203,diss_bike2.mp4
4007,1069,94,206,diss_bike2.mp4
4025,1069,101,208,diss_bike2.mp4
4039,1069,111,212,diss_bike2.mp4
4065,1069,131,217,diss_bike2.mp4
4071,1069,141,218,diss_bike2.mp4
4090,1069,161,219,diss_bike2.mp4
4106,1069,185,218,diss_bike2.mp4
4120,1069,211,213,diss_bike2.mp4
4137,1069,239,209,diss_bike2.mp4
4162,1069,289,204,diss_bike2.mp4
4177,1069,322,203,diss_bike2.mp4
4192,1069,349,201,diss_bike2.mp4
4209,1069,372,200,diss_bike2.mp4
4224,1069,388,200,diss_bike2.mp4
4240,1069,402,201,diss_bike2.mp4
4257,1069,414,204,diss_bike2.mp4
4272,1069,424,209,diss_bike2.mp4
4288,1069,428,213,diss_bike2.mp4
4305,1069,430,216,diss_bike2.mp4
4322,1069,434,223,diss_bike2.mp4
4340,1069,439,235,diss_bike2.mp4
4355,1069,446,248,diss_bike2.mp4
4373,1069,454,259,diss_bike2.mp4
4387,1069,462,266,diss_bike2.mp4
4402,1069,469,270,diss_bike2.mp4
4427,1069,481,271,diss_bike2.mp4
4442,1069,494,271,diss_bike2.mp4
4458,1069,506,269,diss_bike2.mp4
4475,1069,518,266,diss_bike2.mp4
4492,1069,525,263,diss_bike2.mp4
4507,1069,532,262,diss_bike2.mp4
4523,1069,534,261,diss_bike2.mp4
4654,1069,535,261,diss_bike2.mp4
4750,1069,536,260,diss_bike2.mp4
4759,1069,537,260,diss_bike2.mp4
4773,1069,538,259,diss_bike2.mp4
4789,1069,539,257,diss_bike2.mp4
4797,1069,540,257,diss_bike2.mp4
4822,1069,542,257,diss_bike2.mp4
4844,1069,547,257,diss_bike2.mp4
4860,1069,552,257,diss_bike2.mp4
4877,1069,555,257,diss_bike2.mp4
4894,1069,559,256,diss_bike2.mp4
4911,1069,560,256,diss_bike2.mp4
4926,1069,565,254,diss_bike2.mp4
4942,1069,571,252,diss_bike2.mp4
4959,1069,579,249,diss_bike2.mp4
4976,1069,585,247,diss_bike2.mp4
4990,1069,589,245,diss_bike2.mp4
5006,1069,590,243,diss_bike2.mp4
5111,1069,589,241,diss_bike2.mp4
5128,1069,586,237,diss_bike2.mp4
5144,1069,583,232,diss_bike2.mp4
5160,1069,580,228,diss_bike2.mp4
5174,1069,578,224,diss_bike2.mp4
5192,1069,577,222,diss_bike2.mp4
5200,1069,575,220,diss_bike2.mp4
5226,1069,574,218,diss_bike2.mp4
5235,1069,574,217,diss_bike2.mp4
5256,1069,573,215,diss_bike2.mp4
5264,1069,573,214,diss_bike2.mp4
5288,1069,573,212,diss_bike2.mp4
5307,1069,572,210,diss_bike2.mp4
5328,1069,572,206,diss_bike2.mp4
5345,1069,572,202,diss_bike2.mp4
5360,1069,572,198,diss_bike2.mp4
5376,1069,573,194,diss_bike2.mp4
5392,1069,573,192,diss_bike2.mp4
5410,1069,573,190,diss_bike2.mp4
5424,1069,573,187,diss_bike2.mp4
5442,1069,573,184,diss_bike2.mp4
5459,1069,572,182,diss_bike2.mp4
5473,1069,571,181,diss_bike2.mp4
5491,1069,570,180,diss_bike2.mp4
5501,1069,570,179,diss_bike2.mp4
5523,1069,569,178,diss_bike2.mp4
5565,1069,569,177,diss_bike2.mp4
5611,1069,569,176,diss_bike2.mp4
5643,1069,570,175,diss_bike2.mp4
5659,1069,572,174,diss_bike2.mp4
5675,1069,574,170,diss_bike2.mp4
5691,1069,578,167,diss_bike2.mp4
5706,1069,584,163,diss_bike2.mp4
5724,1069,591,160,diss_bike2.mp4
5740,1069,599,155,diss_bike2.mp4
5757,1069,607,151,diss_bike2.mp4
5773,1069,612,146,diss_bike2.mp4
5789,1069,615,142,diss_bike2.mp4
5813,1069,618,135,diss_bike2.mp4
5830,1069,618,131,diss_bike2.mp4
5844,1069,619,128,diss_bike2.mp4
5860,1069,620,124,diss_bike2.mp4
5876,1069,620,120,diss_bike2.mp4
5901,1069,619,114,diss_bike2.mp4
5924,1069,617,112,diss_bike2.mp4
5933,1069,617,110,diss_bike2.mp4
6036,1069,619,111,diss_bike2.mp4
6043,1069,622,112,diss_bike2.mp4
6060,1069,627,113,diss_bike2.mp4
6077,1069,632,114,diss_bike2.mp4
6092,1069,638,114,diss_bike2.mp4
6107,1069,647,113,diss_bike2.mp4
6123,1069,653,110,diss_bike2.mp4
6146,1069,669,107,diss_bike2.mp4
6162,1069,680,105,diss_bike2.mp4
6178,1069,695,101,diss_bike2.mp4
6194,1069,707,99,diss_bike2.mp4
6210,1069,719,95,diss_bike2.mp4
6226,1069,729,92,diss_bike2.mp4
6244,1069,741,89,diss_bike2.mp4
6260,1069,752,88,diss_bike2.mp4
6274,1069,761,84,diss_bike2.mp4
6293,1069,767,82,diss_bike2.mp4
6309,1069,769,79,diss_bike2.mp4
6316,1069,771,77,diss_bike2.mp4
6341,1069,774,74,diss_bike2.mp4
6358,1069,778,71,diss_bike2.mp4
6373,1069,782,67,diss_bike2.mp4
6396,1069,790,62,diss_bike2.mp4
6412,1069,794,58,diss_bike2.mp4
6428,1069,800,57,diss_bike2.mp4
6444,1069,808,55,diss_bike2.mp4
6461,1069,819,55,diss_bike2.mp4
6477,1069,832,58,diss_bike2.mp4
6492,1069,844,62,diss_bike2.mp4
6510,1069,853,65,diss_bike2.mp4
6525,1069,859,70,diss_bike2.mp4
6541,1069,864,75,diss_bike2.mp4
6559,1069,867,79,diss_bike2.mp4
6575,1069,870,83,diss_bike2.mp4
6588,1069,873,87,diss_bike2.mp4
6609,1069,877,92,diss_bike2.mp4
6630,1069,884,98,diss_bike2.mp4
6647,1069,890,102,diss_bike2.mp4
6662,1069,898,108,diss_bike2.mp4
6679,1069,909,115,diss_bike2.mp4
6694,1069,925,123,diss_bike2.mp4
6711,1069,944,129,diss_bike2.mp4
6728,1069,966,136,diss_bike2.mp4
6743,1069,988,140,diss_bike2.mp4
6759,1069,1011,141,diss_bike2.mp4
6775,1069,1033,142,diss_bike2.mp4
6791,1069,1057,143,diss_bike2.mp4
6807,1069,1080,143,diss_bike2.mp4
6831,1069,1106,140,diss_bike2.mp4
6846,1069,1117,136,diss_bike2.mp4
6855,1069,1121,135,diss_bike2.mp4
6880,1069,1128,132,diss_bike2.mp4
6897,1069,1133,130,diss_bike2.mp4
6913,1069,1138,129,diss_bike2.mp4
6928,1069,1141,129,diss_bike2.mp4
6940,1069,1142,129,diss_bike2.mp4
6961,1069,1144,128,diss_bike2.mp4
6971,1069,1145,128,diss_bike2.mp4
6992,1069,1147,128,diss_bike2.mp4
7013,1069,1151,128,diss_bike2.mp4
7025,1069,1158,132,diss_bike2.mp4
7040,1069,1167,134,diss_bike2.mp4
7059,1069,1178,138,diss_bike2.mp4
7082,1069,1191,141,diss_bike2.mp4
7096,1069,1199,141,diss_bike2.mp4
7113,1069,1205,141,diss_bike2.mp4
7131,1069,1207,141,diss_bike2.mp4
7144,1069,1209,141,diss_bike2.mp4
7162,1069,1210,141,diss_bike2.mp4
7178,1069,1211,140,diss_bike2.mp4
7244,1069,1214,143,diss_bike2.mp4
7261,1069,1218,155,diss_bike2.mp4
7276,1069,1221,167,diss_bike2.mp4
7290,1069,1221,178,diss_bike2.mp4
7314,1069,1223,186,diss_bike2.mp4
7323,1069,1224,188,diss_bike2.mp4
7339,1069,1228,192,diss_bike2.mp4
7355,1069,1232,194,diss_bike2.mp4
7370,1069,1233,194,diss_bike2.mp4
7445,1069,1230,191,diss_bike2.mp4
7463,1069,1224,190,diss_bike2.mp4
7478,1069,1215,188,diss_bike2.mp4
7493,1069,1197,187,diss_bike2.mp4
7509,1069,1172,187,diss_bike2.mp4
7525,1069,1145,193,diss_bike2.mp4
7541,1069,1116,201,diss_bike2.mp4
7565,1069,1077,210,diss_bike2.mp4
7580,1069,1053,215,diss_bike2.mp4
7597,1069,1033,218,diss_bike2.mp4
7613,1069,1013,220,diss_bike2.mp4
7628,1069,996,222,diss_bike2.mp4
7646,1069,984,224,diss_bike2.mp4
7661,1069,976,226,diss_bike2.mp4
7678,1069,971,228,diss_bike2.mp4
7694,1069,965,230,diss_bike2.mp4
7708,1069,959,231,diss_bike2.mp4
7728,1069,952,232,diss_bike2.mp4
7744,1069,948,233,diss_bike2.mp4
7769,1069,941,235,diss_bike2.mp4
7776,1069,937,237,diss_bike2.mp4
7800,1069,923,242,diss_bike2.mp4
7814,1069,908,250,diss_bike2.mp4
7831,1069,891,259,diss_bike2.mp4
7846,1069,875,270,diss_bike2.mp4
7863,1069,862,278,diss_bike2.mp4
7879,1069,854,284,diss_bike2.mp4
7894,1069,846,293,diss_bike2.mp4
7912,1069,840,302,diss_bike2.mp4
7928,1069,834,315,diss_bike2.mp4
7943,1069,827,332,diss_bike2.mp4
7959,1069,820,353,diss_bike2.mp4
7986,1069,810,379,diss_bike2.mp4
7993,1069,807,387,diss_bike2.mp4
8007,1069,803,398,diss_bike2.mp4
8032,1069,800,409,diss_bike2.mp4
8048,1069,799,415,diss_bike2.mp4
8064,1069,797,419,diss_bike2.mp4
8081,1069,796,422,diss_bike2.mp4
8090,1069,796,423,diss_bike2.mp4
8181,1069,796,425,diss_bike2.mp4
8190,1069,795,427,diss_bike2.mp4
8212,1069,792,436,diss_bike2.mp4
8228,1069,788,448,diss_bike2.mp4
8246,1069,782,461,diss_bike2.mp4
8261,1069,777,476,diss_bike2.mp4
8276,1069,772,489,diss_bike2.mp4
8295,1069,768,501,diss_bike2.mp4
8311,1069,767,507,diss_bike2.mp4
8328,1069,767,510,diss_bike2.mp4
8343,1069,768,513,diss_bike2.mp4
8358,1069,772,517,diss_bike2.mp4
8383,1069,785,525,diss_bike2.mp4
8399,1069,801,531,diss_bike2.mp4
8406,1069,809,535,diss_bike2.mp4
8430,1069,840,541,diss_bike2.mp4
8446,1069,859,543,diss_bike2.mp4
8462,1069,880,547,diss_bike2.mp4
8478,1069,904,554,diss_bike2.mp4
8495,1069,935,566,diss_bike2.mp4
8513,1069,979,587,diss_bike2.mp4
8528,1069,1017,612,diss_bike2.mp4
8544,1069,1039,631,diss_bike2.mp4
8560,1069,1051,644,diss_bike2.mp4
8575,1069,1053,653,diss_bike2.mp4
8593,1069,1054,660,diss_bike2.mp4
8616,1069,1051,679,diss_bike2.mp4
8633,1069,1047,695,diss_bike2.mp4
8659,1069,1039,712,diss_bike2.mp4
8680,1069,1036,717,diss_bike2.mp4
8704,1069,1036,718,diss_bike2.mp4
8720,1069,1036,719,diss_bike2.mp4
8777,1069,1036,719,diss_bike2.mp4
8786,1069,1036,718,diss_bike2.mp4
8793,1069,1034,716,diss_bike2.mp4
8816,1069,1029,703,diss_bike2.mp4
8856,1069,1027,695,diss_bike2.mp4
8890,1069,1027,694,diss_bike2.mp4
8931,1069,1031,690,diss_bike2.mp4
8948,1069,1033,689,diss_bike2.mp4
8962,1069,1034,686,diss_bike2.mp4
8980,1069,1034,682,diss_bike2.mp4
8995,1069,1030,673,diss_bike2.mp4
9011,1069,1022,664,diss_bike2.mp4
9030,1069,1012,656,diss_bike2.mp4
9044,1069,1000,649,diss_bike2.mp4
9058,1069,979,640,diss_bike2.mp4
9083,1069,902,608,diss_bike2.mp4
9100,1069,811,573,diss_bike2.mp4
9114,1069,719,550,diss_bike2.mp4
9122,1069,680,543,diss_bike2.mp4
9148,1069,618,537,diss_bike2.mp4
9164,1069,595,532,diss_bike2.mp4
9180,1069,577,526,diss_bike2.mp4
9198,1069,562,516,diss_bike2.mp4
9213,1069,548,501,diss_bike2.mp4
9228,1069,537,484,diss_bike2.mp4
9246,1069,533,469,diss_bike2.mp4
9261,1069,533,459,diss_bike2.mp4
9277,1069,538,447,diss_bike2.mp4
9301,1069,548,426,diss_bike2.mp4
9316,1069,555,405,diss_bike2.mp4
9332,1069,561,387,diss_bike2.mp4
9349,1069,566,376,diss_bike2.mp4
9365,1069,570,368,diss_bike2.mp4
9381,1069,573,361,diss_bike2.mp4
9400,1069,576,356,diss_bike2.mp4
9414,1069,581,351,diss_bike2.mp4
9431,1069,586,345,diss_bike2.mp4
9448,1069,593,340,diss_bike2.mp4
9462,1069,599,334,diss_bike2.mp4
9488,1069,606,329,diss_bike2.mp4
9505,1069,609,326,diss_bike2.mp4
9512,1069,611,326,diss_bike2.mp4
9536,1069,612,324,diss_bike2.mp4
9647,1069,612,325,diss_bike2.mp4
9793,1069,612,324,diss_bike2.mp4
9801,1069,612,323,diss_bike2.mp4
9818,1069,612,320,diss_bike2.mp4
9832,1069,612,317,diss_bike2.mp4
9848,1069,611,312,diss_bike2.mp4
9864,1069,608,309,diss_bike2.mp4
9881,1069,603,306,diss_bike2.mp4
9897,1069,598,305,diss_bike2.mp4
9912,1069,589,303,diss_bike2.mp4
9928,1069,577,303,diss_bike2.mp4
9947,1069,562,303,diss_bike2.mp4
9960,1069,544,306,diss_bike2.mp4
9979,1069,529,308,diss_bike2.mp4
9996,1069,518,310,diss_bike2.mp4
10011,1069,508,312,diss_bike2.mp4
10027,1069,499,315,diss_bike2.mp4
10050,1069,484,319,diss_bike2.mp4
10067,1069,472,323,diss_bike2.mp4
10082,1069,458,326,diss_bike2.mp4
10099,1069,441,330,diss_bike2.mp4
10114,1069,426,337,diss_bike2.mp4
10130,1069,413,343,diss_bike2.mp4
10147,1069,400,349,diss_bike2.mp4
10164,1069,387,354,diss_bike2.mp4
10179,1069,375,357,diss_bike2.mp4
10194,1069,364,360,diss_bike2.mp4
10211,1069,355,363,diss_bike2.mp4
10235,1069,346,368,diss_bike2.mp4
10251,1069,341,370,diss_bike2.mp4
10268,1069,336,372,diss_bike2.mp4
10285,1069,331,374,diss_bike2.mp4
10301,1069,328,374,diss_bike2.mp4
10316,1069,326,374,diss_bike2.mp4
10474,1069,326,373,diss_bike2.mp4
10483,1069,327,371,diss_bike2.mp4
10497,1069,330,363,diss_bike2.mp4
10513,1069,333,357,diss_bike2.mp4
10529,1069,337,350,diss_bike2.mp4
10552,1069,339,341,diss_bike2.mp4
10563,1069,340,338,diss_bike2.mp4
10586,1069,340,335,diss_bike2.mp4
10647,1069,341,335,diss_bike2.mp4
10665,1069,342,335,diss_bike2.mp4
10681,1069,346,336,diss_bike2.mp4
10695,1069,354,338,diss_bike2.mp4
10711,1069,364,341,diss_bike2.mp4
10734,1069,386,346,diss_bike2.mp4
10750,1069,406,351,diss_bike2.mp4
10766,1069,428,360,diss_bike2.mp4
10784,1069,453,371,diss_bike2.mp4
10798,1069,480,390,diss_bike2.mp4
10817,1069,500,409,diss_bike2.mp4
10830,1069,511,428,diss_bike2.mp4
10849,1069,515,447,diss_bike2.mp4
10865,1069,517,467,diss_bike2.mp4
10880,1069,515,492,diss_bike2.mp4
10898,1069,513,526,diss_bike2.mp4
10914,1069,508,577,diss_bike2.mp4
10929,1069,504,628,diss_bike2.mp4
10952,1069,501,663,diss_bike2.mp4
10968,1069,501,667,diss_bike2.mp4
11073,1069,501,666,diss_bike2.mp4
11083,1069,501,665,diss_bike2.mp4
11097,1069,501,662,diss_bike2.mp4
11115,1069,501,658,diss_bike2.mp4
11131,1069,503,652,diss_bike2.mp4
11156,1069,505,646,diss_bike2.mp4
11164,1069,506,644,diss_bike2.mp4
11186,1069,511,634,diss_bike2.mp4
11202,1069,514,626,diss_bike2.mp4
11219,1069,514,621,diss_bike2.mp4
11235,1069,515,617,diss_bike2.mp4
11251,1069,516,612,diss_bike2.mp4
11267,1069,517,607,diss_bike2.mp4
11283,1069,517,601,diss_bike2.mp4
11298,1069,516,594,diss_bike2.mp4
11316,1069,515,589,diss_bike2.mp4
11331,1069,513,586,diss_bike2.mp4
11348,1069,512,583,diss_bike2.mp4
11371,1069,507,579,diss_bike2.mp4
11381,1069,503,575,diss_bike2.mp4
11396,1069,495,569,diss_bike2.mp4
11423,1069,486,565,diss_bike2.mp4
11648,1069,486,564,diss_bike2.mp4
11670,1069,487,563,diss_bike2.mp4
11687,1069,491,559,diss_bike2.mp4
11703,1069,500,552,diss_bike2.mp4
11719,1069,512,542,diss_bike2.mp4
11734,1069,531,527,diss_bike2.mp4
11751,1069,552,509,diss_bike2.mp4
11766,1069,579,484,diss_bike2.mp4
11782,1069,599,465,diss_bike2.mp4
11799,1069,614,450,diss_bike2.mp4
11823,1069,627,430,diss_bike2.mp4
11831,1069,631,422,diss_bike2.mp4
11855,1069,639,394,diss_bike2.mp4
11870,1069,644,373,diss_bike2.mp4
11886,1069,648,352,diss_bike2.mp4
11903,1069,649,330,diss_bike2.mp4
11920,1069,650,313,diss_bike2.mp4
11935,1069,654,301,diss_bike2.mp4
11953,1069,657,292,diss_bike2.mp4
11968,1069,662,285,diss_bike2.mp4
11985,1069,667,275,diss_bike2.mp4
12001,1069,675,263,diss_bike2.mp4
12016,1069,684,248,diss_bike2.mp4
12033,1069,692,234,diss_bike2.mp4
12050,1069,698,222,diss_bike2.mp4
12065,1069,702,214,diss_bike2.mp4
12081,1069,706,208,diss_bike2.mp4
12104,1069,710,201,diss_bike2.mp4
12120,1069,712,197,diss_bike2.mp4
12137,1069,713,195,diss_bike2.mp4
12152,1069,713,194,diss_bike2.mp4
12169,1069,714,194,diss_bike2.mp4
12185,1069,714,192,diss_bike2.mp4
12201,1069,716,191,diss_bike2.mp4
12217,1069,719,189,diss_bike2.mp4
12233,1069,726,184,diss_bike2.mp4
12250,1069,736,176,diss_bike2.mp4
12267,1069,748,165,diss_bike2.mp4
12291,1069,767,147,diss_bike2.mp4
12299,1069,772,141,diss_bike2.mp4
12315,1069,783,133,diss_bike2.mp4
12332,1069,790,127,diss_bike2.mp4
12354,1069,798,122,diss_bike2.mp4
12371,1069,800,121,diss_bike2.mp4
12379,1069,800,120,diss_bike2.mp4
12403,1069,801,120,diss_bike2.mp4
12510,1069,802,120,diss_bike2.mp4
12517,1069,802,119,diss_bike2.mp4
12550,1069,802,118,diss_bike2.mp4
12576,1069,802,117,diss_bike2.mp4
12726,1069,801,117,diss_bike2.mp4
12744,1069,800,117,diss_bike2.mp4
12750,1069,799,117,diss_bike2.mp4
12769,1069,798,117,diss_bike2.mp4
12783,1069,796,117,diss_bike2.mp4
12792,1069,794,117,diss_bike2.mp4
12816,1069,790,117,diss_bike2.mp4
12838,1069,785,118,diss_bike2.mp4
12855,1069,780,119,diss_bike2.mp4
12871,1069,774,120,diss_bike2.mp4
12887,1069,766,122,diss_bike2.mp4
12903,1069,762,124,diss_bike2.mp4
12918,1069,756,125,diss_bike2.mp4
12934,1069,752,127,diss_bike2.mp4
12951,1069,750,127,diss_bike2.mp4
12967,1069,748,128,diss_bike2.mp4
12983,1069,745,130,diss_bike2.mp4
13008,1069,741,133,diss_bike2.mp4
13022,1069,737,135,diss_bike2.mp4
13038,1069,733,137,diss_bike2.mp4
13047,1069,730,139,diss_bike2.mp4
13071,1069,724,142,diss_bike2.mp4
13088,1069,720,145,diss_bike2.mp4
13104,1069,716,148,diss_bike2.mp4
13120,1069,707,153,diss_bike2.mp4
13137,1069,694,163,diss_bike2.mp4
13153,1069,678,177,diss_bike2.mp4
13169,1069,659,193,diss_bike2.mp4
13185,1069,641,210,diss_bike2.mp4
13201,1069,622,227,diss_bike2.mp4
13217,1069,605,242,diss_bike2.mp4
13233,1069,590,256,diss_bike2.mp4
13249,1069,578,269,diss_bike2.mp4
13272,1069,569,280,diss_bike2.mp4
13288,1069,566,285,diss_bike2.mp4
13304,1069,564,288,diss_bike2.mp4
13322,1069,562,294,diss_bike2.mp4
13337,1069,561,298,diss_bike2.mp4
13355,1069,561,300,diss_bike2.mp4
13370,1069,561,302,diss_bike2.mp4
13388,1069,563,304,diss_bike2.mp4
13403,1069,564,310,diss_bike2.mp4
13419,1069,569,319,diss_bike2.mp4
13436,1069,576,333,diss_bike2.mp4
13451,1069,584,345,diss_bike2.mp4
13467,1069,589,350,diss_bike2.mp4
13483,1069,592,353,diss_bike2.mp4
13499,1069,593,353,diss_bike2.mp4
13522,1069,594,353,diss_bike2.mp4
13538,1069,596,353,diss_bike2.mp4
13554,1069,598,352,diss_bike2.mp4
13571,1069,602,350,diss_bike2.mp4
13587,1069,605,349,diss_bike2.mp4
13603,1069,609,347,diss_bike2.mp4
13619,1069,613,347,diss_bike2.mp4
13638,1069,615,347,diss_bike2.mp4
13653,1069,619,346,diss_bike2.mp4
13670,1069,622,346,diss_bike2.mp4
13685,1069,624,346,diss_bike2.mp4
13693,1069,625,346,diss_bike2.mp4
13709,1069,626,345,diss_bike2.mp4
13734,1069,628,345,diss_bike2.mp4
13756,1069,632,345,diss_bike2.mp4
13773,1069,635,344,diss_bike2.mp4
13788,1069,638,343,diss_bike2.mp4
13805,1069,643,340,diss_bike2.mp4
13821,1069,647,337,diss_bike2.mp4
13837,1069,650,334,diss_bike2.mp4
13852,1069,651,331,diss_bike2.mp4
13868,1069,651,328,diss_bike2.mp4
13885,1069,652,326,diss_bike2.mp4
13903,1069,653,325,diss_bike2.mp4
14106,1069,653,324,diss_bike2.mp4
14129,1069,652,324,diss_bike2.mp4
14135,1069,651,324,diss_bike2.mp4
14152,1069,649,323,diss_bike2.mp4
14168,1069,647,323,diss_bike2.mp4
0,1074,637,361,diss_Basketball.mp4
14,1074,637,360,diss_Basketball.mp4
22,1074,637,359,diss_Basketball.mp4
38,1074,638,358,diss_Basketball.mp4
56,1074,638,356,diss_Basketball.mp4
71,1074,640,353,diss_Basketball.mp4
87,1074,641,349,diss_Basketball.mp4
102,1074,642,345,diss_Basketball.mp4
126,1074,643,341,diss_Basketball.mp4
143,1074,644,339,diss_Basketball.mp4
159,1074,644,336,diss_Basketball.mp4
175,1074,644,333,diss_Basketball.mp4
191,1074,644,331,diss_Basketball.mp4
209,1074,644,327,diss_Basketball.mp4
225,1074,644,324,diss_Basketball.mp4
239,1074,643,320,diss_Basketball.mp4
258,1074,641,317,diss_Basketball.mp4
273,1074,639,316,diss_Basketball.mp4
289,1074,638,315,diss_Basketball.mp4
305,1074,636,315,diss_Basketball.mp4
321,1074,633,315,diss_Basketball.mp4
336,1074,631,314,diss_Basketball.mp4
360,1074,627,314,diss_Basketball.mp4
369,1074,626,314,diss_Basketball.mp4
400,1074,622,315,diss_Basketball.mp4
409,1074,621,316,diss_Basketball.mp4
425,1074,618,317,diss_Basketball.mp4
457,1074,612,319,diss_Basketball.mp4
465,1074,611,319,diss_Basketball.mp4
473,1074,610,319,diss_Basketball.mp4
489,1074,607,320,diss_Basketball.mp4
505,1074,605,320,diss_Basketball.mp4
521,1074,602,321,diss_Basketball.mp4
537,1074,599,322,diss_Basketball.mp4
556,1074,596,322,diss_Basketball.mp4
571,1074,592,322,diss_Basketball.mp4
598,1074,587,323,diss_Basketball.mp4
610,1074,582,324,diss_Basketball.mp4
626,1074,577,324,diss_Basketball.mp4
642,1074,572,324,diss_Basketball.mp4
667,1074,564,326,diss_Basketball.mp4
674,1074,561,326,diss_Basketball.mp4
690,1074,553,327,diss_Basketball.mp4
707,1074,543,328,diss_Basketball.mp4
722,1074,533,329,diss_Basketball.mp4
739,1074,525,332,diss_Basketball.mp4
756,1074,519,333,diss_Basketball.mp4
772,1074,513,335,diss_Basketball.mp4
794,1074,504,337,diss_Basketball.mp4
804,1074,500,337,diss_Basketball.mp4
826,1074,495,339,diss_Basketball.mp4
844,1074,493,340,diss_Basketball.mp4
860,1074,492,341,diss_Basketball.mp4
869,1074,491,341,diss_Basketball.mp4
885,1074,490,341,diss_Basketball.mp4
932,1074,489,341,diss_Basketball.mp4
948,1074,489,342,diss_Basketball.mp4
991,1074,488,342,diss_Basketball.mp4
1187,1074,490,342,diss_Basketball.mp4
1204,1074,494,341,diss_Basketball.mp4
1228,1074,506,336,diss_Basketball.mp4
1243,1074,520,333,diss_Basketball.mp4
1259,1074,541,329,diss_Basketball.mp4
1275,1074,568,326,diss_Basketball.mp4
1291,1074,605,323,diss_Basketball.mp4
1307,1074,639,320,diss_Basketball.mp4
1323,1074,672,317,diss_Basketball.mp4
1339,1074,699,314,diss_Basketball.mp4
1354,1074,720,313,diss_Basketball.mp4
1374,1074,736,313,diss_Basketball.mp4
1396,1074,752,313,diss_Basketball.mp4
1404,1074,756,313,diss_Basketball.mp4
1428,1074,762,313,diss_Basketball.mp4
1444,1074,765,313,diss_Basketball.mp4
1460,1074,768,313,diss_Basketball.mp4
1477,1074,772,315,diss_Basketball.mp4
1493,1074,776,316,diss_Basketball.mp4
1508,1074,779,317,diss_Basketball.mp4
1524,1074,783,319,diss_Basketball.mp4
1541,1074,788,322,diss_Basketball.mp4
1556,1074,792,324,diss_Basketball.mp4
1565,1074,793,325,diss_Basketball.mp4
1610,1074,793,326,diss_Basketball.mp4
1767,1074,793,327,diss_Basketball.mp4
1815,1074,792,327,diss_Basketball.mp4
1839,1074,790,327,diss_Basketball.mp4
1863,1074,786,327,diss_Basketball.mp4
1878,1074,784,327,diss_Basketball.mp4
1896,1074,782,328,diss_Basketball.mp4
1903,1074,780,329,diss_Basketball.mp4
1928,1074,777,330,diss_Basketball.mp4
1942,1074,775,331,diss_Basketball.mp4
1960,1074,772,333,diss_Basketball.mp4
1978,1074,769,336,diss_Basketball.mp4
2001,1074,764,346,diss_Basketball.mp4
2008,1074,763,349,diss_Basketball.mp4
2025,1074,762,359,diss_Basketball.mp4
2042,1074,762,371,diss_Basketball.mp4
2067,1074,768,394,diss_Basketball.mp4
2074,1074,770,401,diss_Basketball.mp4
2096,1074,773,408,diss_Basketball.mp4
2105,1074,773,410,diss_Basketball.mp4
2121,1074,773,411,diss_Basketball.mp4
2137,1074,773,412,diss_Basketball.mp4
2170,1074,773,413,diss_Basketball.mp4
2186,1074,772,414,diss_Basketball.mp4
2193,1074,771,414,diss_Basketball.mp4
2210,1074,764,417,diss_Basketball.mp4
2228,1074,755,421,diss_Basketball.mp4
2243,1074,746,427,diss_Basketball.mp4
2259,1074,739,433,diss_Basketball.mp4
2274,1074,734,439,diss_Basketball.mp4
2292,1074,731,442,diss_Basketball.mp4
2307,1074,729,444,diss_Basketball.mp4
2325,1074,728,444,diss_Basketball.mp4
2333,1074,728,445,diss_Basketball.mp4
2355,1074,728,446,diss_Basketball.mp4
2375,1074,728,447,diss_Basketball.mp4
2394,1074,728,449,diss_Basketball.mp4
2404,1074,728,450,diss_Basketball.mp4
2534,1074,727,448,diss_Basketball.mp4
2542,1074,726,447,diss_Basketball.mp4
2556,1074,725,446,diss_Basketball.mp4
2574,1074,724,445,diss_Basketball.mp4
2600,1074,723,444,diss_Basketball.mp4
2623,1074,722,444,diss_Basketball.mp4
2644,1074,722,443,diss_Basketball.mp4
2653,1074,721,443,diss_Basketball.mp4
2676,1074,719,442,diss_Basketball.mp4
2693,1074,716,441,diss_Basketball.mp4
2709,1074,713,438,diss_Basketball.mp4
2727,1074,707,436,diss_Basketball.mp4
2742,1074,702,434,diss_Basketball.mp4
2759,1074,698,432,diss_Basketball.mp4
2775,1074,696,431,diss_Basketball.mp4
3173,1074,695,431,diss_Basketball.mp4
3181,1074,695,430,diss_Basketball.mp4
3197,1074,694,430,diss_Basketball.mp4
3213,1074,692,429,diss_Basketball.mp4
3229,1074,690,429,diss_Basketball.mp4
3245,1074,688,427,diss_Basketball.mp4
3252,1074,687,427,diss_Basketball.mp4
3268,1074,686,427,diss_Basketball.mp4
3293,1074,684,426,diss_Basketball.mp4
3309,1074,683,426,diss_Basketball.mp4
3334,1074,682,424,diss_Basketball.mp4
3351,1074,681,424,diss_Basketball.mp4
3366,1074,680,424,diss_Basketball.mp4
3384,1074,680,423,diss_Basketball.mp4
3439,1074,679,423,diss_Basketball.mp4
3447,1074,679,422,diss_Basketball.mp4
3479,1074,678,421,diss_Basketball.mp4
3495,1074,676,421,diss_Basketball.mp4
3511,1074,674,419,diss_Basketball.mp4
3527,1074,672,416,diss_Basketball.mp4
3543,1074,667,413,diss_Basketball.mp4
3559,1074,665,412,diss_Basketball.mp4
3575,1074,663,411,diss_Basketball.mp4
3590,1074,662,410,diss_Basketball.mp4
3633,1074,661,410,diss_Basketball.mp4
3962,1074,661,409,diss_Basketball.mp4
4667,1074,660,409,diss_Basketball.mp4
7815,1074,659,409,diss_Basketball.mp4
7876,1074,659,408,diss_Basketball.mp4
8051,1074,659,407,diss_Basketball.mp4
8068,1074,659,406,diss_Basketball.mp4
8099,1074,659,405,diss_Basketball.mp4
8131,1074,659,404,diss_Basketball.mp4
8155,1074,659,403,diss_Basketball.mp4
8164,1074,659,402,diss_Basketball.mp4
8188,1074,659,401,diss_Basketball.mp4
8220,1074,659,400,diss_Basketball.mp4
8245,1074,659,399,diss_Basketball.mp4
8269,1074,659,398,diss_Basketball.mp4
8292,1074,659,397,diss_Basketball.mp4
8341,1074,659,396,diss_Basketball.mp4
8475,1074,659,395,diss_Basketball.mp4
9047,1074,659,394,diss_Basketball.mp4
9086,1074,659,392,diss_Basketball.mp4
9111,1074,659,391,diss_Basketball.mp4
9135,1074,659,390,diss_Basketball.mp4
9151,1074,659,389,diss_Basketball.mp4
9166,1074,659,388,diss_Basketball.mp4
9183,1074,659,387,diss_Basketball.mp4
9199,1074,659,386,diss_Basketball.mp4
9214,1074,659,385,diss_Basketball.mp4
9247,1074,659,384,diss_Basketball.mp4
9321,1074,659,383,diss_Basketball.mp4
0,1071,654,370,diss_car12.mp4
21,1071,654,368,diss_car12.mp4
30,1071,654,367,diss_car12.mp4
55,1071,654,359,diss_car12.mp4
71,1071,655,345,diss_car12.mp4
87,1071,657,327,diss_car12.mp4
102,1071,659,308,diss_car12.mp4
119,1071,662,292,diss_car12.mp4
135,1071,665,278,diss_car12.mp4
151,1071,668,265,diss_car12.mp4
168,1071,672,250,diss_car12.mp4
183,1071,676,232,diss_car12.mp4
199,1071,682,216,diss_car12.mp4
215,1071,685,203,diss_car12.mp4
238,1071,688,190,diss_car12.mp4
254,1071,689,184,diss_car12.mp4
271,1071,690,179,diss_car12.mp4
287,1071,690,176,diss_car12.mp4
304,1071,690,174,diss_car12.mp4
320,1071,690,172,diss_car12.mp4
337,1071,689,170,diss_car12.mp4
353,1071,689,169,diss_car12.mp4
368,1071,688,167,diss_car12.mp4
385,1071,687,166,diss_car12.mp4
393,1071,686,165,diss_car12.mp4
433,1071,685,165,diss_car12.mp4
469,1071,685,164,diss_car12.mp4
484,1071,684,164,diss_car12.mp4
531,1071,684,163,diss_car12.mp4
553,1071,682,163,diss_car12.mp4
668,1071,682,162,diss_car12.mp4
683,1071,683,160,diss_car12.mp4
706,1071,688,155,diss_car12.mp4
722,1071,692,150,diss_car12.mp4
738,1071,696,145,diss_car12.mp4
755,1071,705,143,diss_car12.mp4
771,1071,716,142,diss_car12.mp4
787,1071,730,141,diss_car12.mp4
803,1071,747,139,diss_car12.mp4
819,1071,764,135,diss_car12.mp4
837,1071,784,133,diss_car12.mp4
852,1071,804,132,diss_car12.mp4
869,1071,826,131,diss_car12.mp4
885,1071,846,131,diss_car12.mp4
902,1071,865,131,diss_car12.mp4
917,1071,887,131,diss_car12.mp4
933,1071,907,130,diss_car12.mp4
949,1071,924,130,diss_car12.mp4
972,1071,943,130,diss_car12.mp4
988,1071,955,134,diss_car12.mp4
1004,1071,967,143,diss_car12.mp4
1021,1071,981,159,diss_car12.mp4
1037,1071,992,180,diss_car12.mp4
1053,1071,1001,201,diss_car12.mp4
1069,1071,1007,223,diss_car12.mp4
1085,1071,1013,247,diss_car12.mp4
1103,1071,1015,273,diss_car12.mp4
1118,1071,1014,295,diss_car12.mp4
1135,1071,1006,317,diss_car12.mp4
1151,1071,997,339,diss_car12.mp4
1168,1071,990,359,diss_car12.mp4
1184,1071,983,376,diss_car12.mp4
1206,1071,979,391,diss_car12.mp4
1215,1071,978,395,diss_car12.mp4
1238,1071,976,401,diss_car12.mp4
1255,1071,976,404,diss_car12.mp4
1271,1071,976,406,diss_car12.mp4
1287,1071,976,408,diss_car12.mp4
1303,1071,978,410,diss_car12.mp4
1320,1071,982,411,diss_car12.mp4
1335,1071,986,412,diss_car12.mp4
1351,1071,990,412,diss_car12.mp4
1367,1071,996,413,diss_car12.mp4
1383,1071,1001,414,diss_car12.mp4
1407,1071,1009,416,diss_car12.mp4
1418,1071,1012,417,diss_car12.mp4
1440,1071,1019,418,diss_car12.mp4
1448,1071,1022,418,diss_car12.mp4
1473,1071,1028,418,diss_car12.mp4
1489,1071,1034,419,diss_car12.mp4
1505,1071,1040,421,diss_car12.mp4
1521,1071,1046,422,diss_car12.mp4
1537,1071,1051,423,diss_car12.mp4
1552,1071,1053,423,diss_car12.mp4
1568,1071,1054,423,diss_car12.mp4
1585,1071,1056,425,diss_car12.mp4
1601,1071,1060,427,diss_car12.mp4
1617,1071,1064,429,diss_car12.mp4
1640,1071,1066,431,diss_car12.mp4
1748,1071,1066,432,diss_car12.mp4
1779,1071,1057,434,diss_car12.mp4
1803,1071,1034,437,diss_car12.mp4
1819,1071,1017,440,diss_car12.mp4
1835,1071,999,442,diss_car12.mp4
1851,1071,985,443,diss_car12.mp4
1874,1071,959,444,diss_car12.mp4
1883,1071,951,444,diss_car12.mp4
1907,1071,928,443,diss_car12.mp4
1922,1071,916,442,diss_car12.mp4
1939,1071,905,441,diss_car12.mp4
1954,1071,892,440,diss_car12.mp4
1971,1071,880,440,diss_car12.mp4
1988,1071,869,440,diss_car12.mp4
2004,1071,858,440,diss_car12.mp4
2021,1071,849,440,diss_car12.mp4
2037,1071,838,440,diss_car12.mp4
2053,1071,826,440,diss_car12.mp4
2069,1071,811,440,diss_car12.mp4
2084,1071,791,439,diss_car12.mp4
2111,1071,760,437,diss_car12.mp4
2125,1071,743,437,diss_car12.mp4
2140,1071,728,437,diss_car12.mp4
2156,1071,713,437,diss_car12.mp4
2173,1071,696,437,diss_car12.mp4
2190,1071,677,437,diss_car12.mp4
2205,1071,661,437,diss_car12.mp4
2220,1071,649,437,diss_car12.mp4
2238,1071,641,437,diss_car12.mp4
2253,1071,634,437,diss_car12.mp4
2270,1071,628,437,diss_car12.mp4
2289,1071,622,437,diss_car12.mp4
2303,1071,616,437,diss_car12.mp4
2319,1071,610,437,diss_car12.mp4
2335,1071,605,437,diss_car12.mp4
2351,1071,599,437,diss_car12.mp4
2374,1071,589,437,diss_car12.mp4
2390,1071,579,437,diss_car12.mp4
2406,1071,567,436,diss_car12.mp4
2422,1071,556,435,diss_car12.mp4
2438,1071,544,435,diss_car12.mp4
2455,1071,529,435,diss_car12.mp4
2472,1071,513,435,diss_car12.mp4
2488,1071,494,435,diss_car12.mp4
2503,1071,479,436,diss_car12.mp4
2518,1071,468,436,diss_car12.mp4
2537,1071,460,436,diss_car12.mp4
2551,1071,454,436,diss_car12.mp4
2576,1071,446,436,diss_car12.mp4
2585,1071,443,436,diss_car12.mp4
2608,1071,437,436,diss_car12.mp4
2624,1071,434,436,diss_car12.mp4
2640,1071,431,436,diss_car12.mp4
2656,1071,428,436,diss_car12.mp4
2672,1071,425,436,diss_car12.mp4
2688,1071,419,436,diss_car12.mp4
2704,1071,413,435,diss_car12.mp4
2722,1071,406,433,diss_car12.mp4
2737,1071,401,433,diss_car12.mp4
2755,1071,396,432,diss_car12.mp4
2769,1071,393,432,diss_car12.mp4
2785,1071,390,432,diss_car12.mp4
2803,1071,388,431,diss_car12.mp4
2818,1071,387,431,diss_car12.mp4
2835,1071,384,430,diss_car12.mp4
2850,1071,383,430,diss_car12.mp4
3352,1071,382,430,diss_car12.mp4
3357,1071,381,430,diss_car12.mp4
3381,1071,378,430,diss_car12.mp4
3397,1071,372,430,diss_car12.mp4
3406,1071,370,430,diss_car12.mp4
3422,1071,363,431,diss_car12.mp4
3439,1071,357,432,diss_car12.mp4
3455,1071,353,433,diss_car12.mp4
3471,1071,348,433,diss_car12.mp4
3488,1071,346,433,diss_car12.mp4
3510,1071,343,434,diss_car12.mp4
3526,1071,339,434,diss_car12.mp4
3542,1071,336,434,diss_car12.mp4
3559,1071,332,435,diss_car12.mp4
3574,1071,330,435,diss_car12.mp4
3591,1071,328,435,diss_car12.mp4
3607,1071,327,435,diss_car12.mp4
3623,1071,325,435,diss_car12.mp4
3639,1071,323,435,diss_car12.mp4
3654,1071,320,435,diss_car12.mp4
3664,1071,319,435,diss_car12.mp4
3683,1071,318,435,diss_car12.mp4
3699,1071,317,435,diss_car12.mp4
3722,1071,315,435,diss_car12.mp4
3737,1071,314,435,diss_car12.mp4
3754,1071,312,436,diss_car12.mp4
3776,1071,310,436,diss_car12.mp4
4140,1071,310,437,diss_car12.mp4
4155,1071,311,437,diss_car12.mp4
4180,1071,312,437,diss_car12.mp4
4187,1071,313,438,diss_car12.mp4
4213,1071,314,438,diss_car12.mp4
4227,1071,316,438,diss_car12.mp4
4244,1071,317,439,diss_car12.mp4
4259,1071,320,439,diss_car12.mp4
4276,1071,325,441,diss_car12.mp4
4293,1071,331,443,diss_car12.mp4
4308,1071,339,446,diss_car12.mp4
4324,1071,347,448,diss_car12.mp4
4341,1071,354,449,diss_car12.mp4
4348,1071,356,450,diss_car12.mp4
4373,1071,364,451,diss_car12.mp4
4389,1071,369,453,diss_car12.mp4
4414,1071,379,455,diss_car12.mp4
4429,1071,387,456,diss_car12.mp4
4444,1071,393,457,diss_car12.mp4
4460,1071,398,458,diss_car12.mp4
4476,1071,402,458,diss_car12.mp4
4492,1071,406,458,diss_car12.mp4
4510,1071,412,459,diss_car12.mp4
4524,1071,419,460,diss_car12.mp4
4542,1071,423,461,diss_car12.mp4
4558,1071,426,461,diss_car12.mp4
4574,1071,430,461,diss_car12.mp4
4591,1071,434,462,diss_car12.mp4
4607,1071,437,463,diss_car12.mp4
4623,1071,439,463,diss_car12.mp4
4640,1071,442,463,diss_car12.mp4
4655,1071,443,463,diss_car12.mp4
4666,1071,444,463,diss_car12.mp4
5058,1071,445,463,diss_car12.mp4
5074,1071,446,463,diss_car12.mp4
5089,1071,449,463,diss_car12.mp4
5105,1071,452,463,diss_car12.mp4
5131,1071,453,463,diss_car12.mp4
5147,1071,454,463,diss_car12.mp4
5162,1071,455,464,diss_car12.mp4
5178,1071,458,464,diss_car12.mp4
5194,1071,460,465,diss_car12.mp4
5211,1071,462,465,diss_car12.mp4
5227,1071,464,465,diss_car12.mp4
5242,1071,466,465,diss_car12.mp4
5260,1071,468,466,diss_car12.mp4
5275,1071,472,467,diss_car12.mp4
5291,1071,479,468,diss_car12.mp4
5308,1071,486,470,diss_car12.mp4
5323,1071,496,472,diss_car12.mp4
5348,1071,514,476,diss_car12.mp4
5355,1071,522,477,diss_car12.mp4
5378,1071,544,478,diss_car12.mp4
5387,1071,551,479,diss_car12.mp4
5412,1071,572,481,diss_car12.mp4
5429,1071,584,483,diss_car12.mp4
5445,1071,595,484,diss_car12.mp4
5461,1071,606,485,diss_car12.mp4
5477,1071,617,485,diss_car12.mp4
5493,1071,625,485,diss_car12.mp4
5516,1071,634,485,diss_car12.mp4
5525,1071,637,485,diss_car12.mp4
5541,1071,642,485,diss_car12.mp4
5557,1071,649,485,diss_car12.mp4
5575,1071,658,485,diss_car12.mp4
5596,1071,671,485,diss_car12.mp4
5613,1071,677,485,diss_car12.mp4
5629,1071,683,485,diss_car12.mp4
5644,1071,687,485,diss_car12.mp4
5662,1071,691,485,diss_car12.mp4
5678,1071,694,485,diss_car12.mp4
5694,1071,699,485,diss_car12.mp4
5711,1071,703,485,diss_car12.mp4
5727,1071,708,485,diss_car12.mp4
5742,1071,712,485,diss_car12.mp4
5758,1071,715,486,diss_car12.mp4
5775,1071,718,486,diss_car12.mp4
5791,1071,723,487,diss_car12.mp4
5807,1071,727,487,diss_car12.mp4
5823,1071,732,487,diss_car12.mp4
5846,1071,740,487,diss_car12.mp4
5862,1071,746,488,diss_car12.mp4
5879,1071,752,488,diss_car12.mp4
5896,1071,758,488,diss_car12.mp4
5910,1071,764,488,diss_car12.mp4
5926,1071,770,488,diss_car12.mp4
5944,1071,775,488,diss_car12.mp4
5959,1071,781,488,diss_car12.mp4
5976,1071,789,488,diss_car12.mp4
5992,1071,796,488,diss_car12.mp4
6008,1071,805,488,diss_car12.mp4
6024,1071,815,489,diss_car12.mp4
6041,1071,823,489,diss_car12.mp4
6059,1071,829,489,diss_car12.mp4
6074,1071,836,490,diss_car12.mp4
6096,1071,845,490,diss_car12.mp4
6112,1071,849,490,diss_car12.mp4
6128,1071,853,490,diss_car12.mp4
6145,1071,858,490,diss_car12.mp4
6161,1071,864,489,diss_car12.mp4
6176,1071,873,488,diss_car12.mp4
6192,1071,880,488,diss_car12.mp4
6210,1071,888,488,diss_car12.mp4
6227,1071,898,488,diss_car12.mp4
6243,1071,908,488,diss_car12.mp4
6257,1071,921,488,diss_car12.mp4
6275,1071,931,488,diss_car12.mp4
6291,1071,941,488,diss_car12.mp4
6308,1071,951,487,diss_car12.mp4
6324,1071,958,486,diss_car12.mp4
6339,1071,965,486,diss_car12.mp4
6362,1071,973,486,diss_car12.mp4
6378,1071,978,486,diss_car12.mp4
6394,1071,982,485,diss_car12.mp4
6410,1071,986,484,diss_car12.mp4
6426,1071,990,484,diss_car12.mp4
6443,1071,994,483,diss_car12.mp4
6459,1071,999,482,diss_car12.mp4
6475,1071,1004,482,diss_car12.mp4
6493,1071,1008,481,diss_car12.mp4
6508,1071,1012,479,diss_car12.mp4
6523,1071,1017,479,diss_car12.mp4
6541,1071,1019,477,diss_car12.mp4
6550,1071,1022,476,diss_car12.mp4
6580,1071,1025,474,diss_car12.mp4
6596,1071,1027,472,diss_car12.mp4
6612,1071,1029,470,diss_car12.mp4
6628,1071,1031,468,diss_car12.mp4
6644,1071,1034,464,diss_car12.mp4
6660,1071,1036,459,diss_car12.mp4
6676,1071,1038,450,diss_car12.mp4
6692,1071,1041,441,diss_car12.mp4
6710,1071,1045,431,diss_car12.mp4
6726,1071,1047,423,diss_car12.mp4
6741,1071,1049,411,diss_car12.mp4
6758,1071,1049,399,diss_car12.mp4
6780,1071,1045,376,diss_car12.mp4
6790,1071,1045,371,diss_car12.mp4
6812,1071,1043,359,diss_car12.mp4
6823,1071,1043,355,diss_car12.mp4
6846,1071,1040,338,diss_car12.mp4
6862,1071,1036,325,diss_car12.mp4
6878,1071,1031,312,diss_car12.mp4
6894,1071,1026,298,diss_car12.mp4
6910,1071,1020,287,diss_car12.mp4
6927,1071,1016,278,diss_car12.mp4
6942,1071,1010,269,diss_car12.mp4
6961,1071,1003,259,diss_car12.mp4
6975,1071,998,250,diss_car12.mp4
6991,1071,990,240,diss_car12.mp4
7014,1071,984,230,diss_car12.mp4
7030,1071,980,225,diss_car12.mp4
7046,1071,977,219,diss_car12.mp4
7062,1071,972,213,diss_car12.mp4
7080,1071,965,205,diss_car12.mp4
7094,1071,955,194,diss_car12.mp4
7112,1071,947,188,diss_car12.mp4
7128,1071,942,185,diss_car12.mp4
7146,1071,939,183,diss_car12.mp4
7161,1071,934,179,diss_car12.mp4
7176,1071,929,176,diss_car12.mp4
7194,1071,920,174,diss_car12.mp4
7209,1071,914,171,diss_car12.mp4
7225,1071,910,171,diss_car12.mp4
7241,1071,907,170,diss_car12.mp4
7258,1071,904,170,diss_car12.mp4
7281,1071,898,168,diss_car12.mp4
7296,1071,889,168,diss_car12.mp4
7312,1071,879,166,diss_car12.mp4
7328,1071,870,166,diss_car12.mp4
7346,1071,864,166,diss_car12.mp4
7360,1071,859,165,diss_car12.mp4
7378,1071,852,164,diss_car12.mp4
7411,1071,832,164,diss_car12.mp4
7427,1071,822,164,diss_car12.mp4
7444,1071,813,166,diss_car12.mp4
7459,1071,807,167,diss_car12.mp4
7483,1071,800,169,diss_car12.mp4
7498,1071,795,170,diss_car12.mp4
7514,1071,790,172,diss_car12.mp4
7530,1071,785,173,diss_car12.mp4
7546,1071,780,176,diss_car12.mp4
7562,1071,773,178,diss_car12.mp4
7578,1071,764,182,diss_car12.mp4
7594,1071,753,186,diss_car12.mp4
7611,1071,739,195,diss_car12.mp4
7627,1071,726,206,diss_car12.mp4
7654,1071,699,236,diss_car12.mp4
7670,1071,680,268,diss_car12.mp4
7678,1071,671,284,diss_car12.mp4
7694,1071,649,324,diss_car12.mp4
7709,1071,633,357,diss_car12.mp4
7732,1071,616,397,diss_car12.mp4
7749,1071,610,420,diss_car12.mp4
7766,1071,603,438,diss_car12.mp4
7780,1071,599,452,diss_car12.mp4
7796,1071,597,460,diss_car12.mp4
7812,1071,595,465,diss_car12.mp4
7829,1071,593,468,diss_car12.mp4
7844,1071,592,472,diss_car12.mp4
7860,1071,590,475,diss_car12.mp4
7878,1071,589,476,diss_car12.mp4
7886,1071,588,476,diss_car12.mp4
7917,1071,586,478,diss_car12.mp4
7926,1071,584,478,diss_car12.mp4
7948,1071,576,481,diss_car12.mp4
7959,1071,573,482,diss_car12.mp4
7983,1071,562,488,diss_car12.mp4
7998,1071,552,494,diss_car12.mp4
8014,1071,542,500,diss_car12.mp4
8030,1071,533,503,diss_car12.mp4
8046,1071,526,506,diss_car12.mp4
8062,1071,520,506,diss_car12.mp4
8078,1071,515,508,diss_car12.mp4
8095,1071,512,509,diss_car12.mp4
8103,1071,512,510,diss_car12.mp4
8179,1071,512,511,diss_car12.mp4
8195,1071,516,512,diss_car12.mp4
8214,1071,528,513,diss_car12.mp4
8227,1071,556,513,diss_car12.mp4
8245,1071,612,510,diss_car12.mp4
8261,1071,694,497,diss_car12.mp4
8277,1071,802,481,diss_car12.mp4
8293,1071,919,465,diss_car12.mp4
8311,1071,1032,449,diss_car12.mp4
8332,1071,1169,432,diss_car12.mp4
8348,1071,1229,422,diss_car12.mp4
8357,1071,1250,420,diss_car12.mp4
8380,1071,1277,411,diss_car12.mp4
8745,1071,1266,385,diss_car12.mp4
8753,1071,1257,384,diss_car12.mp4
8767,1071,1244,384,diss_car12.mp4
8778,1071,1238,383,diss_car12.mp4
8798,1071,1232,382,diss_car12.mp4
8816,1071,1230,381,diss_car12.mp4
8833,1071,1228,381,diss_car12.mp4
8849,1071,1226,379,diss_car12.mp4
8865,1071,1224,377,diss_car12.mp4
8881,1071,1223,375,diss_car12.mp4
8898,1071,1219,369,diss_car12.mp4
8913,1071,1213,362,diss_car12.mp4
8928,1071,1208,356,diss_car12.mp4
8945,1071,1204,353,diss_car12.mp4
8962,1071,1201,350,diss_car12.mp4
8979,1071,1199,348,diss_car12.mp4
9040,1071,1198,348,diss_car12.mp4
9168,1071,1197,348,diss_car12.mp4
9192,1071,1196,348,diss_car12.mp4
9208,1071,1195,348,diss_car12.mp4
9225,1071,1193,348,diss_car12.mp4
9239,1071,1192,348,diss_car12.mp4
9247,1071,1189,348,diss_car12.mp4
9263,1071,1186,348,diss_car12.mp4
9280,1071,1183,349,diss_car12.mp4
9296,1071,1181,349,diss_car12.mp4
9311,1071,1177,349,diss_car12.mp4
9328,1071,1172,349,diss_car12.mp4
9345,1071,1166,349,diss_car12.mp4
9362,1071,1160,349,diss_car12.mp4
9384,1071,1153,349,diss_car12.mp4
9400,1071,1149,349,diss_car12.mp4
9416,1071,1145,349,diss_car12.mp4
9433,1071,1141,349,diss_car12.mp4
9449,1071,1137,349,diss_car12.mp4
9465,1071,1132,348,diss_car12.mp4
9472,1071,1130,348,diss_car12.mp4
9489,1071,1128,348,diss_car12.mp4
9513,1071,1126,348,diss_car12.mp4
9529,1071,1124,348,diss_car12.mp4
9545,1071,1122,348,diss_car12.mp4
9568,1071,1118,348,diss_car12.mp4
9584,1071,1113,348,diss_car12.mp4
9600,1071,1110,348,diss_car12.mp4
9616,1071,1107,349,diss_car12.mp4
9634,1071,1105,350,diss_car12.mp4
9651,1071,1101,351,diss_car12.mp4
9667,1071,1098,351,diss_car12.mp4
9683,1071,1095,351,diss_car12.mp4
9698,1071,1093,351,diss_car12.mp4
9714,1071,1091,352,diss_car12.mp4
9730,1071,1090,352,diss_car12.mp4
9739,1071,1089,352,diss_car12.mp4
9779,1071,1088,352,diss_car12.mp4
10019,1071,1088,351,diss_car12.mp4
10034,1071,1088,349,diss_car12.mp4
10050,1071,1090,347,diss_car12.mp4
10065,1071,1092,344,diss_car12.mp4
10081,1071,1094,340,diss_car12.mp4
10097,1071,1097,337,diss_car12.mp4
10113,1071,1099,333,diss_car12.mp4
10129,1071,1100,331,diss_car12.mp4
10152,1071,1101,329,diss_car12.mp4
10168,1071,1101,328,diss_car12.mp4
10177,1071,1102,328,diss_car12.mp4
10195,1071,1102,327,diss_car12.mp4
10263,1071,1102,326,diss_car12.mp4
10279,1071,1102,325,diss_car12.mp4
10302,1071,1102,324,diss_car12.mp4
10552,1071,1102,323,diss_car12.mp4
10584,1071,1102,322,diss_car12.mp4
10593,1071,1100,321,diss_car12.mp4
10616,1071,1097,319,diss_car12.mp4
10632,1071,1095,318,diss_car12.mp4
10648,1071,1092,316,diss_car12.mp4
10665,1071,1087,314,diss_car12.mp4
10681,1071,1084,312,diss_car12.mp4
10697,1071,1081,311,diss_car12.mp4
10715,1071,1079,309,diss_car12.mp4
10728,1071,1076,308,diss_car12.mp4
10747,1071,1075,307,diss_car12.mp4
10760,1071,1072,304,diss_car12.mp4
10779,1071,1068,302,diss_car12.mp4
10795,1071,1066,302,diss_car12.mp4
10811,1071,1065,301,diss_car12.mp4
10835,1071,1063,301,diss_car12.mp4
10875,1071,1062,301,diss_car12.mp4
10973,1071,1061,301,diss_car12.mp4
11011,1071,1060,301,diss_car12.mp4
11030,1071,1058,301,diss_car12.mp4
11044,1071,1057,301,diss_car12.mp4
11061,1071,1056,301,diss_car12.mp4
11137,1071,1055,302,diss_car12.mp4
11146,1071,1055,304,diss_car12.mp4
11169,1071,1054,312,diss_car12.mp4
11185,1071,1052,320,diss_car12.mp4
11201,1071,1048,329,diss_car12.mp4
11217,1071,1044,341,diss_car12.mp4
11234,1071,1040,355,diss_car12.mp4
11251,1071,1034,369,diss_car12.mp4
11265,1071,1031,379,diss_car12.mp4
11284,1071,1028,388,diss_car12.mp4
11296,1071,1027,397,diss_car12.mp4
11314,1071,1027,405,diss_car12.mp4
11331,1071,1027,414,diss_car12.mp4
11354,1071,1027,427,diss_car12.mp4
11370,1071,1027,434,diss_car12.mp4
11387,1071,1027,439,diss_car12.mp4
11402,1071,1028,444,diss_car12.mp4
11418,1071,1030,449,diss_car12.mp4
11434,1071,1034,453,diss_car12.mp4
11450,1071,1037,457,diss_car12.mp4
11466,1071,1040,460,diss_car12.mp4
11482,1071,1042,460,diss_car12.mp4
11499,1071,1044,462,diss_car12.mp4
11523,1071,1050,462,diss_car12.mp4
11532,1071,1052,463,diss_car12.mp4
11554,1071,1061,464,diss_car12.mp4
11562,1071,1064,464,diss_car12.mp4
11586,1071,1076,461,diss_car12.mp4
11604,1071,1083,456,diss_car12.mp4
11620,1071,1087,454,diss_car12.mp4
11637,1071,1091,452,diss_car12.mp4
11652,1071,1093,451,diss_car12.mp4
11669,1071,1096,450,diss_car12.mp4
11685,1071,1098,449,diss_car12.mp4
11692,1071,1099,449,diss_car12.mp4
12024,1071,1098,450,diss_car12.mp4
12039,1071,1092,453,diss_car12.mp4
12055,1071,1083,457,diss_car12.mp4
12070,1071,1075,463,diss_car12.mp4
12087,1071,1067,466,diss_car12.mp4
12095,1071,1063,468,diss_car12.mp4
12119,1071,1045,475,diss_car12.mp4
12137,1071,1025,480,diss_car12.mp4
12151,1071,997,487,diss_car12.mp4
12169,1071,975,495,diss_car12.mp4
12184,1071,958,500,diss_car12.mp4
12201,1071,946,502,diss_car12.mp4
12217,1071,937,502,diss_car12.mp4
12233,1071,929,502,diss_car12.mp4
12249,1071,919,502,diss_car12.mp4
12265,1071,913,501,diss_car12.mp4
12281,1071,911,501,diss_car12.mp4
12296,1071,910,501,diss_car12.mp4
12320,1071,907,500,diss_car12.mp4
12336,1071,903,499,diss_car12.mp4
12353,1071,896,497,diss_car12.mp4
12360,1071,891,496,diss_car12.mp4
12385,1071,879,494,diss_car12.mp4
12395,1071,877,494,diss_car12.mp4
12409,1071,876,494,diss_car12.mp4
12503,1071,876,492,diss_car12.mp4
12519,1071,876,491,diss_car12.mp4
12534,1071,876,489,diss_car12.mp4
12551,1071,877,488,diss_car12.mp4
12559,1071,878,486,diss_car12.mp4
12575,1071,878,485,diss_car12.mp4
12599,1071,878,484,diss_car12.mp4
12615,1071,878,483,diss_car12.mp4
12622,1071,878,482,diss_car12.mp4
12655,1071,878,481,diss_car12.mp4
12663,1071,877,481,diss_car12.mp4
12689,1071,874,480,diss_car12.mp4
12702,1071,872,479,diss_car12.mp4
12721,1071,868,479,diss_car12.mp4
12736,1071,864,479,diss_car12.mp4
12753,1071,859,479,diss_car12.mp4
12769,1071,852,478,diss_car12.mp4
12784,1071,846,477,diss_car12.mp4
12802,1071,838,476,diss_car12.mp4
12817,1071,830,475,diss_car12.mp4
12833,1071,824,475,diss_car12.mp4
12849,1071,819,475,diss_car12.mp4
12872,1071,815,474,diss_car12.mp4
12880,1071,814,474,diss_car12.mp4
12905,1071,810,474,diss_car12.mp4
12920,1071,807,474,diss_car12.mp4
12937,1071,805,474,diss_car12.mp4
12953,1071,800,474,diss_car12.mp4
12971,1071,797,474,diss_car12.mp4
12985,1071,794,474,diss_car12.mp4
13002,1071,792,475,diss_car12.mp4
13017,1071,789,475,diss_car12.mp4
13036,1071,785,476,diss_car12.mp4
13051,1071,780,477,diss_car12.mp4
13068,1071,774,477,diss_car12.mp4
13083,1071,768,478,diss_car12.mp4
13099,1071,765,479,diss_car12.mp4
13122,1071,761,480,diss_car12.mp4
13139,1071,757,481,diss_car12.mp4
13155,1071,754,481,diss_car12.mp4
13171,1071,752,481,diss_car12.mp4
13187,1071,749,482,diss_car12.mp4
13203,1071,746,483,diss_car12.mp4
13218,1071,745,483,diss_car12.mp4
13298,1071,744,483,diss_car12.mp4
13305,1071,743,483,diss_car12.mp4
13322,1071,738,484,diss_car12.mp4
13337,1071,736,484,diss_car12.mp4
13353,1071,734,484,diss_car12.mp4
13369,1071,732,484,diss_car12.mp4
13385,1071,730,484,diss_car12.mp4
13471,1071,729,484,diss_car12.mp4
13541,1071,728,484,diss_car12.mp4
13551,1071,727,484,diss_car12.mp4
13568,1071,723,484,diss_car12.mp4
13590,1071,719,482,diss_car12.mp4
13606,1071,715,482,diss_car12.mp4
13623,1071,713,482,diss_car12.mp4
13639,1071,712,482,diss_car12.mp4
13655,1071,710,482,diss_car12.mp4
13671,1071,709,481,diss_car12.mp4
13687,1071,706,481,diss_car12.mp4
13704,1071,705,481,diss_car12.mp4
13711,1071,704,481,diss_car12.mp4
13734,1071,703,481,diss_car12.mp4
13789,1071,702,481,diss_car12.mp4
13811,1071,701,481,diss_car12.mp4
13819,1071,700,480,diss_car12.mp4
13828,1071,699,480,diss_car12.mp4
13844,1071,698,480,diss_car12.mp4
13869,1071,697,480,diss_car12.mp4
13877,1071,696,480,diss_car12.mp4
13902,1071,694,480,diss_car12.mp4
13925,1071,692,480,diss_car12.mp4
13940,1071,691,480,diss_car12.mp4
13957,1071,689,480,diss_car12.mp4
13965,1071,688,480,diss_car12.mp4
13989,1071,685,480,diss_car12.mp4
14004,1071,684,479,diss_car12.mp4
14021,1071,683,479,diss_car12.mp4
14098,1071,682,479,diss_car12.mp4
14123,1071,680,479,diss_car12.mp4
14139,1071,679,479,diss_car12.mp4
14155,1071,677,479,diss_car12.mp4
14171,1071,676,479,diss_car12.mp4
14187,1071,675,479,diss_car12.mp4
14203,1071,673,479,diss_car12.mp4
14219,1071,672,479,diss_car12.mp4
14235,1071,668,479,diss_car12.mp4
14251,1071,664,479,diss_car12.mp4
14267,1071,660,479,diss_car12.mp4
14283,1071,655,479,diss_car12.mp4
14306,1071,640,481,diss_car12.mp4
14322,1071,628,482,diss_car12.mp4
14338,1071,613,484,diss_car12.mp4
14354,1071,600,487,diss_car12.mp4
14372,1071,589,489,diss_car12.mp4
14387,1071,578,491,diss_car12.mp4
14406,1071,568,492,diss_car12.mp4
14421,1071,560,493,diss_car12.mp4
14436,1071,554,494,diss_car12.mp4
14454,1071,549,494,diss_car12.mp4
14470,1071,545,494,diss_car12.mp4
14485,1071,541,495,diss_car12.mp4
14509,1071,535,496,diss_car12.mp4
14524,1071,533,497,diss_car12.mp4
14659,1071,532,497,diss_car12.mp4
14676,1071,531,497,diss_car12.mp4
14691,1071,530,497,diss_car12.mp4
14785,1071,529,497,diss_car12.mp4
14808,1071,528,497,diss_car12.mp4
14824,1071,526,497,diss_car12.mp4
14839,1071,524,497,diss_car12.mp4
14854,1071,520,497,diss_car12.mp4
14870,1071,515,497,diss_car12.mp4
14887,1071,508,497,diss_car12.mp4
14902,1071,503,497,diss_car12.mp4
14921,1071,499,497,diss_car12.mp4
14942,1071,496,496,diss_car12.mp4
14961,1071,494,495,diss_car12.mp4
14978,1071,493,495,diss_car12.mp4
14992,1071,490,495,diss_car12.mp4
15008,1071,487,495,diss_car12.mp4
15025,1071,484,494,diss_car12.mp4
15033,1071,483,494,diss_car12.mp4
15048,1071,482,494,diss_car12.mp4
15064,1071,481,494,diss_car12.mp4
15089,1071,479,494,diss_car12.mp4
15105,1071,478,494,diss_car12.mp4
15121,1071,476,494,diss_car12.mp4
15137,1071,475,494,diss_car12.mp4
15145,1071,475,493,diss_car12.mp4
15161,1071,474,493,diss_car12.mp4
15192,1071,472,493,diss_car12.mp4
0,1070,627,368,diss_building4.mp4
23,1070,635,393,diss_building4.mp4
39,1070,642,421,diss_building4.mp4
54,1070,643,447,diss_building4.mp4
72,1070,644,470,diss_building4.mp4
90,1070,644,485,diss_building4.mp4
104,1070,643,494,diss_building4.mp4
121,1070,640,501,diss_building4.mp4
137,1070,637,509,diss_building4.mp4
153,1070,634,515,diss_building4.mp4
169,1070,630,521,diss_building4.mp4
185,1070,627,527,diss_building4.mp4
208,1070,621,540,diss_building4.mp4
216,1070,618,547,diss_building4.mp4
240,1070,609,569,diss_building4.mp4
256,1070,605,581,diss_building4.mp4
280,1070,600,593,diss_building4.mp4
304,1070,598,600,diss_building4.mp4
312,1070,598,601,diss_building4.mp4
607,1070,598,602,diss_building4.mp4
629,1070,598,603,diss_building4.mp4
636,1070,598,604,diss_building4.mp4
653,1070,603,606,diss_building4.mp4
678,1070,617,609,diss_building4.mp4
692,1070,628,609,diss_building4.mp4
708,1070,639,609,diss_building4.mp4
724,1070,651,608,diss_building4.mp4
741,1070,665,607,diss_building4.mp4
756,1070,680,606,diss_building4.mp4
773,1070,694,604,diss_building4.mp4
790,1070,700,602,diss_building4.mp4
805,1070,703,601,diss_building4.mp4
814,1070,703,600,diss_building4.mp4
836,1070,703,598,diss_building4.mp4
852,1070,703,597,diss_building4.mp4
869,1070,703,595,diss_building4.mp4
892,1070,703,593,diss_building4.mp4
909,1070,703,590,diss_building4.mp4
929,1070,700,587,diss_building4.mp4
942,1070,694,583,diss_building4.mp4
958,1070,690,579,diss_building4.mp4
974,1070,686,578,diss_building4.mp4
990,1070,684,577,diss_building4.mp4
1006,1070,683,577,diss_building4.mp4
1022,1070,681,577,diss_building4.mp4
1055,1070,679,576,diss_building4.mp4
1210,1070,679,575,diss_building4.mp4
1273,1070,672,556,diss_building4.mp4
1288,1070,672,550,diss_building4.mp4
1305,1070,672,545,diss_building4.mp4
1321,1070,671,541,diss_building4.mp4
1346,1070,670,535,diss_building4.mp4
1360,1070,670,532,diss_building4.mp4
1377,1070,670,530,diss_building4.mp4
1394,1070,670,528,diss_building4.mp4
1402,1070,670,526,diss_building4.mp4
1424,1070,670,524,diss_building4.mp4
1448,1070,671,522,diss_building4.mp4
1464,1070,671,521,diss_building4.mp4
1480,1070,671,520,diss_building4.mp4
1491,1070,672,520,diss_building4.mp4
1508,1070,672,518,diss_building4.mp4
1523,1070,672,517,diss_building4.mp4
1549,1070,673,516,diss_building4.mp4
1564,1070,673,515,diss_building4.mp4
1572,1070,674,514,diss_building4.mp4
1587,1070,675,513,diss_building4.mp4
1610,1070,676,510,diss_building4.mp4
1626,1070,678,508,diss_building4.mp4
1643,1070,680,506,diss_building4.mp4
1659,1070,682,504,diss_building4.mp4
1675,1070,684,502,diss_building4.mp4
1682,1070,686,500,diss_building4.mp4
1708,1070,688,497,diss_building4.mp4
1725,1070,691,495,diss_building4.mp4
1739,1070,695,493,diss_building4.mp4
1756,1070,699,491,diss_building4.mp4
1772,1070,704,488,diss_building4.mp4
1789,1070,708,488,diss_building4.mp4
1804,1070,713,488,diss_building4.mp4
1820,1070,719,488,diss_building4.mp4
1846,1070,728,490,diss_building4.mp4
1860,1070,735,491,diss_building4.mp4
1876,1070,739,493,diss_building4.mp4
1892,1070,743,493,diss_building4.mp4
1909,1070,746,493,diss_building4.mp4
1925,1070,748,493,diss_building4.mp4
1940,1070,749,493,diss_building4.mp4
2009,1070,750,494,diss_building4.mp4
2015,1070,751,495,diss_building4.mp4
2046,1070,753,501,diss_building4.mp4
2061,1070,755,508,diss_building4.mp4
2070,1070,757,513,diss_building4.mp4
2088,1070,759,523,diss_building4.mp4
2102,1070,760,527,diss_building4.mp4
2128,1070,760,530,diss_building4.mp4
2158,1070,760,531,diss_building4.mp4
2174,1070,761,533,diss_building4.mp4
2182,1070,761,534,diss_building4.mp4
2190,1070,761,536,diss_building4.mp4
2207,1070,761,539,diss_building4.mp4
2223,1070,761,543,diss_building4.mp4
2239,1070,761,545,diss_building4.mp4
2255,1070,761,547,diss_building4.mp4
2262,1070,761,548,diss_building4.mp4
2554,1070,762,548,diss_building4.mp4
2561,1070,763,548,diss_building4.mp4
2582,1070,765,547,diss_building4.mp4
2603,1070,771,545,diss_building4.mp4
2626,1070,776,541,diss_building4.mp4
2642,1070,778,538,diss_building4.mp4
2658,1070,781,535,diss_building4.mp4
2674,1070,785,530,diss_building4.mp4
2691,1070,789,526,diss_building4.mp4
2707,1070,792,522,diss_building4.mp4
2723,1070,795,518,diss_building4.mp4
2738,1070,798,516,diss_building4.mp4
2755,1070,801,513,diss_building4.mp4
2794,1070,807,506,diss_building4.mp4
2810,1070,809,504,diss_building4.mp4
2826,1070,810,499,diss_building4.mp4
2842,1070,810,496,diss_building4.mp4
2860,1070,810,493,diss_building4.mp4
2875,1070,810,490,diss_building4.mp4
2884,1070,810,489,diss_building4.mp4
2911,1070,810,487,diss_building4.mp4
2925,1070,810,485,diss_building4.mp4
2941,1070,808,482,diss_building4.mp4
2956,1070,807,480,diss_building4.mp4
2972,1070,805,478,diss_building4.mp4
2991,1070,803,476,diss_building4.mp4
3012,1070,801,475,diss_building4.mp4
3028,1070,800,473,diss_building4.mp4
3044,1070,799,472,diss_building4.mp4
3061,1070,797,470,diss_building4.mp4
3076,1070,793,468,diss_building4.mp4
3094,1070,785,465,diss_building4.mp4
3108,1070,776,462,diss_building4.mp4
3125,1070,765,460,diss_building4.mp4
3141,1070,751,457,diss_building4.mp4
3158,1070,731,453,diss_building4.mp4
3176,1070,706,451,diss_building4.mp4
3191,1070,684,451,diss_building4.mp4
3215,1070,659,454,diss_building4.mp4
3224,1070,652,455,diss_building4.mp4
3246,1070,633,460,diss_building4.mp4
3262,1070,620,464,diss_building4.mp4
3278,1070,610,468,diss_building4.mp4
3295,1070,598,471,diss_building4.mp4
3311,1070,588,474,diss_building4.mp4
3326,1070,578,478,diss_building4.mp4
3342,1070,570,481,diss_building4.mp4
3358,1070,562,486,diss_building4.mp4
3376,1070,553,490,diss_building4.mp4
3392,1070,544,495,diss_building4.mp4
3407,1070,533,499,diss_building4.mp4
3425,1070,524,502,diss_building4.mp4
3452,1070,512,506,diss_building4.mp4
3466,1070,505,507,diss_building4.mp4
3474,1070,502,507,diss_building4.mp4
3496,1070,491,510,diss_building4.mp4
3512,1070,485,512,diss_building4.mp4
3527,1070,480,513,diss_building4.mp4
3544,1070,478,514,diss_building4.mp4
3553,1070,476,514,diss_building4.mp4
3577,1070,474,514,diss_building4.mp4
3594,1070,471,514,diss_building4.mp4
3603,1070,470,514,diss_building4.mp4
3625,1070,468,514,diss_building4.mp4
3641,1070,468,515,diss_building4.mp4
3650,1070,467,515,diss_building4.mp4
3758,1070,469,515,diss_building4.mp4
3779,1070,479,511,diss_building4.mp4
3794,1070,485,509,diss_building4.mp4
3811,1070,489,506,diss_building4.mp4
3828,1070,492,503,diss_building4.mp4
3843,1070,495,502,diss_building4.mp4
3859,1070,499,501,diss_building4.mp4
3868,1070,500,501,diss_building4.mp4
3891,1070,509,499,diss_building4.mp4
3907,1070,518,498,diss_building4.mp4
3931,1070,539,493,diss_building4.mp4
3946,1070,556,489,diss_building4.mp4
3962,1070,577,485,diss_building4.mp4
3978,1070,599,478,diss_building4.mp4
3994,1070,617,474,diss_building4.mp4
4011,1070,626,472,diss_building4.mp4
4030,1070,632,472,diss_building4.mp4
4052,1070,640,472,diss_building4.mp4
4060,1070,642,472,diss_building4.mp4
4076,1070,647,472,diss_building4.mp4
4092,1070,653,472,diss_building4.mp4
4110,1070,659,472,diss_building4.mp4
4125,1070,665,473,diss_building4.mp4
4141,1070,670,474,diss_building4.mp4
4164,1070,677,474,diss_building4.mp4
4180,1070,679,474,diss_building4.mp4
4196,1070,680,474,diss_building4.mp4
4212,1070,681,474,diss_building4.mp4
4224,1070,682,474,diss_building4.mp4
4476,1070,682,475,diss_building4.mp4
4495,1070,682,477,diss_building4.mp4
4511,1070,680,479,diss_building4.mp4
4527,1070,679,483,diss_building4.mp4
4543,1070,677,487,diss_building4.mp4
4560,1070,677,492,diss_building4.mp4
4575,1070,676,494,diss_building4.mp4
5513,1070,676,495,diss_building4.mp4
5528,1070,675,497,diss_building4.mp4
5543,1070,670,503,diss_building4.mp4
5560,1070,666,508,diss_building4.mp4
5582,1070,656,517,diss_building4.mp4
5599,1070,649,524,diss_building4.mp4
5614,1070,644,530,diss_building4.mp4
5631,1070,642,534,diss_building4.mp4
5646,1070,640,535,diss_building4.mp4
5654,1070,639,536,diss_building4.mp4
5670,1070,638,537,diss_building4.mp4
5686,1070,637,538,diss_building4.mp4
5718,1070,634,541,diss_building4.mp4
5736,1070,634,542,diss_building4.mp4
5743,1070,632,543,diss_building4.mp4
5762,1070,630,545,diss_building4.mp4
5777,1070,628,549,diss_building4.mp4
5793,1070,623,553,diss_building4.mp4
5816,1070,621,555,diss_building4.mp4
5832,1070,621,556,diss_building4.mp4
5945,1070,620,556,diss_building4.mp4
5969,1070,619,556,diss_building4.mp4
5977,1070,618,556,diss_building4.mp4
5995,1070,617,556,diss_building4.mp4
6009,1070,615,556,diss_building4.mp4
6027,1070,614,557,diss_building4.mp4
6050,1070,609,561,diss_building4.mp4
6067,1070,605,567,diss_building4.mp4
6082,1070,603,572,diss_building4.mp4
6099,1070,600,578,diss_building4.mp4
6114,1070,598,584,diss_building4.mp4
6130,1070,598,589,diss_building4.mp4
6147,1070,598,592,diss_building4.mp4
6162,1070,597,595,diss_building4.mp4
6171,1070,597,596,diss_building4.mp4
6232,1070,597,597,diss_building4.mp4
6283,1070,597,598,diss_building4.mp4
6309,1070,597,600,diss_building4.mp4
6333,1070,600,603,diss_building4.mp4
6357,1070,606,610,diss_building4.mp4
6365,1070,609,612,diss_building4.mp4
6380,1070,613,616,diss_building4.mp4
6397,1070,616,618,diss_building4.mp4
6413,1070,620,621,diss_building4.mp4
6429,1070,621,622,diss_building4.mp4
6445,1070,623,623,diss_building4.mp4
6461,1070,625,623,diss_building4.mp4
6484,1070,629,624,diss_building4.mp4
6516,1070,636,626,diss_building4.mp4
6533,1070,639,626,diss_building4.mp4
6549,1070,641,627,diss_building4.mp4
6566,1070,643,627,diss_building4.mp4
6591,1070,650,628,diss_building4.mp4
6606,1070,654,629,diss_building4.mp4
6614,1070,655,629,diss_building4.mp4
6646,1070,659,629,diss_building4.mp4
6663,1070,660,629,diss_building4.mp4
6678,1070,661,629,diss_building4.mp4
6687,1070,662,629,diss_building4.mp4
6710,1070,667,630,diss_building4.mp4
6734,1070,672,630,diss_building4.mp4
6743,1070,673,630,diss_building4.mp4
6782,1070,675,630,diss_building4.mp4
6798,1070,676,630,diss_building4.mp4
6822,1070,677,630,diss_building4.mp4
6847,1070,677,629,diss_building4.mp4
6873,1070,677,628,diss_building4.mp4
6898,1070,676,627,diss_building4.mp4
6914,1070,672,623,diss_building4.mp4
6929,1070,666,619,diss_building4.mp4
6945,1070,662,616,diss_building4.mp4
6961,1070,657,615,diss_building4.mp4
6984,1070,647,612,diss_building4.mp4
6993,1070,640,610,diss_building4.mp4
7016,1070,608,602,diss_building4.mp4
7033,1070,581,595,diss_building4.mp4
7048,1070,557,593,diss_building4.mp4
7065,1070,542,592,diss_building4.mp4
7081,1070,535,592,diss_building4.mp4
7098,1070,530,591,diss_building4.mp4
7104,1070,529,591,diss_building4.mp4
7196,1070,529,590,diss_building4.mp4
7213,1070,530,588,diss_building4.mp4
7235,1070,534,578,diss_building4.mp4
7252,1070,536,568,diss_building4.mp4
7267,1070,538,562,diss_building4.mp4
7283,1070,539,558,diss_building4.mp4
7298,1070,541,554,diss_building4.mp4
7314,1070,541,553,diss_building4.mp4
7331,1070,542,551,diss_building4.mp4
7347,1070,543,548,diss_building4.mp4
7364,1070,545,545,diss_building4.mp4
7387,1070,549,539,diss_building4.mp4
7396,1070,551,537,diss_building4.mp4
7421,1070,559,531,diss_building4.mp4
7427,1070,563,528,diss_building4.mp4
7445,1070,574,520,diss_building4.mp4
7468,1070,595,510,diss_building4.mp4
7484,1070,611,504,diss_building4.mp4
7500,1070,629,501,diss_building4.mp4
7516,1070,646,498,diss_building4.mp4
7532,1070,660,495,diss_building4.mp4
7556,1070,671,491,diss_building4.mp4
7565,1070,673,491,diss_building4.mp4
7581,1070,674,490,diss_building4.mp4
7597,1070,676,489,diss_building4.mp4
7613,1070,679,486,diss_building4.mp4
7629,1070,682,483,diss_building4.mp4
7652,1070,685,479,diss_building4.mp4
7668,1070,686,477,diss_building4.mp4
7676,1070,687,476,diss_building4.mp4
7701,1070,691,472,diss_building4.mp4
7718,1070,693,470,diss_building4.mp4
7734,1070,696,467,diss_building4.mp4
7750,1070,698,465,diss_building4.mp4
7766,1070,703,464,diss_building4.mp4
7783,1070,709,462,diss_building4.mp4
7799,1070,715,460,diss_building4.mp4
7815,1070,724,457,diss_building4.mp4
7830,1070,732,455,diss_building4.mp4
7847,1070,740,453,diss_building4.mp4
7863,1070,749,451,diss_building4.mp4
7882,1070,757,450,diss_building4.mp4
7902,1070,767,448,diss_building4.mp4
7918,1070,774,448,diss_building4.mp4
7934,1070,781,448,diss_building4.mp4
7952,1070,785,448,diss_building4.mp4
7966,1070,789,449,diss_building4.mp4
8105,1070,789,448,diss_building4.mp4
8114,1070,789,447,diss_building4.mp4
8136,1070,780,441,diss_building4.mp4
8153,1070,768,433,diss_building4.mp4
8170,1070,754,428,diss_building4.mp4
8184,1070,742,426,diss_building4.mp4
8200,1070,732,425,diss_building4.mp4
8216,1070,719,425,diss_building4.mp4
8232,1070,706,425,diss_building4.mp4
8250,1070,694,426,diss_building4.mp4
8266,1070,685,428,diss_building4.mp4
8282,1070,681,430,diss_building4.mp4
8299,1070,680,430,diss_building4.mp4
9016,1070,679,430,diss_building4.mp4
9030,1070,678,430,diss_building4.mp4
9040,1070,677,430,diss_building4.mp4
9063,1070,675,430,diss_building4.mp4
9086,1070,674,430,diss_building4.mp4
9298,1070,674,429,diss_building4.mp4
9320,1070,673,429,diss_building4.mp4
9345,1070,673,428,diss_building4.mp4
9368,1070,673,427,diss_building4.mp4
9395,1070,673,426,diss_building4.mp4
9411,1070,673,425,diss_building4.mp4
9426,1070,673,424,diss_building4.mp4
9442,1070,672,423,diss_building4.mp4
9451,1070,672,421,diss_building4.mp4
9468,1070,671,416,diss_building4.mp4
9483,1070,669,410,diss_building4.mp4
9499,1070,665,402,diss_building4.mp4
9522,1070,657,393,diss_building4.mp4
9538,1070,654,388,diss_building4.mp4
9554,1070,652,385,diss_building4.mp4
9570,1070,650,383,diss_building4.mp4
9587,1070,649,382,diss_building4.mp4
9595,1070,649,381,diss_building4.mp4
9626,1070,649,380,diss_building4.mp4
9676,1070,649,379,diss_building4.mp4
9708,1070,649,378,diss_building4.mp4
9749,1070,649,376,diss_building4.mp4
9765,1070,649,375,diss_building4.mp4
9788,1070,649,373,diss_building4.mp4
9797,1070,649,372,diss_building4.mp4
9813,1070,649,371,diss_building4.mp4
9829,1070,649,370,diss_building4.mp4
15196,1070,649,371,diss_building4.mp4
15211,1070,653,378,diss_building4.mp4
15226,1070,658,386,diss_building4.mp4
15242,1070,663,393,diss_building4.mp4
15258,1070,666,398,diss_building4.mp4
15275,1070,670,404,diss_building4.mp4
15292,1070,672,408,diss_building4.mp4
15299,1070,672,409,diss_building4.mp4
15323,1070,673,411,diss_building4.mp4
15338,1070,674,412,diss_building4.mp4
15362,1070,675,414,diss_building4.mp4
15378,1070,676,416,diss_building4.mp4
15394,1070,678,418,diss_building4.mp4
15412,1070,680,420,diss_building4.mp4
15428,1070,683,422,diss_building4.mp4
15445,1070,687,424,diss_building4.mp4
15461,1070,689,425,diss_building4.mp4
15477,1070,692,426,diss_building4.mp4
15493,1070,695,427,diss_building4.mp4
15509,1070,697,427,diss_building4.mp4
15525,1070,700,428,diss_building4.mp4
15533,1070,701,428,diss_building4.mp4
15549,1070,702,428,diss_building4.mp4
15565,1070,703,428,diss_building4.mp4
15596,1070,707,429,diss_building4.mp4
15612,1070,715,434,diss_building4.mp4
15628,1070,726,439,diss_building4.mp4
15661,1070,739,447,diss_building4.mp4
15678,1070,744,449,diss_building4.mp4
15694,1070,747,452,diss_building4.mp4
15710,1070,750,455,diss_building4.mp4
15719,1070,752,456,diss_building4.mp4
15758,1070,753,458,diss_building4.mp4
15774,1070,753,459,diss_building4.mp4
15791,1070,754,460,diss_building4.mp4
15807,1070,755,461,diss_building4.mp4
15830,1070,758,466,diss_building4.mp4
15846,1070,762,472,diss_building4.mp4
15863,1070,765,476,diss_building4.mp4
15879,1070,768,480,diss_building4.mp4
15895,1070,769,483,diss_building4.mp4
15911,1070,770,484,diss_building4.mp4
15918,1070,771,485,diss_building4.mp4
15943,1070,772,488,diss_building4.mp4
15959,1070,773,490,diss_building4.mp4
15977,1070,773,491,diss_building4.mp4
16275,1070,772,490,diss_building4.mp4
16283,1070,769,489,diss_building4.mp4
16291,1070,762,486,diss_building4.mp4
16306,1070,745,476,diss_building4.mp4
16330,1070,720,467,diss_building4.mp4
16346,1070,704,462,diss_building4.mp4
16363,1070,690,457,diss_building4.mp4
16379,1070,677,453,diss_building4.mp4
16394,1070,667,450,diss_building4.mp4
16412,1070,658,448,diss_building4.mp4
16426,1070,652,447,diss_building4.mp4
16443,1070,649,447,diss_building4.mp4
16451,1070,648,447,diss_building4.mp4
16475,1070,647,447,diss_building4.mp4
16483,1070,646,447,diss_building4.mp4
16514,1070,641,448,diss_building4.mp4
16525,1070,640,448,diss_building4.mp4
16549,1070,632,455,diss_building4.mp4
16564,1070,625,461,diss_building4.mp4
16580,1070,618,467,diss_building4.mp4
16597,1070,609,476,diss_building4.mp4
16613,1070,600,488,diss_building4.mp4
16629,1070,591,501,diss_building4.mp4
16645,1070,584,514,diss_building4.mp4
16660,1070,580,521,diss_building4.mp4
16676,1070,578,524,diss_building4.mp4
16685,1070,578,525,diss_building4.mp4
16778,1070,578,524,diss_building4.mp4
16794,1070,577,523,diss_building4.mp4
16812,1070,577,522,diss_building4.mp4
16827,1070,577,520,diss_building4.mp4
16843,1070,576,518,diss_building4.mp4
16859,1070,575,514,diss_building4.mp4
16875,1070,573,508,diss_building4.mp4
16891,1070,571,500,diss_building4.mp4
16907,1070,568,490,diss_building4.mp4
16931,1070,566,482,diss_building4.mp4
16946,1070,565,478,diss_building4.mp4
16962,1070,563,474,diss_building4.mp4
16978,1070,561,469,diss_building4.mp4
16995,1070,558,464,diss_building4.mp4
17010,1070,555,459,diss_building4.mp4
17026,1070,554,455,diss_building4.mp4
17043,1070,552,451,diss_building4.mp4
17059,1070,550,446,diss_building4.mp4
17076,1070,549,444,diss_building4.mp4
17092,1070,548,443,diss_building4.mp4
17114,1070,548,440,diss_building4.mp4
17125,1070,548,437,diss_building4.mp4
17141,1070,548,433,diss_building4.mp4
17164,1070,551,424,diss_building4.mp4
17180,1070,557,417,diss_building4.mp4
17196,1070,564,410,diss_building4.mp4
17212,1070,571,403,diss_building4.mp4
17228,1070,577,397,diss_building4.mp4
17244,1070,583,392,diss_building4.mp4
17260,1070,589,385,diss_building4.mp4
17278,1070,596,377,diss_building4.mp4
17302,1070,604,366,diss_building4.mp4
17310,1070,606,364,diss_building4.mp4
17325,1070,607,362,diss_building4.mp4
17348,1070,608,360,diss_building4.mp4
17738,1070,608,361,diss_building4.mp4
17754,1070,608,362,diss_building4.mp4
17768,1070,608,363,diss_building4.mp4
17802,1070,608,364,diss_building4.mp4
17832,1070,608,370,diss_building4.mp4
17841,1070,610,375,diss_building4.mp4
17864,1070,624,404,diss_building4.mp4
17881,1070,636,423,diss_building4.mp4
17896,1070,648,435,diss_building4.mp4
17912,1070,655,442,diss_building4.mp4
17929,1070,661,446,diss_building4.mp4
17947,1070,662,447,diss_building4.mp4
17952,1070,663,447,diss_building4.mp4
18018,1070,664,447,diss_building4.mp4
18087,1070,664,446,diss_building4.mp4
18111,1070,665,446,diss_building4.mp4
18438,1070,665,447,diss_building4.mp4
19212,1070,662,447,diss_building4.mp4
19220,1070,661,446,diss_building4.mp4
19234,1070,656,444,diss_building4.mp4
19250,1070,647,442,diss_building4.mp4
19266,1070,631,437,diss_building4.mp4
19282,1070,615,434,diss_building4.mp4
19299,1070,600,432,diss_building4.mp4
19317,1070,589,431,diss_building4.mp4
19331,1070,582,431,diss_building4.mp4
19349,1070,578,430,diss_building4.mp4
19362,1070,576,429,diss_building4.mp4
19382,1070,574,429,diss_building4.mp4
19389,1070,573,429,diss_building4.mp4
19413,1070,572,429,diss_building4.mp4
19429,1070,571,428,diss_building4.mp4
19437,1070,570,428,diss_building4.mp4
19454,1070,569,428,diss_building4.mp4
19478,1070,568,428,diss_building4.mp4
19501,1070,566,428,diss_building4.mp4
19517,1070,565,427,diss_building4.mp4
19533,1070,562,427,diss_building4.mp4
19548,1070,560,426,diss_building4.mp4
19565,1070,559,426,diss_building4.mp4
19580,1070,557,426,diss_building4.mp4
19598,1070,555,426,diss_building4.mp4
19613,1070,553,426,diss_building4.mp4
19631,1070,550,426,diss_building4.mp4
19645,1070,548,426,diss_building4.mp4
19663,1070,546,426,diss_building4.mp4
19792,1070,546,427,diss_building4.mp4
19802,1070,545,428,diss_building4.mp4
19818,1070,544,430,diss_building4.mp4
19832,1070,543,436,diss_building4.mp4
19847,1070,543,445,diss_building4.mp4
19863,1070,543,457,diss_building4.mp4
19879,1070,547,473,diss_building4.mp4
19902,1070,552,487,diss_building4.mp4
19911,1070,553,490,diss_building4.mp4
19930,1070,554,493,diss_building4.mp4
19946,1070,555,494,diss_building4.mp4
20234,1070,556,494,diss_building4.mp4
20251,1070,559,495,diss_building4.mp4
20266,1070,566,497,diss_building4.mp4
20282,1070,579,500,diss_building4.mp4
20299,1070,593,503,diss_building4.mp4
20315,1070,606,505,diss_building4.mp4
20332,1070,618,508,diss_building4.mp4
20347,1070,632,512,diss_building4.mp4
20363,1070,648,517,diss_building4.mp4
20380,1070,659,523,diss_building4.mp4
20402,1070,668,527,diss_building4.mp4
20410,1070,670,527,diss_building4.mp4
20435,1070,671,528,diss_building4.mp4
20498,1070,672,528,diss_building4.mp4
20514,1070,673,528,diss_building4.mp4
20529,1070,675,528,diss_building4.mp4
20544,1070,679,529,diss_building4.mp4
20569,1070,686,529,diss_building4.mp4
20584,1070,692,530,diss_building4.mp4
20600,1070,702,530,diss_building4.mp4
20616,1070,712,530,diss_building4.mp4
20633,1070,722,530,diss_building4.mp4
20650,1070,729,530,diss_building4.mp4
20665,1070,734,529,diss_building4.mp4
20681,1070,735,528,diss_building4.mp4
20887,1070,732,528,diss_building4.mp4
20904,1070,727,529,diss_building4.mp4
20920,1070,717,531,diss_building4.mp4
20935,1070,705,533,diss_building4.mp4
20951,1070,689,534,diss_building4.mp4
20966,1070,670,534,diss_building4.mp4
20984,1070,647,530,diss_building4.mp4
20999,1070,625,523,diss_building4.mp4
21015,1070,604,517,diss_building4.mp4
21031,1070,589,510,diss_building4.mp4
21049,1070,578,505,diss_building4.mp4
21065,1070,570,501,diss_building4.mp4
21081,1070,564,495,diss_building4.mp4
21105,1070,556,486,diss_building4.mp4
21120,1070,552,479,diss_building4.mp4
21136,1070,547,471,diss_building4.mp4
21153,1070,544,463,diss_building4.mp4
21169,1070,542,456,diss_building4.mp4
21184,1070,540,450,diss_building4.mp4
21200,1070,536,443,diss_building4.mp4
21217,1070,532,435,diss_building4.mp4
21232,1070,524,425,diss_building4.mp4
21249,1070,513,416,diss_building4.mp4
21265,1070,503,410,diss_building4.mp4
21281,1070,495,406,diss_building4.mp4
21297,1070,488,404,diss_building4.mp4
21320,1070,482,402,diss_building4.mp4
21329,1070,481,402,diss_building4.mp4
21354,1070,477,402,diss_building4.mp4
21362,1070,476,402,diss_building4.mp4
21379,1070,475,402,diss_building4.mp4
21403,1070,474,401,diss_building4.mp4
21427,1070,473,400,diss_building4.mp4
21443,1070,473,399,diss_building4.mp4
21450,1070,472,398,diss_building4.mp4
21466,1070,470,394,diss_building4.mp4
21483,1070,468,389,diss_building4.mp4
21499,1070,463,382,diss_building4.mp4
21515,1070,459,374,diss_building4.mp4
21531,1070,455,366,diss_building4.mp4
21554,1070,448,359,diss_building4.mp4
21570,1070,445,356,diss_building4.mp4
21587,1070,445,355,diss_building4.mp4
21597,1070,444,354,diss_building4.mp4
21762,1070,445,354,diss_building4.mp4
21785,1070,446,354,diss_building4.mp4
21801,1070,447,354,diss_building4.mp4
21817,1070,448,353,diss_building4.mp4
21849,1070,449,353,diss_building4.mp4
21857,1070,449,352,diss_building4.mp4
21865,1070,451,352,diss_building4.mp4
21882,1070,453,350,diss_building4.mp4
21897,1070,457,349,diss_building4.mp4
21915,1070,460,348,diss_building4.mp4
21938,1070,465,345,diss_building4.mp4
21955,1070,470,344,diss_building4.mp4
21970,1070,476,342,diss_building4.mp4
21986,1070,485,340,diss_building4.mp4
22003,1070,491,338,diss_building4.mp4
22018,1070,496,337,diss_building4.mp4
22034,1070,500,337,diss_building4.mp4
22050,1070,503,337,diss_building4.mp4
22068,1070,513,337,diss_building4.mp4
22083,1070,533,343,diss_building4.mp4
22107,1070,573,352,diss_building4.mp4
22115,1070,585,354,diss_building4.mp4
22140,1070,615,358,diss_building4.mp4
22154,1070,626,359,diss_building4.mp4
22170,1070,630,359,diss_building4.mp4
22182,1070,631,359,diss_building4.mp4
0,1073,634,359,diss_Soccer2.mp4
227,1073,635,359,diss_Soccer2.mp4
494,1073,636,359,diss_Soccer2.mp4
516,1073,643,358,diss_Soccer2.mp4
524,1073,644,358,diss_Soccer2.mp4
541,1073,646,357,diss_Soccer2.mp4
549,1073,647,357,diss_Soccer2.mp4
991,1073,648,357,diss_Soccer2.mp4
1008,1073,650,357,diss_Soccer2.mp4
1026,1073,657,357,diss_Soccer2.mp4
1042,1073,670,357,diss_Soccer2.mp4
1056,1073,684,359,diss_Soccer2.mp4
1073,1073,700,362,diss_Soccer2.mp4
1089,1073,715,365,diss_Soccer2.mp4
1106,1073,727,367,diss_Soccer2.mp4
1121,1073,734,369,diss_Soccer2.mp4
1137,1073,738,369,diss_Soccer2.mp4
1145,1073,740,370,diss_Soccer2.mp4
1169,1073,742,370,diss_Soccer2.mp4
1192,1073,745,370,diss_Soccer2.mp4
1208,1073,748,371,diss_Soccer2.mp4
1225,1073,754,373,diss_Soccer2.mp4
1240,1073,764,375,diss_Soccer2.mp4
1256,1073,781,379,diss_Soccer2.mp4
1273,1073,798,383,diss_Soccer2.mp4
1291,1073,824,388,diss_Soccer2.mp4
1307,1073,860,397,diss_Soccer2.mp4
1323,1073,900,407,diss_Soccer2.mp4
1339,1073,930,413,diss_Soccer2.mp4
1354,1073,950,416,diss_Soccer2.mp4
1370,1073,960,418,diss_Soccer2.mp4
1387,1073,964,418,diss_Soccer2.mp4
1410,1073,970,418,diss_Soccer2.mp4
1435,1073,974,418,diss_Soccer2.mp4
1452,1073,975,418,diss_Soccer2.mp4
1541,1073,976,418,diss_Soccer2.mp4
1557,1073,978,418,diss_Soccer2.mp4
1571,1073,980,418,diss_Soccer2.mp4
1589,1073,982,418,diss_Soccer2.mp4
1605,1073,984,418,diss_Soccer2.mp4
1621,1073,985,418,diss_Soccer2.mp4
1637,1073,986,418,diss_Soccer2.mp4
1765,1073,985,418,diss_Soccer2.mp4
1775,1073,983,418,diss_Soccer2.mp4
1789,1073,978,418,diss_Soccer2.mp4
1814,1073,974,418,diss_Soccer2.mp4
1822,1073,972,418,diss_Soccer2.mp4
1845,1073,968,419,diss_Soccer2.mp4
1860,1073,964,419,diss_Soccer2.mp4
1871,1073,962,419,diss_Soccer2.mp4
1888,1073,956,419,diss_Soccer2.mp4
1911,1073,946,419,diss_Soccer2.mp4
1926,1073,941,419,diss_Soccer2.mp4
1942,1073,935,419,diss_Soccer2.mp4
1958,1073,931,419,diss_Soccer2.mp4
1974,1073,927,419,diss_Soccer2.mp4
1990,1073,923,419,diss_Soccer2.mp4
2007,1073,921,419,diss_Soccer2.mp4
2015,1073,920,419,diss_Soccer2.mp4
2031,1073,919,419,diss_Soccer2.mp4
2185,1073,917,419,diss_Soccer2.mp4
2193,1073,915,419,diss_Soccer2.mp4
2210,1073,910,418,diss_Soccer2.mp4
2226,1073,904,418,diss_Soccer2.mp4
2241,1073,899,418,diss_Soccer2.mp4
2256,1073,894,418,diss_Soccer2.mp4
2275,1073,890,418,diss_Soccer2.mp4
2290,1073,888,418,diss_Soccer2.mp4
2296,1073,887,418,diss_Soccer2.mp4
2316,1073,886,418,diss_Soccer2.mp4
2445,1073,885,418,diss_Soccer2.mp4
2450,1073,884,418,diss_Soccer2.mp4
2476,1073,880,418,diss_Soccer2.mp4
2491,1073,879,418,diss_Soccer2.mp4
2507,1073,877,418,diss_Soccer2.mp4
2524,1073,875,417,diss_Soccer2.mp4
2540,1073,872,416,diss_Soccer2.mp4
2555,1073,869,416,diss_Soccer2.mp4
2572,1073,867,415,diss_Soccer2.mp4
2594,1073,865,415,diss_Soccer2.mp4
2637,1073,864,415,diss_Soccer2.mp4
2718,1073,864,414,diss_Soccer2.mp4
2732,1073,865,413,diss_Soccer2.mp4
2748,1073,866,412,diss_Soccer2.mp4
2756,1073,867,412,diss_Soccer2.mp4
2773,1073,869,411,diss_Soccer2.mp4
2790,1073,871,409,diss_Soccer2.mp4
2814,1073,876,406,diss_Soccer2.mp4
2821,1073,878,405,diss_Soccer2.mp4
2844,1073,884,403,diss_Soccer2.mp4
2860,1073,888,401,diss_Soccer2.mp4
2876,1073,891,400,diss_Soccer2.mp4
2892,1073,894,398,diss_Soccer2.mp4
2909,1073,898,396,diss_Soccer2.mp4
2926,1073,901,393,diss_Soccer2.mp4
2941,1073,905,391,diss_Soccer2.mp4
2958,1073,909,390,diss_Soccer2.mp4
2973,1073,910,388,diss_Soccer2.mp4
2981,1073,912,387,diss_Soccer2.mp4
3006,1073,913,386,diss_Soccer2.mp4
3018,1073,914,386,diss_Soccer2.mp4
3040,1073,915,385,diss_Soccer2.mp4
3089,1073,916,384,diss_Soccer2.mp4
3208,1073,916,383,diss_Soccer2.mp4
3241,1073,916,382,diss_Soccer2.mp4
3271,1073,916,380,diss_Soccer2.mp4
3294,1073,914,379,diss_Soccer2.mp4
3303,1073,914,378,diss_Soccer2.mp4
3329,1073,914,377,diss_Soccer2.mp4
3354,1073,913,377,diss_Soccer2.mp4
3360,1073,913,376,diss_Soccer2.mp4
3377,1073,910,376,diss_Soccer2.mp4
3392,1073,908,374,diss_Soccer2.mp4
3409,1073,905,373,diss_Soccer2.mp4
3425,1073,903,373,diss_Soccer2.mp4
3441,1073,900,373,diss_Soccer2.mp4
3458,1073,898,373,diss_Soccer2.mp4
3483,1073,893,373,diss_Soccer2.mp4
3490,1073,891,373,diss_Soccer2.mp4
3512,1073,887,373,diss_Soccer2.mp4
3652,1073,889,374,diss_Soccer2.mp4
3660,1073,893,376,diss_Soccer2.mp4
3678,1073,901,379,diss_Soccer2.mp4
3692,1073,914,382,diss_Soccer2.mp4
3708,1073,928,388,diss_Soccer2.mp4
3723,1073,943,393,diss_Soccer2.mp4
3746,1073,964,399,diss_Soccer2.mp4
3755,1073,970,401,diss_Soccer2.mp4
3778,1073,982,404,diss_Soccer2.mp4
3787,1073,984,404,diss_Soccer2.mp4
3795,1073,986,405,diss_Soccer2.mp4
3876,1073,987,404,diss_Soccer2.mp4
3884,1073,988,404,diss_Soccer2.mp4
3909,1073,991,403,diss_Soccer2.mp4
3925,1073,995,402,diss_Soccer2.mp4
3941,1073,999,402,diss_Soccer2.mp4
3957,1073,1006,401,diss_Soccer2.mp4
3973,1073,1016,400,diss_Soccer2.mp4
3989,1073,1027,399,diss_Soccer2.mp4
4005,1073,1036,397,diss_Soccer2.mp4
4028,1073,1041,395,diss_Soccer2.mp4
4037,1073,1043,395,diss_Soccer2.mp4
4053,1073,1045,393,diss_Soccer2.mp4
4068,1073,1046,391,diss_Soccer2.mp4
4085,1073,1048,390,diss_Soccer2.mp4
4101,1073,1049,389,diss_Soccer2.mp4
4433,1073,1051,390,diss_Soccer2.mp4
4449,1073,1059,394,diss_Soccer2.mp4
4463,1073,1071,400,diss_Soccer2.mp4
4480,1073,1085,404,diss_Soccer2.mp4
4496,1073,1095,406,diss_Soccer2.mp4
4513,1073,1102,407,diss_Soccer2.mp4
4529,1073,1106,407,diss_Soccer2.mp4
4536,1073,1108,407,diss_Soccer2.mp4
4552,1073,1109,407,diss_Soccer2.mp4
4729,1073,1109,408,diss_Soccer2.mp4
4779,1073,1106,411,diss_Soccer2.mp4
4796,1073,1104,413,diss_Soccer2.mp4
4811,1073,1102,414,diss_Soccer2.mp4
4826,1073,1101,415,diss_Soccer2.mp4
4835,1073,1100,415,diss_Soccer2.mp4
4867,1073,1099,415,diss_Soccer2.mp4
4874,1073,1099,416,diss_Soccer2.mp4
4899,1073,1098,416,diss_Soccer2.mp4
4947,1073,1095,416,diss_Soccer2.mp4
4963,1073,1093,418,diss_Soccer2.mp4
4979,1073,1088,419,diss_Soccer2.mp4
4996,1073,1082,421,diss_Soccer2.mp4
5012,1073,1075,423,diss_Soccer2.mp4
5028,1073,1069,425,diss_Soccer2.mp4
5044,1073,1066,425,diss_Soccer2.mp4
5052,1073,1065,425,diss_Soccer2.mp4
5109,1073,1064,426,diss_Soccer2.mp4
5132,1073,1063,426,diss_Soccer2.mp4
5141,1073,1062,426,diss_Soccer2.mp4
5164,1073,1061,426,diss_Soccer2.mp4
5180,1073,1060,426,diss_Soccer2.mp4
5197,1073,1057,426,diss_Soccer2.mp4
5213,1073,1053,426,diss_Soccer2.mp4
5229,1073,1045,426,diss_Soccer2.mp4
5245,1073,1035,426,diss_Soccer2.mp4
5262,1073,1025,426,diss_Soccer2.mp4
5276,1073,1016,427,diss_Soccer2.mp4
5293,1073,1002,428,diss_Soccer2.mp4
5309,1073,985,429,diss_Soccer2.mp4
5328,1073,966,429,diss_Soccer2.mp4
5343,1073,937,429,diss_Soccer2.mp4
5359,1073,906,427,diss_Soccer2.mp4
5375,1073,879,427,diss_Soccer2.mp4
5398,1073,841,427,diss_Soccer2.mp4
5414,1073,812,426,diss_Soccer2.mp4
5431,1073,779,424,diss_Soccer2.mp4
5446,1073,735,418,diss_Soccer2.mp4
5463,1073,678,409,diss_Soccer2.mp4
5478,1073,632,404,diss_Soccer2.mp4
5495,1073,607,404,diss_Soccer2.mp4
5511,1073,588,404,diss_Soccer2.mp4
5527,1073,571,405,diss_Soccer2.mp4
5543,1073,553,406,diss_Soccer2.mp4
5561,1073,537,407,diss_Soccer2.mp4
5576,1073,526,407,diss_Soccer2.mp4
5593,1073,519,407,diss_Soccer2.mp4
5609,1073,514,407,diss_Soccer2.mp4
5625,1073,508,407,diss_Soccer2.mp4
5648,1073,498,406,diss_Soccer2.mp4
5664,1073,492,406,diss_Soccer2.mp4
5681,1073,485,405,diss_Soccer2.mp4
5696,1073,478,405,diss_Soccer2.mp4
5713,1073,470,404,diss_Soccer2.mp4
5728,1073,456,401,diss_Soccer2.mp4
5745,1073,441,398,diss_Soccer2.mp4
5762,1073,427,396,diss_Soccer2.mp4
5777,1073,421,396,diss_Soccer2.mp4
5785,1073,419,396,diss_Soccer2.mp4
5801,1073,417,396,diss_Soccer2.mp4
5817,1073,416,396,diss_Soccer2.mp4
5924,1073,417,396,diss_Soccer2.mp4
5996,1073,419,395,diss_Soccer2.mp4
6012,1073,422,393,diss_Soccer2.mp4
6029,1073,426,390,diss_Soccer2.mp4
6043,1073,434,384,diss_Soccer2.mp4
6059,1073,447,379,diss_Soccer2.mp4
0,1072,630,367,diss_ManRunning2.mp4
15,1072,624,366,diss_ManRunning2.mp4
30,1072,612,362,diss_ManRunning2.mp4
47,1072,603,360,diss_ManRunning2.mp4
63,1072,600,360,diss_ManRunning2.mp4
79,1072,599,359,diss_ManRunning2.mp4
888,1072,599,358,diss_ManRunning2.mp4
897,1072,600,357,diss_ManRunning2.mp4
920,1072,610,348,diss_ManRunning2.mp4
928,1072,615,343,diss_ManRunning2.mp4
953,1072,634,324,diss_ManRunning2.mp4
969,1072,650,308,diss_ManRunning2.mp4
984,1072,669,290,diss_ManRunning2.mp4
1001,1072,691,272,diss_ManRunning2.mp4
1017,1072,712,253,diss_ManRunning2.mp4
1032,1072,734,236,diss_ManRunning2.mp4
1049,1072,754,221,diss_ManRunning2.mp4
1065,1072,770,207,diss_ManRunning2.mp4
1081,1072,781,193,diss_ManRunning2.mp4
1097,1072,787,180,diss_ManRunning2.mp4
1120,1072,790,164,diss_ManRunning2.mp4
1131,1072,790,160,diss_ManRunning2.mp4
1148,1072,790,153,diss_ManRunning2.mp4
1163,1072,790,148,diss_ManRunning2.mp4
1187,1072,790,137,diss_ManRunning2.mp4
1203,1072,788,129,diss_ManRunning2.mp4
1218,1072,785,121,diss_ManRunning2.mp4
1235,1072,784,117,diss_ManRunning2.mp4
1250,1072,783,113,diss_ManRunning2.mp4
1266,1072,783,112,diss_ManRunning2.mp4
1282,1072,782,110,diss_ManRunning2.mp4
1299,1072,780,107,diss_ManRunning2.mp4
1315,1072,776,103,diss_ManRunning2.mp4
1331,1072,772,100,diss_ManRunning2.mp4
1354,1072,760,96,diss_ManRunning2.mp4
1362,1072,755,94,diss_ManRunning2.mp4
1379,1072,741,92,diss_ManRunning2.mp4
1395,1072,725,90,diss_ManRunning2.mp4
1420,1072,706,89,diss_ManRunning2.mp4
1437,1072,693,87,diss_ManRunning2.mp4
1453,1072,678,84,diss_ManRunning2.mp4
1469,1072,662,81,diss_ManRunning2.mp4
1484,1072,649,79,diss_ManRunning2.mp4
1501,1072,638,77,diss_ManRunning2.mp4
1516,1072,633,77,diss_ManRunning2.mp4
1532,1072,631,77,diss_ManRunning2.mp4
1541,1072,630,76,diss_ManRunning2.mp4
1581,1072,629,76,diss_ManRunning2.mp4
1604,1072,628,76,diss_ManRunning2.mp4
1628,1072,627,75,diss_ManRunning2.mp4
1724,1072,627,74,diss_ManRunning2.mp4
1731,1072,627,73,diss_ManRunning2.mp4
1754,1072,633,67,diss_ManRunning2.mp4
1771,1072,637,63,diss_ManRunning2.mp4
1786,1072,639,59,diss_ManRunning2.mp4
1802,1072,641,57,diss_ManRunning2.mp4
1810,1072,642,55,diss_ManRunning2.mp4
1826,1072,643,54,diss_ManRunning2.mp4
1860,1072,643,53,diss_ManRunning2.mp4
1895,1072,643,52,diss_ManRunning2.mp4
1916,1072,643,51,diss_ManRunning2.mp4
1932,1072,643,50,diss_ManRunning2.mp4
1949,1072,642,48,diss_ManRunning2.mp4
1965,1072,641,46,diss_ManRunning2.mp4
1978,1072,639,45,diss_ManRunning2.mp4
2004,1072,638,44,diss_ManRunning2.mp4
2030,1072,637,44,diss_ManRunning2.mp4
2254,1072,636,44,diss_ManRunning2.mp4
2259,1072,635,43,diss_ManRunning2.mp4
2275,1072,634,43,diss_ManRunning2.mp4
2282,1072,632,42,diss_ManRunning2.mp4
2299,1072,629,42,diss_ManRunning2.mp4
2322,1072,626,42,diss_ManRunning2.mp4
2439,1072,626,44,diss_ManRunning2.mp4
2456,1072,626,47,diss_ManRunning2.mp4
2472,1072,626,49,diss_ManRunning2.mp4
2487,1072,626,51,diss_ManRunning2.mp4
2494,1072,626,52,diss_ManRunning2.mp4
2528,1072,626,53,diss_ManRunning2.mp4
2561,1072,626,54,diss_ManRunning2.mp4
2585,1072,626,55,diss_ManRunning2.mp4
2641,1072,626,56,diss_ManRunning2.mp4
2659,1072,627,57,diss_ManRunning2.mp4
2673,1072,630,60,diss_ManRunning2.mp4
2689,1072,639,66,diss_ManRunning2.mp4
2705,1072,656,73,diss_ManRunning2.mp4
2721,1072,678,79,diss_ManRunning2.mp4
2737,1072,704,85,diss_ManRunning2.mp4
2752,1072,734,90,diss_ManRunning2.mp4
2770,1072,765,93,diss_ManRunning2.mp4
2787,1072,797,99,diss_ManRunning2.mp4
2803,1072,826,105,diss_ManRunning2.mp4
2819,1072,850,110,diss_ManRunning2.mp4
2835,1072,868,113,diss_ManRunning2.mp4
2851,1072,878,114,diss_ManRunning2.mp4
2868,1072,887,115,diss_ManRunning2.mp4
2883,1072,895,118,diss_ManRunning2.mp4
2906,1072,911,120,diss_ManRunning2.mp4
2923,1072,919,122,diss_ManRunning2.mp4
2938,1072,931,124,diss_ManRunning2.mp4
2954,1072,945,127,diss_ManRunning2.mp4
2971,1072,966,131,diss_ManRunning2.mp4
2987,1072,998,138,diss_ManRunning2.mp4
3002,1072,1034,145,diss_ManRunning2.mp4
3019,1072,1071,153,diss_ManRunning2.mp4
3036,1072,1106,156,diss_ManRunning2.mp4
3051,1072,1140,161,diss_ManRunning2.mp4
3070,1072,1181,167,diss_ManRunning2.mp4
3084,1072,1235,175,diss_ManRunning2.mp4
3339,1072,1274,169,diss_ManRunning2.mp4
3355,1072,1263,167,diss_ManRunning2.mp4
3371,1072,1245,164,diss_ManRunning2.mp4
3387,1072,1221,159,diss_ManRunning2.mp4
3403,1072,1177,149,diss_ManRunning2.mp4
3419,1072,1139,143,diss_ManRunning2.mp4
3435,1072,1113,142,diss_ManRunning2.mp4
3451,1072,1091,141,diss_ManRunning2.mp4
3476,1072,1058,141,diss_ManRunning2.mp4
3491,1072,1028,140,diss_ManRunning2.mp4
3506,1072,985,136,diss_ManRunning2.mp4
3522,1072,948,134,diss_ManRunning2.mp4
3538,1072,923,134,diss_ManRunning2.mp4
3555,1072,908,134,diss_ManRunning2.mp4
3571,1072,897,135,diss_ManRunning2.mp4
3586,1072,882,136,diss_ManRunning2.mp4
3604,1072,861,138,diss_ManRunning2.mp4
3620,1072,839,140,diss_ManRunning2.mp4
3637,1072,820,143,diss_ManRunning2.mp4
3653,1072,807,146,diss_ManRunning2.mp4
3669,1072,795,150,diss_ManRunning2.mp4
3684,1072,783,153,diss_ManRunning2.mp4
3700,1072,774,157,diss_ManRunning2.mp4
3725,1072,760,163,diss_ManRunning2.mp4
3740,1072,756,166,diss_ManRunning2.mp4
3756,1072,753,168,diss_ManRunning2.mp4
3772,1072,752,170,diss_ManRunning2.mp4
3789,1072,751,171,diss_ManRunning2.mp4
3805,1072,750,173,diss_ManRunning2.mp4
3822,1072,749,174,diss_ManRunning2.mp4
3846,1072,749,175,diss_ManRunning2.mp4
3853,1072,749,176,diss_ManRunning2.mp4
3868,1072,748,177,diss_ManRunning2.mp4
3886,1072,748,181,diss_ManRunning2.mp4
3911,1072,748,186,diss_ManRunning2.mp4
3920,1072,748,187,diss_ManRunning2.mp4
3936,1072,747,190,diss_ManRunning2.mp4
3958,1072,746,194,diss_ManRunning2.mp4
3968,1072,746,196,diss_ManRunning2.mp4
3990,1072,745,198,diss_ManRunning2.mp4
4006,1072,744,200,diss_ManRunning2.mp4
4055,1072,744,201,diss_ManRunning2.mp4
4297,1072,745,201,diss_ManRunning2.mp4
4305,1072,746,201,diss_ManRunning2.mp4
4321,1072,750,201,diss_ManRunning2.mp4
4338,1072,753,201,diss_ManRunning2.mp4
4353,1072,757,201,diss_ManRunning2.mp4
4369,1072,760,201,diss_ManRunning2.mp4
4385,1072,765,200,diss_ManRunning2.mp4
4400,1072,770,200,diss_ManRunning2.mp4
4424,1072,775,199,diss_ManRunning2.mp4
4433,1072,775,198,diss_ManRunning2.mp4
4471,1072,776,198,diss_ManRunning2.mp4
4486,1072,777,198,diss_ManRunning2.mp4
4503,1072,779,198,diss_ManRunning2.mp4
4511,1072,781,197,diss_ManRunning2.mp4
4520,1072,784,197,diss_ManRunning2.mp4
4542,1072,792,194,diss_ManRunning2.mp4
4558,1072,799,190,diss_ManRunning2.mp4
4573,1072,807,187,diss_ManRunning2.mp4
4591,1072,821,182,diss_ManRunning2.mp4
4607,1072,835,173,diss_ManRunning2.mp4
4623,1072,850,164,diss_ManRunning2.mp4
4639,1072,861,154,diss_ManRunning2.mp4
4655,1072,867,146,diss_ManRunning2.mp4
4671,1072,872,140,diss_ManRunning2.mp4
4686,1072,875,134,diss_ManRunning2.mp4
4703,1072,878,130,diss_ManRunning2.mp4
4720,1072,881,125,diss_ManRunning2.mp4
4742,1072,884,121,diss_ManRunning2.mp4
4777,1072,888,116,diss_ManRunning2.mp4
4792,1072,892,114,diss_ManRunning2.mp4
4808,1072,895,111,diss_ManRunning2.mp4
4825,1072,898,109,diss_ManRunning2.mp4
4856,1072,908,106,diss_ManRunning2.mp4
4874,1072,912,105,diss_ManRunning2.mp4
4889,1072,918,104,diss_ManRunning2.mp4
4905,1072,922,103,diss_ManRunning2.mp4
4921,1072,925,103,diss_ManRunning2.mp4
4937,1072,926,103,diss_ManRunning2.mp4
4953,1072,929,103,diss_ManRunning2.mp4
4976,1072,931,102,diss_ManRunning2.mp4
4992,1072,934,102,diss_ManRunning2.mp4
5001,1072,935,102,diss_ManRunning2.mp4
5026,1072,938,102,diss_ManRunning2.mp4
5042,1072,942,102,diss_ManRunning2.mp4
5058,1072,946,101,diss_ManRunning2.mp4
5074,1072,950,101,diss_ManRunning2.mp4
5091,1072,955,101,diss_ManRunning2.mp4
5106,1072,958,101,diss_ManRunning2.mp4
5122,1072,961,101,diss_ManRunning2.mp4
5130,1072,963,101,diss_ManRunning2.mp4
5150,1072,964,101,diss_ManRunning2.mp4
5256,1072,962,102,diss_ManRunning2.mp4
5271,1072,958,104,diss_ManRunning2.mp4
5289,1072,952,107,diss_ManRunning2.mp4
5304,1072,947,109,diss_ManRunning2.mp4
5321,1072,943,111,diss_ManRunning2.mp4
5337,1072,941,112,diss_ManRunning2.mp4
5360,1072,937,115,diss_ManRunning2.mp4
5376,1072,935,116,diss_ManRunning2.mp4
5393,1072,933,118,diss_ManRunning2.mp4
5409,1072,931,120,diss_ManRunning2.mp4
5424,1072,929,122,diss_ManRunning2.mp4
5440,1072,927,124,diss_ManRunning2.mp4
5457,1072,924,127,diss_ManRunning2.mp4
5474,1072,922,130,diss_ManRunning2.mp4
5488,1072,920,132,diss_ManRunning2.mp4
5505,1072,919,134,diss_ManRunning2.mp4
5523,1072,918,137,diss_ManRunning2.mp4
5537,1072,918,138,diss_ManRunning2.mp4
5562,1072,918,139,diss_ManRunning2.mp4
5572,1072,917,139,diss_ManRunning2.mp4
5586,1072,917,140,diss_ManRunning2.mp4
5603,1072,917,141,diss_ManRunning2.mp4
5622,1072,917,142,diss_ManRunning2.mp4
5642,1072,916,143,diss_ManRunning2.mp4
5659,1072,916,144,diss_ManRunning2.mp4
5675,1072,915,145,diss_ManRunning2.mp4
5690,1072,914,146,diss_ManRunning2.mp4
5707,1072,912,148,diss_ManRunning2.mp4
5723,1072,909,151,diss_ManRunning2.mp4
5739,1072,905,157,diss_ManRunning2.mp4
5755,1072,898,166,diss_ManRunning2.mp4
5771,1072,890,178,diss_ManRunning2.mp4
5787,1072,881,192,diss_ManRunning2.mp4
5812,1072,871,215,diss_ManRunning2.mp4
5826,1072,863,229,diss_ManRunning2.mp4
5842,1072,858,241,diss_ManRunning2.mp4
5858,1072,850,249,diss_ManRunning2.mp4
5876,1072,844,254,diss_ManRunning2.mp4
5892,1072,839,258,diss_ManRunning2.mp4
5908,1072,831,262,diss_ManRunning2.mp4
5925,1072,824,265,diss_ManRunning2.mp4
5940,1072,818,266,diss_ManRunning2.mp4
5956,1072,809,269,diss_ManRunning2.mp4
5973,1072,799,272,diss_ManRunning2.mp4
5988,1072,785,274,diss_ManRunning2.mp4
6006,1072,769,276,diss_ManRunning2.mp4
6021,1072,750,278,diss_ManRunning2.mp4
6044,1072,728,282,diss_ManRunning2.mp4
6060,1072,717,285,diss_ManRunning2.mp4
6076,1072,709,287,diss_ManRunning2.mp4
6088,1072,706,287,diss_ManRunning2.mp4
6108,1072,692,291,diss_ManRunning2.mp4
6124,1072,681,293,diss_ManRunning2.mp4
6141,1072,671,295,diss_ManRunning2.mp4
6156,1072,665,296,diss_ManRunning2.mp4
6174,1072,663,296,diss_ManRunning2.mp4
6190,1072,661,296,diss_ManRunning2.mp4
6449,1072,661,297,diss_ManRunning2.mp4
6459,1072,662,298,diss_ManRunning2.mp4
6474,1072,664,303,diss_ManRunning2.mp4
6500,1072,666,312,diss_ManRunning2.mp4
6506,1072,666,315,diss_ManRunning2.mp4
6528,1072,666,322,diss_ManRunning2.mp4
6544,1072,666,326,diss_ManRunning2.mp4
6560,1072,666,331,diss_ManRunning2.mp4
6577,1072,666,338,diss_ManRunning2.mp4
6594,1072,666,347,diss_ManRunning2.mp4
6608,1072,666,354,diss_ManRunning2.mp4
6626,1072,666,358,diss_ManRunning2.mp4
6642,1072,667,361,diss_ManRunning2.mp4
6657,1072,668,362,diss_ManRunning2.mp4
6672,1072,668,364,diss_ManRunning2.mp4
6681,1072,669,364,diss_ManRunning2.mp4
6775,1072,669,365,diss_ManRunning2.mp4
6784,1072,669,366,diss_ManRunning2.mp4
6800,1072,670,367,diss_ManRunning2.mp4
6824,1072,670,368,diss_ManRunning2.mp4
6841,1072,672,370,diss_ManRunning2.mp4
6856,1072,676,374,diss_ManRunning2.mp4
6878,1072,682,380,diss_ManRunning2.mp4
6895,1072,683,382,diss_ManRunning2.mp4
6906,1072,684,383,diss_ManRunning2.mp4
6927,1072,684,384,diss_ManRunning2.mp4
6943,1072,685,385,diss_ManRunning2.mp4
6958,1072,685,386,diss_ManRunning2.mp4
6976,1072,685,388,diss_ManRunning2.mp4
6994,1072,686,393,diss_ManRunning2.mp4
7008,1072,686,400,diss_ManRunning2.mp4
7025,1072,686,409,diss_ManRunning2.mp4
7041,1072,687,418,diss_ManRunning2.mp4
7058,1072,688,432,diss_ManRunning2.mp4
7073,1072,690,450,diss_ManRunning2.mp4
7088,1072,691,466,diss_ManRunning2.mp4
7112,1072,692,478,diss_ManRunning2.mp4
7128,1072,692,480,diss_ManRunning2.mp4
7144,1072,692,483,diss_ManRunning2.mp4
7160,1072,692,485,diss_ManRunning2.mp4
7177,1072,692,489,diss_ManRunning2.mp4
7193,1072,691,492,diss_ManRunning2.mp4
7208,1072,691,496,diss_ManRunning2.mp4
7226,1072,691,499,diss_ManRunning2.mp4
7241,1072,691,503,diss_ManRunning2.mp4
7257,1072,691,504,diss_ManRunning2.mp4
7273,1072,691,506,diss_ManRunning2.mp4
7289,1072,691,508,diss_ManRunning2.mp4
7312,1072,695,512,diss_ManRunning2.mp4
7323,1072,696,514,diss_ManRunning2.mp4
7339,1072,697,516,diss_ManRunning2.mp4
7349,1072,698,516,diss_ManRunning2.mp4
7392,1072,699,517,diss_ManRunning2.mp4
7416,1072,699,518,diss_ManRunning2.mp4
7424,1072,700,518,diss_ManRunning2.mp4
