verifToken,stimuli_id,source_id,media_a_id,source_a,created_at,source_name_vote,reversed,source_position_vote,bl,bd,nb_replay
jry24nkl,1101,5574,44544,diss_truck3.mp4,1644508779,1,,1,12,120,1
jry24nkl,1090,5570,44540,diss_car13.mp4,1644508821,1,,1,12,120,1
jry24nkl,1086,5566,44536,diss_building3.mp4,1644508838,1,,1,12,120,1
jry24nkl,1087,5567,44537,diss_building4.mp4,1644508869,1,,1,12,120,1
jry24nkl,1081,5553,44523,diss_Basketball.mp4,1644508900,1,,1,12,120,1
jry24nkl,1085,5565,44535,diss_building2.mp4,1644508930,1,,1,12,120,1
jry24nkl,1098,5559,44529,diss_Soccer2.mp4,1644508959,1,,1,12,120,1
jry24nkl,1089,5569,44539,diss_car12.mp4,1644508977,1,,1,12,120,1
jry24nkl,1082,5562,44532,diss_bike2.mp4,1644508994,1,,1,12,120,1
jry24nkl,1097,5558,44528,diss_Soccer1.mp4,1644509018,1,,1,12,120,1
jry24nkl,1088,5568,44538,diss_car11.mp4,1644509040,1,,1,12,120,1
jry24nkl,1095,5557,44527,diss_ManRunning2.mp4,1644509053,1,,1,12,120,1
jry24nkl,1096,5572,44542,diss_person22.mp4,1644509063,1,,1,12,120,1
jry24nkl,1083,5563,44533,diss_bike3.mp4,1644509084,1,,1,12,120,1
jry24nkl,1084,5564,44534,diss_building1.mp4,1644509103,1,,1,12,120,1
jry24nkl,1102,5561,44531,diss_Walking.mp4,1644509125,1,,1,12,120,1
jry24nkl,1094,5556,44526,diss_ManRunning1.mp4,1644509147,1,,1,12,120,1
jry24nkl,1092,5554,44524,diss_Girl1.mp4,1644509171,1,,1,12,120,1
jry24nkl,1099,5560,44530,diss_StreetBasketball1.mp4,1644509194,1,,1,12,120,1
jry24nkl,1100,5573,44543,diss_truck2.mp4,1644509209,1,,1,12,120,1
jry24nkl,1091,5571,44541,diss_car15.mp4,1644509223,1,,1,12,120,1
jry24nkl,1093,5555,44525,diss_Girl2.mp4,1644509235,1,,1,12,120,1
