verifToken,stimuli_id,source_id,media_a_id,source_a,created_at,source_name_vote,reversed,source_position_vote,bl,bd,nb_replay
anjl6toh,1093,5555,44525,diss_Girl2.mp4,1649685508,1,,1,12,180,1
anjl6toh,1088,5568,44538,diss_car11.mp4,1649685553,1,,1,12,180,1
anjl6toh,1085,5565,44535,diss_building2.mp4,1649685567,1,,1,12,180,1
anjl6toh,1102,5561,44531,diss_Walking.mp4,1649685592,1,,1,12,180,1
anjl6toh,1082,5562,44532,diss_bike2.mp4,1649685614,1,,1,12,180,1
anjl6toh,1081,5553,44523,diss_Basketball.mp4,1649685634,1,,1,12,180,1
anjl6toh,1089,5569,44539,diss_car12.mp4,1649685650,1,,1,12,180,1
anjl6toh,1096,5572,44542,diss_person22.mp4,1649685673,1,,1,12,180,2
anjl6toh,1101,5574,44544,diss_truck3.mp4,1649685695,1,,1,12,180,1
anjl6toh,1086,5566,44536,diss_building3.mp4,1649685714,1,,1,12,180,1
anjl6toh,1084,5564,44534,diss_building1.mp4,1649685731,1,,1,12,180,1
anjl6toh,1098,5559,44529,diss_Soccer2.mp4,1649685752,1,,1,12,180,1
anjl6toh,1095,5557,44527,diss_ManRunning2.mp4,1649685772,1,,1,12,180,1
anjl6toh,1094,5556,44526,diss_ManRunning1.mp4,1649685782,1,,1,12,180,1
anjl6toh,1100,5573,44543,diss_truck2.mp4,1649685792,1,,1,12,180,1
anjl6toh,1087,5567,44537,diss_building4.mp4,1649685805,1,,1,12,180,1
anjl6toh,1099,5560,44530,diss_StreetBasketball1.mp4,1649685827,1,,1,12,180,1
anjl6toh,1083,5563,44533,diss_bike3.mp4,1649685848,1,,1,12,180,1
anjl6toh,1092,5554,44524,diss_Girl1.mp4,1649685880,1,,1,12,180,1
anjl6toh,1097,5558,44528,diss_Soccer1.mp4,1649685911,1,,1,12,180,1
anjl6toh,1090,5570,44540,diss_car13.mp4,1649685931,1,,1,12,180,1
anjl6toh,1091,5571,44541,diss_car15.mp4,1649685949,1,,1,12,180,1
