verifToken,stimuli_id,source_id,media_a_id,source_a,created_at,source_name_vote,reversed,source_position_vote,bl,bd,nb_replay
l7qagcjt,1096,5572,44542,diss_person22.mp4,1645110234,1,,1,8,180,2
l7qagcjt,1099,5560,44530,diss_StreetBasketball1.mp4,1645110262,1,,1,8,180,1
l7qagcjt,1087,5567,44537,diss_building4.mp4,1645110276,1,,1,8,180,1
l7qagcjt,1090,5570,44540,diss_car13.mp4,1645110287,1,,1,8,180,1
l7qagcjt,1093,5555,44525,diss_Girl2.mp4,1645110326,1,,1,8,180,1
l7qagcjt,1083,5563,44533,diss_bike3.mp4,1645110355,1,,1,8,180,1
l7qagcjt,1092,5554,44524,diss_Girl1.mp4,1645110375,1,,1,8,180,1
l7qagcjt,1084,5564,44534,diss_building1.mp4,1645110392,1,,1,8,180,1
l7qagcjt,1088,5568,44538,diss_car11.mp4,1645110418,1,,1,8,180,1
l7qagcjt,1081,5553,44523,diss_Basketball.mp4,1645110442,1,,1,8,180,1
l7qagcjt,1082,5562,44532,diss_bike2.mp4,1645110462,1,,1,8,180,1
l7qagcjt,1097,5558,44528,diss_Soccer1.mp4,1645110479,1,,1,8,180,1
l7qagcjt,1098,5559,44529,diss_Soccer2.mp4,1645110493,1,,1,8,180,1
l7qagcjt,1086,5566,44536,diss_building3.mp4,1645110504,1,,1,8,180,1
l7qagcjt,1095,5557,44527,diss_ManRunning2.mp4,1645110523,1,,1,8,180,1
l7qagcjt,1094,5556,44526,diss_ManRunning1.mp4,1645110542,1,,1,8,180,1
l7qagcjt,1100,5573,44543,diss_truck2.mp4,1645110558,1,,1,8,180,1
l7qagcjt,1089,5569,44539,diss_car12.mp4,1645110572,1,,1,8,180,1
l7qagcjt,1085,5565,44535,diss_building2.mp4,1645110590,1,,1,8,180,1
l7qagcjt,1101,5574,44544,diss_truck3.mp4,1645110608,1,,1,8,180,1
l7qagcjt,1091,5571,44541,diss_car15.mp4,1645110630,1,,1,8,180,1
l7qagcjt,1102,5561,44531,diss_Walking.mp4,1645110651,1,,1,8,180,1
