verifToken,stimuli_id,source_id,media_a_id,source_a,created_at,source_name_vote,reversed,source_position_vote,bl,bd,nb_replay
01ihov8o,1060,4265,14056,diss_person22.mp4,1644424666,1,,1,8,120,0
01ihov8o,1061,4266,14057,diss_truck2.mp4,1644424700,1,,1,8,120,0
01ihov8o,1058,4264,14055,diss_car13.mp4,1644424721,1,,1,8,120,0
01ihov8o,1062,4263,14054,diss_building2.mp4,1644424748,1,,1,8,120,0
01ihov8o,1057,4263,14054,diss_building2.mp4,1644424773,1,,1,8,120,0
01ihov8o,1059,4262,14053,diss_Soccer1.mp4,1644424799,1,,1,8,120,0
