verifToken,stimuli_id,source_id,media_a_id,source_a,created_at,source_name_vote,reversed,source_position_vote,bl,bd,nb_replay
2fb8bc9l,1057,4263,14054,diss_building2.mp4,1644424407,1,,1,8,120,0
2fb8bc9l,1062,4263,14054,diss_building2.mp4,1644424437,1,,1,8,120,0
2fb8bc9l,1058,4264,14055,diss_car13.mp4,1644424457,1,,1,8,120,0
2fb8bc9l,1061,4266,14057,diss_truck2.mp4,1644424482,1,,1,8,120,0
2fb8bc9l,1060,4265,14056,diss_person22.mp4,1644424493,1,,1,8,120,0
2fb8bc9l,1059,4262,14053,diss_Soccer1.mp4,1644424518,1,,1,8,120,0
