verifToken,stimuli_id,source_id,media_a_id,source_a,created_at,source_name_vote,reversed,source_position_vote,bl,bd,nb_replay
kzf0k9yo,1060,4265,14056,diss_person22.mp4,1644424361,1,,1,8,120,1
kzf0k9yo,1059,4262,14053,diss_Soccer1.mp4,1644424404,1,,1,8,120,0
kzf0k9yo,1058,4264,14055,diss_car13.mp4,1644424423,1,,1,8,120,0
kzf0k9yo,1057,4263,14054,diss_building2.mp4,1644424447,1,,1,8,120,0
kzf0k9yo,1062,4263,14054,diss_building2.mp4,1644424471,1,,1,8,120,0
kzf0k9yo,1061,4266,14057,diss_truck2.mp4,1644424501,1,,1,8,120,0
