verifToken,stimuli_id,source_id,media_a_id,source_a,created_at,source_name_vote,reversed,source_position_vote,bl,bd,nb_replay
e51dsrt2,1099,5560,44530,diss_StreetBasketball1.mp4,1646998547,1,,1,8,120,1
e51dsrt2,1092,5554,44524,diss_Girl1.mp4,1646998572,1,,1,8,120,1
e51dsrt2,1088,5568,44538,diss_car11.mp4,1646998582,1,,1,8,120,1
e51dsrt2,1090,5570,44540,diss_car13.mp4,1646998600,1,,1,8,120,2
e51dsrt2,1101,5574,44544,diss_truck3.mp4,1646998614,1,,1,8,120,1
e51dsrt2,1085,5565,44535,diss_building2.mp4,1646998631,1,,1,8,120,1
e51dsrt2,1097,5558,44528,diss_Soccer1.mp4,1646998648,1,,1,8,120,1
e51dsrt2,1082,5562,44532,diss_bike2.mp4,1646998667,1,,1,8,120,1
e51dsrt2,1091,5571,44541,diss_car15.mp4,1646998690,1,,1,8,120,1
e51dsrt2,1087,5567,44537,diss_building4.mp4,1646998711,1,,1,8,120,1
e51dsrt2,1083,5563,44533,diss_bike3.mp4,1646998734,1,,1,8,120,1
e51dsrt2,1086,5566,44536,diss_building3.mp4,1646998756,1,,1,8,120,1
e51dsrt2,1094,5556,44526,diss_ManRunning1.mp4,1646998780,1,,1,8,120,1
e51dsrt2,1093,5555,44525,diss_Girl2.mp4,1646998803,1,,1,8,120,1
e51dsrt2,1102,5561,44531,diss_Walking.mp4,1646998825,1,,1,8,120,1
e51dsrt2,1095,5557,44527,diss_ManRunning2.mp4,1646998846,1,,1,8,120,1
e51dsrt2,1096,5572,44542,diss_person22.mp4,1646998865,1,,1,8,120,1
e51dsrt2,1081,5553,44523,diss_Basketball.mp4,1646998883,1,,1,8,120,1
e51dsrt2,1084,5564,44534,diss_building1.mp4,1646998913,1,,1,8,120,1
e51dsrt2,1098,5559,44529,diss_Soccer2.mp4,1646998942,1,,1,8,120,1
e51dsrt2,1100,5573,44543,diss_truck2.mp4,1646998961,1,,1,8,120,1
e51dsrt2,1089,5569,44539,diss_car12.mp4,1646998979,1,,1,8,120,1
