timestamp,stimuli_id,mouseX,mouseY,stimuli
0,1062,633,358,diss_building2.mp4
80,1062,618,356,diss_building2.mp4
185,1062,612,356,diss_building2.mp4
311,1062,600,356,diss_building2.mp4
429,1062,567,356,diss_building2.mp4
535,1062,539,355,diss_building2.mp4
584,1062,534,355,diss_building2.mp4
929,1062,514,355,diss_building2.mp4
969,1062,509,355,diss_building2.mp4
1444,1062,508,355,diss_building2.mp4
1532,1062,400,360,diss_building2.mp4
1640,1062,258,360,diss_building2.mp4
1746,1062,246,371,diss_building2.mp4
1853,1062,240,429,diss_building2.mp4
1967,1062,229,490,diss_building2.mp4
2079,1062,215,507,diss_building2.mp4
2183,1062,211,508,diss_building2.mp4
2408,1062,209,504,diss_building2.mp4
2478,1062,197,493,diss_building2.mp4
2583,1062,189,476,diss_building2.mp4
2641,1062,190,473,diss_building2.mp4
2902,1062,190,476,diss_building2.mp4
2974,1062,190,483,diss_building2.mp4
3046,1062,190,487,diss_building2.mp4
3323,1062,233,487,diss_building2.mp4
3398,1062,540,471,diss_building2.mp4
3512,1062,892,395,diss_building2.mp4
3623,1062,1041,266,diss_building2.mp4
3715,1062,1042,259,diss_building2.mp4
4162,1062,1038,259,diss_building2.mp4
4229,1062,1034,260,diss_building2.mp4
4464,1062,1017,254,diss_building2.mp4
4542,1062,990,235,diss_building2.mp4
4547,1062,988,233,diss_building2.mp4
4767,1062,930,184,diss_building2.mp4
4879,1062,891,159,diss_building2.mp4
4987,1062,835,128,diss_building2.mp4
5098,1062,792,104,diss_building2.mp4
5207,1062,767,90,diss_building2.mp4
5315,1062,751,80,diss_building2.mp4
5430,1062,735,71,diss_building2.mp4
5529,1062,726,66,diss_building2.mp4
5563,1062,725,65,diss_building2.mp4
6072,1062,609,197,diss_building2.mp4
6161,1062,574,272,diss_building2.mp4
6274,1062,550,338,diss_building2.mp4
6380,1062,543,348,diss_building2.mp4
6451,1062,543,349,diss_building2.mp4
6946,1062,541,351,diss_building2.mp4
7070,1062,554,368,diss_building2.mp4
7082,1062,559,371,diss_building2.mp4
7195,1062,647,397,diss_building2.mp4
7313,1062,697,403,diss_building2.mp4
7425,1062,710,403,diss_building2.mp4
7530,1062,720,400,diss_building2.mp4
7541,1062,721,400,diss_building2.mp4
7854,1062,723,401,diss_building2.mp4
7934,1062,797,432,diss_building2.mp4
8060,1062,952,483,diss_building2.mp4
8166,1062,976,490,diss_building2.mp4
8178,1062,977,490,diss_building2.mp4
8512,1062,939,506,diss_building2.mp4
8591,1062,919,515,diss_building2.mp4
8698,1062,895,526,diss_building2.mp4
8710,1062,894,526,diss_building2.mp4
8890,1062,889,526,diss_building2.mp4
9006,1062,853,533,diss_building2.mp4
9072,1062,844,535,diss_building2.mp4
9230,1062,855,517,diss_building2.mp4
9342,1062,921,464,diss_building2.mp4
9458,1062,998,400,diss_building2.mp4
9673,1062,1061,327,diss_building2.mp4
9778,1062,1063,310,diss_building2.mp4
9892,1062,1049,289,diss_building2.mp4
10002,1062,1035,275,diss_building2.mp4
10108,1062,1029,269,diss_building2.mp4
10228,1062,1024,263,diss_building2.mp4
10319,1062,1021,261,diss_building2.mp4
10391,1062,1021,260,diss_building2.mp4
10516,1062,1016,257,diss_building2.mp4
10628,1062,1004,253,diss_building2.mp4
10735,1062,971,259,diss_building2.mp4
10846,1062,906,300,diss_building2.mp4
11005,1062,884,309,diss_building2.mp4
11070,1062,883,309,diss_building2.mp4
11283,1062,880,305,diss_building2.mp4
11394,1062,864,276,diss_building2.mp4
11510,1062,849,255,diss_building2.mp4
11615,1062,831,251,diss_building2.mp4
11731,1062,788,256,diss_building2.mp4
11844,1062,753,260,diss_building2.mp4
11943,1062,741,261,diss_building2.mp4
12056,1062,729,261,diss_building2.mp4
12178,1062,711,257,diss_building2.mp4
12290,1062,693,251,diss_building2.mp4
12400,1062,675,247,diss_building2.mp4
12519,1062,654,243,diss_building2.mp4
12553,1062,652,243,diss_building2.mp4
12731,1062,653,237,diss_building2.mp4
12839,1062,684,188,diss_building2.mp4
12953,1062,723,158,diss_building2.mp4
13071,1062,731,145,diss_building2.mp4
13105,1062,731,142,diss_building2.mp4
13299,1062,731,137,diss_building2.mp4
13399,1062,729,133,diss_building2.mp4
13694,1062,730,128,diss_building2.mp4
13764,1062,732,119,diss_building2.mp4
13870,1062,738,104,diss_building2.mp4
13985,1062,744,98,diss_building2.mp4
14045,1062,748,98,diss_building2.mp4
14208,1062,751,103,diss_building2.mp4
14318,1062,757,117,diss_building2.mp4
14435,1062,763,136,diss_building2.mp4
14549,1062,745,157,diss_building2.mp4
14652,1062,723,166,diss_building2.mp4
14674,1062,722,166,diss_building2.mp4
14972,1062,723,167,diss_building2.mp4
15052,1062,741,167,diss_building2.mp4
15175,1062,757,173,diss_building2.mp4
15261,1062,780,187,diss_building2.mp4
15371,1062,827,194,diss_building2.mp4
15484,1062,878,199,diss_building2.mp4
15706,1062,888,200,diss_building2.mp4
15813,1062,905,194,diss_building2.mp4
15948,1062,917,190,diss_building2.mp4
16079,1062,918,190,diss_building2.mp4
16217,1062,924,190,diss_building2.mp4
16339,1062,946,195,diss_building2.mp4
16457,1062,974,205,diss_building2.mp4
16534,1062,981,206,diss_building2.mp4
17094,1062,981,215,diss_building2.mp4
17102,1062,980,217,diss_building2.mp4
17229,1062,972,256,diss_building2.mp4
17322,1062,969,264,diss_building2.mp4
17466,1062,968,271,diss_building2.mp4
17567,1062,967,278,diss_building2.mp4
17933,1062,963,279,diss_building2.mp4
18001,1062,959,279,diss_building2.mp4
18022,1062,959,280,diss_building2.mp4
18419,1062,966,286,diss_building2.mp4
18495,1062,1002,301,diss_building2.mp4
18617,1062,1068,322,diss_building2.mp4
0,1060,626,373,diss_person22.mp4
64,1060,621,378,diss_person22.mp4
199,1060,618,382,diss_person22.mp4
284,1060,616,383,diss_person22.mp4
454,1060,629,382,diss_person22.mp4
568,1060,658,374,diss_person22.mp4
673,1060,671,370,diss_person22.mp4
760,1060,675,367,diss_person22.mp4
862,1060,676,367,diss_person22.mp4
1017,1060,673,367,diss_person22.mp4
1135,1060,627,365,diss_person22.mp4
1248,1060,590,366,diss_person22.mp4
1352,1060,579,368,diss_person22.mp4
1365,1060,578,368,diss_person22.mp4
1840,1060,570,370,diss_person22.mp4
1913,1060,537,373,diss_person22.mp4
1998,1060,496,382,diss_person22.mp4
2046,1060,492,388,diss_person22.mp4
2175,1060,492,389,diss_person22.mp4
2322,1060,483,387,diss_person22.mp4
2364,1060,480,386,diss_person22.mp4
2551,1060,480,391,diss_person22.mp4
2659,1060,499,419,diss_person22.mp4
2772,1060,549,437,diss_person22.mp4
2878,1060,586,441,diss_person22.mp4
2987,1060,620,437,diss_person22.mp4
3100,1060,654,428,diss_person22.mp4
3215,1060,674,425,diss_person22.mp4
3318,1060,682,424,diss_person22.mp4
3447,1060,712,420,diss_person22.mp4
3562,1060,785,380,diss_person22.mp4
3669,1060,837,322,diss_person22.mp4
3776,1060,873,271,diss_person22.mp4
3891,1060,923,223,diss_person22.mp4
4003,1060,964,201,diss_person22.mp4
4112,1060,978,196,diss_person22.mp4
4223,1060,995,194,diss_person22.mp4
4321,1060,1004,192,diss_person22.mp4
4441,1060,1014,184,diss_person22.mp4
4546,1060,1021,178,diss_person22.mp4
4650,1060,1030,171,diss_person22.mp4
4762,1060,1033,168,diss_person22.mp4
5087,1060,982,170,diss_person22.mp4
5157,1060,971,171,diss_person22.mp4
5276,1060,952,172,diss_person22.mp4
5385,1060,932,176,diss_person22.mp4
5504,1060,910,183,diss_person22.mp4
5618,1060,892,188,diss_person22.mp4
5729,1060,867,194,diss_person22.mp4
5835,1060,832,200,diss_person22.mp4
5943,1060,791,208,diss_person22.mp4
6050,1060,768,214,diss_person22.mp4
6169,1060,749,225,diss_person22.mp4
0,1058,654,337,diss_car13.mp4
91,1058,681,307,diss_car13.mp4
197,1058,697,287,diss_car13.mp4
588,1058,709,283,diss_car13.mp4
716,1058,775,269,diss_car13.mp4
722,1058,778,269,diss_car13.mp4
836,1058,846,260,diss_car13.mp4
944,1058,882,234,diss_car13.mp4
1053,1058,889,215,diss_car13.mp4
1056,1058,889,214,diss_car13.mp4
1152,1058,894,203,diss_car13.mp4
1271,1058,895,204,diss_car13.mp4
1502,1058,925,387,diss_car13.mp4
1580,1058,937,416,diss_car13.mp4
1651,1058,940,425,diss_car13.mp4
2024,1058,950,416,diss_car13.mp4
2140,1058,962,406,diss_car13.mp4
2181,1058,964,404,diss_car13.mp4
2430,1058,937,402,diss_car13.mp4
2431,1058,936,402,diss_car13.mp4
2542,1058,733,355,diss_car13.mp4
2655,1058,571,305,diss_car13.mp4
2777,1058,475,271,diss_car13.mp4
2894,1058,401,244,diss_car13.mp4
3006,1058,322,218,diss_car13.mp4
3117,1058,270,188,diss_car13.mp4
3189,1058,265,182,diss_car13.mp4
3513,1058,265,183,diss_car13.mp4
3595,1058,257,200,diss_car13.mp4
3785,1058,259,221,diss_car13.mp4
3905,1058,314,244,diss_car13.mp4
4018,1058,418,285,diss_car13.mp4
4127,1058,476,311,diss_car13.mp4
4233,1058,573,360,diss_car13.mp4
4344,1058,669,404,diss_car13.mp4
4348,1058,672,405,diss_car13.mp4
4467,1058,744,436,diss_car13.mp4
4686,1058,827,468,diss_car13.mp4
4765,1058,840,467,diss_car13.mp4
4880,1058,863,466,diss_car13.mp4
4991,1058,880,466,diss_car13.mp4
5100,1058,890,466,diss_car13.mp4
5216,1058,911,466,diss_car13.mp4
5317,1058,926,468,diss_car13.mp4
5639,1058,969,454,diss_car13.mp4
5730,1058,981,453,diss_car13.mp4
5841,1058,985,456,diss_car13.mp4
5958,1058,1002,491,diss_car13.mp4
6067,1058,1020,550,diss_car13.mp4
6177,1058,1022,594,diss_car13.mp4
6287,1058,1021,619,diss_car13.mp4
6393,1058,1013,636,diss_car13.mp4
6508,1058,1003,643,diss_car13.mp4
6619,1058,988,646,diss_car13.mp4
6731,1058,940,646,diss_car13.mp4
6736,1058,936,645,diss_car13.mp4
6959,1058,846,638,diss_car13.mp4
7042,1058,825,636,diss_car13.mp4
7257,1058,765,629,diss_car13.mp4
7366,1058,727,625,diss_car13.mp4
7476,1058,669,620,diss_car13.mp4
7596,1058,595,608,diss_car13.mp4
7678,1058,547,593,diss_car13.mp4
7791,1058,544,581,diss_car13.mp4
7893,1058,549,567,diss_car13.mp4
8013,1058,551,558,diss_car13.mp4
8016,1058,551,557,diss_car13.mp4
8230,1058,506,555,diss_car13.mp4
8338,1058,420,569,diss_car13.mp4
8448,1058,407,579,diss_car13.mp4
8549,1058,403,584,diss_car13.mp4
8601,1058,402,585,diss_car13.mp4
8761,1058,400,586,diss_car13.mp4
9016,1058,340,570,diss_car13.mp4
9084,1058,311,557,diss_car13.mp4
9299,1058,313,554,diss_car13.mp4
9392,1058,328,539,diss_car13.mp4
9510,1058,379,488,diss_car13.mp4
9619,1058,444,435,diss_car13.mp4
9733,1058,467,408,diss_car13.mp4
9842,1058,482,380,diss_car13.mp4
9950,1058,493,351,diss_car13.mp4
10062,1058,493,290,diss_car13.mp4
10170,1058,485,261,diss_car13.mp4
10278,1058,477,234,diss_car13.mp4
10393,1058,474,215,diss_car13.mp4
10509,1058,473,195,diss_car13.mp4
10627,1058,482,162,diss_car13.mp4
10735,1058,484,141,diss_car13.mp4
10767,1058,484,139,diss_car13.mp4
11304,1058,485,136,diss_car13.mp4
11377,1058,486,125,diss_car13.mp4
11481,1058,486,118,diss_car13.mp4
11543,1058,486,116,diss_car13.mp4
11903,1058,484,116,diss_car13.mp4
11979,1058,458,129,diss_car13.mp4
12096,1058,377,158,diss_car13.mp4
12204,1058,277,184,diss_car13.mp4
12308,1058,221,199,diss_car13.mp4
12413,1058,206,209,diss_car13.mp4
12537,1058,191,221,diss_car13.mp4
12645,1058,182,229,diss_car13.mp4
12750,1058,174,236,diss_car13.mp4
12815,1058,172,238,diss_car13.mp4
12976,1058,184,229,diss_car13.mp4
12982,1058,187,226,diss_car13.mp4
13085,1058,229,187,diss_car13.mp4
13150,1058,237,181,diss_car13.mp4
0,1059,633,363,diss_Soccer1.mp4
17,1059,634,363,diss_Soccer1.mp4
46,1059,635,363,diss_Soccer1.mp4
555,1059,580,362,diss_Soccer1.mp4
628,1059,312,347,diss_Soccer1.mp4
753,1059,97,423,diss_Soccer1.mp4
865,1059,50,451,diss_Soccer1.mp4
979,1059,49,461,diss_Soccer1.mp4
1061,1059,51,495,diss_Soccer1.mp4
1172,1059,61,546,diss_Soccer1.mp4
1245,1059,49,562,diss_Soccer1.mp4
1586,1059,78,568,diss_Soccer1.mp4
1634,1059,85,571,diss_Soccer1.mp4
1956,1059,69,483,diss_Soccer1.mp4
2029,1059,69,456,diss_Soccer1.mp4
2152,1059,109,422,diss_Soccer1.mp4
2227,1059,136,406,diss_Soccer1.mp4
2333,1059,159,388,diss_Soccer1.mp4
2442,1059,178,377,diss_Soccer1.mp4
2551,1059,213,367,diss_Soccer1.mp4
2668,1059,277,351,diss_Soccer1.mp4
2779,1059,351,339,diss_Soccer1.mp4
2893,1059,389,332,diss_Soccer1.mp4
3129,1059,726,321,diss_Soccer1.mp4
3249,1059,894,317,diss_Soccer1.mp4
3360,1059,947,310,diss_Soccer1.mp4
3549,1059,1155,318,diss_Soccer1.mp4
3659,1059,1233,338,diss_Soccer1.mp4
3763,1059,1240,340,diss_Soccer1.mp4
3779,1059,1241,341,diss_Soccer1.mp4
3983,1059,1240,342,diss_Soccer1.mp4
4105,1059,1228,344,diss_Soccer1.mp4
4223,1059,1104,354,diss_Soccer1.mp4
4228,1059,1094,354,diss_Soccer1.mp4
4345,1059,940,355,diss_Soccer1.mp4
4461,1059,811,355,diss_Soccer1.mp4
4570,1059,706,366,diss_Soccer1.mp4
4686,1059,644,379,diss_Soccer1.mp4
4796,1059,619,402,diss_Soccer1.mp4
4909,1059,605,434,diss_Soccer1.mp4
5111,1059,596,452,diss_Soccer1.mp4
5424,1059,602,412,diss_Soccer1.mp4
5491,1059,610,395,diss_Soccer1.mp4
5582,1059,611,390,diss_Soccer1.mp4
5726,1059,575,394,diss_Soccer1.mp4
5839,1059,534,410,diss_Soccer1.mp4
5959,1059,489,424,diss_Soccer1.mp4
6040,1059,469,425,diss_Soccer1.mp4
6210,1059,555,378,diss_Soccer1.mp4
6214,1059,560,376,diss_Soccer1.mp4
6319,1059,619,361,diss_Soccer1.mp4
6527,1059,634,349,diss_Soccer1.mp4
6644,1059,600,332,diss_Soccer1.mp4
6743,1059,574,321,diss_Soccer1.mp4
6866,1059,559,316,diss_Soccer1.mp4
6977,1059,512,308,diss_Soccer1.mp4
7089,1059,441,306,diss_Soccer1.mp4
7207,1059,399,310,diss_Soccer1.mp4
7313,1059,382,312,diss_Soccer1.mp4
7419,1059,367,316,diss_Soccer1.mp4
7534,1059,358,317,diss_Soccer1.mp4
7761,1059,355,315,diss_Soccer1.mp4
7836,1059,314,272,diss_Soccer1.mp4
7953,1059,337,234,diss_Soccer1.mp4
8070,1059,370,195,diss_Soccer1.mp4
8159,1059,389,172,diss_Soccer1.mp4
8258,1059,403,156,diss_Soccer1.mp4
8348,1059,412,152,diss_Soccer1.mp4
8582,1059,415,157,diss_Soccer1.mp4
8694,1059,425,158,diss_Soccer1.mp4
8777,1059,454,158,diss_Soccer1.mp4
8896,1059,599,169,diss_Soccer1.mp4
8978,1059,658,173,diss_Soccer1.mp4
9146,1059,607,181,diss_Soccer1.mp4
9254,1059,482,190,diss_Soccer1.mp4
9364,1059,382,196,diss_Soccer1.mp4
9460,1059,331,196,diss_Soccer1.mp4
9504,1059,330,196,diss_Soccer1.mp4
10082,1059,330,198,diss_Soccer1.mp4
10161,1059,331,206,diss_Soccer1.mp4
10272,1059,360,224,diss_Soccer1.mp4
10293,1059,361,224,diss_Soccer1.mp4
10493,1059,380,233,diss_Soccer1.mp4
10605,1059,436,260,diss_Soccer1.mp4
10688,1059,458,271,diss_Soccer1.mp4
10799,1059,487,282,diss_Soccer1.mp4
10910,1059,504,293,diss_Soccer1.mp4
11027,1059,532,327,diss_Soccer1.mp4
11141,1059,551,366,diss_Soccer1.mp4
11254,1059,561,390,diss_Soccer1.mp4
11364,1059,603,429,diss_Soccer1.mp4
11456,1059,624,438,diss_Soccer1.mp4
11487,1059,625,438,diss_Soccer1.mp4
12125,1059,631,438,diss_Soccer1.mp4
12176,1059,635,438,diss_Soccer1.mp4
12315,1059,642,440,diss_Soccer1.mp4
12435,1059,649,459,diss_Soccer1.mp4
12549,1059,621,530,diss_Soccer1.mp4
12659,1059,585,574,diss_Soccer1.mp4
12779,1059,561,593,diss_Soccer1.mp4
12893,1059,486,620,diss_Soccer1.mp4
13005,1059,416,625,diss_Soccer1.mp4
13122,1059,389,627,diss_Soccer1.mp4
13137,1059,388,627,diss_Soccer1.mp4
13592,1059,395,626,diss_Soccer1.mp4
13673,1059,424,625,diss_Soccer1.mp4
13724,1059,444,625,diss_Soccer1.mp4
14134,1059,445,624,diss_Soccer1.mp4
14182,1059,446,624,diss_Soccer1.mp4
14258,1059,447,624,diss_Soccer1.mp4
14369,1059,448,622,diss_Soccer1.mp4
14537,1059,452,618,diss_Soccer1.mp4
14648,1059,512,591,diss_Soccer1.mp4
14767,1059,659,531,diss_Soccer1.mp4
14887,1059,739,489,diss_Soccer1.mp4
15000,1059,751,481,diss_Soccer1.mp4
15008,1059,751,480,diss_Soccer1.mp4
15491,1059,751,479,diss_Soccer1.mp4
15675,1059,759,455,diss_Soccer1.mp4
15760,1059,757,429,diss_Soccer1.mp4
15877,1059,745,377,diss_Soccer1.mp4
15992,1059,742,346,diss_Soccer1.mp4
16090,1059,742,331,diss_Soccer1.mp4
16177,1059,743,324,diss_Soccer1.mp4
16374,1059,744,303,diss_Soccer1.mp4
16494,1059,744,298,diss_Soccer1.mp4
16653,1059,745,290,diss_Soccer1.mp4
16764,1059,726,291,diss_Soccer1.mp4
16872,1059,646,301,diss_Soccer1.mp4
16909,1059,643,302,diss_Soccer1.mp4
17100,1059,640,306,diss_Soccer1.mp4
17210,1059,629,317,diss_Soccer1.mp4
17312,1059,614,325,diss_Soccer1.mp4
17420,1059,598,329,diss_Soccer1.mp4
17508,1059,596,329,diss_Soccer1.mp4
17634,1059,594,329,diss_Soccer1.mp4
17749,1059,586,329,diss_Soccer1.mp4
17864,1059,579,305,diss_Soccer1.mp4
17975,1059,566,265,diss_Soccer1.mp4
18085,1059,563,246,diss_Soccer1.mp4
18184,1059,563,240,diss_Soccer1.mp4
18501,1059,525,253,diss_Soccer1.mp4
18576,1059,492,261,diss_Soccer1.mp4
18700,1059,437,275,diss_Soccer1.mp4
18812,1059,365,293,diss_Soccer1.mp4
18862,1059,348,300,diss_Soccer1.mp4
19033,1059,376,244,diss_Soccer1.mp4
19150,1059,428,166,diss_Soccer1.mp4
19272,1059,462,141,diss_Soccer1.mp4
19373,1059,482,131,diss_Soccer1.mp4
19485,1059,494,123,diss_Soccer1.mp4
19590,1059,503,113,diss_Soccer1.mp4
19706,1059,516,91,diss_Soccer1.mp4
19807,1059,520,83,diss_Soccer1.mp4
19924,1059,521,82,diss_Soccer1.mp4
20033,1059,523,77,diss_Soccer1.mp4
20144,1059,524,69,diss_Soccer1.mp4
20262,1059,521,67,diss_Soccer1.mp4
20377,1059,486,72,diss_Soccer1.mp4
20481,1059,472,77,diss_Soccer1.mp4
20705,1059,506,79,diss_Soccer1.mp4
0,1061,631,366,diss_truck2.mp4
1,1061,632,367,diss_truck2.mp4
134,1061,842,429,diss_truck2.mp4
149,1061,856,432,diss_truck2.mp4
269,1061,946,438,diss_truck2.mp4
368,1061,959,439,diss_truck2.mp4
413,1061,962,439,diss_truck2.mp4
1615,1061,966,438,diss_truck2.mp4
1690,1061,988,431,diss_truck2.mp4
1774,1061,1005,424,diss_truck2.mp4
1882,1061,1009,408,diss_truck2.mp4
2088,1061,1020,350,diss_truck2.mp4
2199,1061,1025,332,diss_truck2.mp4
2227,1061,1026,327,diss_truck2.mp4
2419,1061,1030,314,diss_truck2.mp4
2509,1061,1036,293,diss_truck2.mp4
2546,1061,1036,292,diss_truck2.mp4
2863,1061,1068,290,diss_truck2.mp4
2930,1061,1090,290,diss_truck2.mp4
2984,1061,1093,290,diss_truck2.mp4
3247,1061,1095,310,diss_truck2.mp4
3318,1061,1097,330,diss_truck2.mp4
3761,1061,1094,354,diss_truck2.mp4
3837,1061,1107,420,diss_truck2.mp4
3949,1061,1116,462,diss_truck2.mp4
4062,1061,1116,491,diss_truck2.mp4
4171,1061,1123,538,diss_truck2.mp4
4284,1061,1120,559,diss_truck2.mp4
4397,1061,1102,584,diss_truck2.mp4
4507,1061,1082,597,diss_truck2.mp4
4512,1061,1081,598,diss_truck2.mp4
4621,1061,1063,605,diss_truck2.mp4
4726,1061,1029,605,diss_truck2.mp4
4834,1061,1013,603,diss_truck2.mp4
4945,1061,989,603,diss_truck2.mp4
5162,1061,778,651,diss_truck2.mp4
5271,1061,727,655,diss_truck2.mp4
5382,1061,666,630,diss_truck2.mp4
5497,1061,632,622,diss_truck2.mp4
5595,1061,617,621,diss_truck2.mp4
5723,1061,616,619,diss_truck2.mp4
5840,1061,621,611,diss_truck2.mp4
5945,1061,637,604,diss_truck2.mp4
6053,1061,693,591,diss_truck2.mp4
6164,1061,810,564,diss_truck2.mp4
6244,1061,824,561,diss_truck2.mp4
6994,1061,852,566,diss_truck2.mp4
7083,1061,931,579,diss_truck2.mp4
7205,1061,964,582,diss_truck2.mp4
7273,1061,971,582,diss_truck2.mp4
7827,1061,972,579,diss_truck2.mp4
7900,1061,991,551,diss_truck2.mp4
8015,1061,1015,474,diss_truck2.mp4
8020,1061,1015,471,diss_truck2.mp4
8128,1061,1015,432,diss_truck2.mp4
8237,1061,1012,412,diss_truck2.mp4
8337,1061,1012,399,diss_truck2.mp4
8463,1061,952,412,diss_truck2.mp4
8569,1061,901,421,diss_truck2.mp4
8907,1061,735,498,diss_truck2.mp4
8922,1061,734,499,diss_truck2.mp4
9200,1061,744,482,diss_truck2.mp4
9276,1061,775,448,diss_truck2.mp4
9387,1061,802,415,diss_truck2.mp4
9502,1061,711,437,diss_truck2.mp4
9506,1061,700,440,diss_truck2.mp4
9727,1061,248,622,diss_truck2.mp4
9853,1061,183,654,diss_truck2.mp4
10066,1061,156,666,diss_truck2.mp4
10133,1061,136,671,diss_truck2.mp4
10237,1061,119,675,diss_truck2.mp4
10365,1061,139,668,diss_truck2.mp4
10476,1061,182,656,diss_truck2.mp4
10505,1061,184,655,diss_truck2.mp4
10620,1061,186,654,diss_truck2.mp4
11017,1061,185,654,diss_truck2.mp4
11316,1061,220,648,diss_truck2.mp4
11392,1061,365,620,diss_truck2.mp4
11509,1061,594,563,diss_truck2.mp4
11620,1061,744,523,diss_truck2.mp4
11730,1061,822,502,diss_truck2.mp4
11851,1061,851,493,diss_truck2.mp4
11958,1061,869,487,diss_truck2.mp4
12058,1061,877,485,diss_truck2.mp4
12165,1061,888,481,diss_truck2.mp4
12280,1061,910,468,diss_truck2.mp4
12392,1061,942,442,diss_truck2.mp4
12407,1061,943,441,diss_truck2.mp4
12729,1061,968,421,diss_truck2.mp4
12807,1061,988,406,diss_truck2.mp4
12915,1061,1016,381,diss_truck2.mp4
13016,1061,1025,364,diss_truck2.mp4
13126,1061,1025,345,diss_truck2.mp4
13241,1061,1022,326,diss_truck2.mp4
13460,1061,1031,299,diss_truck2.mp4
13538,1061,1033,294,diss_truck2.mp4
13639,1061,1037,287,diss_truck2.mp4
13765,1061,1046,275,diss_truck2.mp4
13873,1061,1062,261,diss_truck2.mp4
13981,1061,1072,239,diss_truck2.mp4
14089,1061,1067,221,diss_truck2.mp4
14192,1061,1061,202,diss_truck2.mp4
14196,1061,1061,201,diss_truck2.mp4
14289,1061,1054,194,diss_truck2.mp4
14383,1061,1053,192,diss_truck2.mp4
14426,1061,1052,192,diss_truck2.mp4
14844,1061,1042,192,diss_truck2.mp4
14910,1061,1040,191,diss_truck2.mp4
15018,1061,1041,191,diss_truck2.mp4
15127,1061,1075,194,diss_truck2.mp4
15236,1061,1110,214,diss_truck2.mp4
15348,1061,1143,247,diss_truck2.mp4
15379,1061,1146,249,diss_truck2.mp4
15886,1061,1146,266,diss_truck2.mp4
15957,1061,1146,316,diss_truck2.mp4
16067,1061,1138,416,diss_truck2.mp4
16181,1061,1125,445,diss_truck2.mp4
16292,1061,1115,457,diss_truck2.mp4
16394,1061,1103,463,diss_truck2.mp4
16437,1061,1100,464,diss_truck2.mp4
16532,1061,1100,465,diss_truck2.mp4
16855,1061,1122,459,diss_truck2.mp4
16929,1061,1144,454,diss_truck2.mp4
17029,1061,1161,452,diss_truck2.mp4
17320,1061,1158,458,diss_truck2.mp4
17396,1061,1151,483,diss_truck2.mp4
17511,1061,1155,509,diss_truck2.mp4
17620,1061,1159,540,diss_truck2.mp4
17699,1061,1152,563,diss_truck2.mp4
17811,1061,1126,593,diss_truck2.mp4
17919,1061,1102,611,diss_truck2.mp4
18011,1061,1094,618,diss_truck2.mp4
18051,1061,1092,619,diss_truck2.mp4
18469,1061,953,574,diss_truck2.mp4
18472,1061,952,573,diss_truck2.mp4
18596,1061,826,547,diss_truck2.mp4
18708,1061,615,499,diss_truck2.mp4
18821,1061,524,483,diss_truck2.mp4
18932,1061,462,473,diss_truck2.mp4
19021,1061,437,468,diss_truck2.mp4
19061,1061,437,467,diss_truck2.mp4
19350,1061,437,461,diss_truck2.mp4
19424,1061,437,447,diss_truck2.mp4
19543,1061,430,427,diss_truck2.mp4
19655,1061,396,386,diss_truck2.mp4
19659,1061,394,385,diss_truck2.mp4
19767,1061,333,350,diss_truck2.mp4
0,1057,634,368,diss_building2.mp4
9,1057,630,368,diss_building2.mp4
127,1057,566,351,diss_building2.mp4
229,1057,545,340,diss_building2.mp4
820,1057,563,336,diss_building2.mp4
897,1057,644,322,diss_building2.mp4
1016,1057,742,312,diss_building2.mp4
1128,1057,787,305,diss_building2.mp4
1243,1057,844,293,diss_building2.mp4
1356,1057,939,273,diss_building2.mp4
1469,1057,1003,258,diss_building2.mp4
1510,1057,1006,257,diss_building2.mp4
1649,1057,1006,256,diss_building2.mp4
1773,1057,1007,240,diss_building2.mp4
1781,1057,1007,239,diss_building2.mp4
1888,1057,1008,221,diss_building2.mp4
1951,1057,1008,215,diss_building2.mp4
1999,1057,1008,214,diss_building2.mp4
2434,1057,979,212,diss_building2.mp4
2513,1057,949,198,diss_building2.mp4
2519,1057,947,197,diss_building2.mp4
2626,1057,907,173,diss_building2.mp4
2728,1057,870,154,diss_building2.mp4
2824,1057,846,147,diss_building2.mp4
2866,1057,842,146,diss_building2.mp4
3273,1057,679,308,diss_building2.mp4
3350,1057,560,324,diss_building2.mp4
3464,1057,462,320,diss_building2.mp4
3468,1057,460,320,diss_building2.mp4
3593,1057,403,312,diss_building2.mp4
3695,1057,375,310,diss_building2.mp4
3807,1057,357,317,diss_building2.mp4
3905,1057,340,334,diss_building2.mp4
4022,1057,338,342,diss_building2.mp4
4138,1057,387,349,diss_building2.mp4
4362,1057,497,336,diss_building2.mp4
4445,1057,545,327,diss_building2.mp4
4555,1057,655,309,diss_building2.mp4
4663,1057,749,305,diss_building2.mp4
4768,1057,813,307,diss_building2.mp4
4875,1057,878,314,diss_building2.mp4
4987,1057,942,325,diss_building2.mp4
5087,1057,952,329,diss_building2.mp4
5107,1057,953,329,diss_building2.mp4
5541,1057,1016,335,diss_building2.mp4
5612,1057,1059,338,diss_building2.mp4
5725,1057,1096,337,diss_building2.mp4
5824,1057,1102,335,diss_building2.mp4
5947,1057,1108,286,diss_building2.mp4
6065,1057,1132,243,diss_building2.mp4
6178,1057,1154,226,diss_building2.mp4
6286,1057,1167,219,diss_building2.mp4
6400,1057,1180,213,diss_building2.mp4
6510,1057,1189,209,diss_building2.mp4
6599,1057,1196,206,diss_building2.mp4
6642,1057,1197,206,diss_building2.mp4
6800,1057,1197,205,diss_building2.mp4
6946,1057,1197,199,diss_building2.mp4
7054,1057,1202,185,diss_building2.mp4
7162,1057,1205,181,diss_building2.mp4
7179,1057,1205,180,diss_building2.mp4
7571,1057,1204,180,diss_building2.mp4
7637,1057,1196,181,diss_building2.mp4
7745,1057,1155,201,diss_building2.mp4
7854,1057,1073,224,diss_building2.mp4
7968,1057,985,252,diss_building2.mp4
8045,1057,956,266,diss_building2.mp4
8081,1057,955,266,diss_building2.mp4
10651,1057,954,266,diss_building2.mp4
10767,1057,933,301,diss_building2.mp4
10840,1057,930,344,diss_building2.mp4
10952,1057,945,436,diss_building2.mp4
11122,1057,967,500,diss_building2.mp4
11944,1057,998,502,diss_building2.mp4
12018,1057,1086,517,diss_building2.mp4
12140,1057,1150,525,diss_building2.mp4
13541,1057,1154,525,diss_building2.mp4
13621,1057,1160,524,diss_building2.mp4
13743,1057,1170,524,diss_building2.mp4
13850,1057,1193,512,diss_building2.mp4
13968,1057,1227,455,diss_building2.mp4
14080,1057,1250,406,diss_building2.mp4
14191,1057,1256,380,diss_building2.mp4
14300,1057,1260,359,diss_building2.mp4
14420,1057,1263,338,diss_building2.mp4
14535,1057,1264,326,diss_building2.mp4
14602,1057,1265,323,diss_building2.mp4
14759,1057,1265,320,diss_building2.mp4
14875,1057,1266,311,diss_building2.mp4
14984,1057,1268,297,diss_building2.mp4
15091,1057,1268,285,diss_building2.mp4
15117,1057,1268,284,diss_building2.mp4
15797,1057,1267,285,diss_building2.mp4
15871,1057,1263,285,diss_building2.mp4
15989,1057,1223,301,diss_building2.mp4
16085,1057,1200,332,diss_building2.mp4
16331,1057,1192,336,diss_building2.mp4
16409,1057,1176,345,diss_building2.mp4
16521,1057,1164,349,diss_building2.mp4
16736,1057,1145,352,diss_building2.mp4
16809,1057,1139,353,diss_building2.mp4
16921,1057,1126,356,diss_building2.mp4
17027,1057,1104,361,diss_building2.mp4
17140,1057,1068,372,diss_building2.mp4
17251,1057,1034,379,diss_building2.mp4
17366,1057,997,384,diss_building2.mp4
17476,1057,971,387,diss_building2.mp4
17584,1057,955,389,diss_building2.mp4
17686,1057,945,391,diss_building2.mp4
17802,1057,934,394,diss_building2.mp4
17914,1057,916,398,diss_building2.mp4
18018,1057,907,399,diss_building2.mp4
18133,1057,885,402,diss_building2.mp4
18245,1057,854,407,diss_building2.mp4
18363,1057,804,413,diss_building2.mp4
18492,1057,701,421,diss_building2.mp4
18598,1057,631,428,diss_building2.mp4
18704,1057,592,432,diss_building2.mp4
18806,1057,568,433,diss_building2.mp4
18922,1057,542,436,diss_building2.mp4
