verifToken,stimuli_id,source_id,media_a_id,source_a,created_at,source_name_vote,reversed,source_position_vote,bl,bd,nb_replay
064mpx6a,1062,4263,14054,diss_building2.mp4,1644423951,1,,1,8,120,0
064mpx6a,1060,4265,14056,diss_person22.mp4,1644423964,1,,1,8,120,0
064mpx6a,1059,4262,14053,diss_Soccer1.mp4,1644423990,1,,1,8,120,0
064mpx6a,1057,4263,14054,diss_building2.mp4,1644424014,1,,1,8,120,0
064mpx6a,1061,4266,14057,diss_truck2.mp4,1644424038,1,,1,8,120,1
064mpx6a,1058,4264,14055,diss_car13.mp4,1644424097,1,,1,8,120,0
