verifToken,stimuli_id,source_id,media_a_id,source_a,created_at,source_name_vote,reversed,source_position_vote,bl,bd,nb_replay
k0uvt4l6,1085,5565,44535,diss_building2.mp4,1648651827,1,,1,12,180,1
k0uvt4l6,1099,5560,44530,diss_StreetBasketball1.mp4,1648651861,1,,1,12,180,1
k0uvt4l6,1086,5566,44536,diss_building3.mp4,1648651872,1,,1,12,180,1
k0uvt4l6,1090,5570,44540,diss_car13.mp4,1648651903,1,,1,12,180,1
k0uvt4l6,1094,5556,44526,diss_ManRunning1.mp4,1648651934,1,,1,12,180,1
k0uvt4l6,1083,5563,44533,diss_bike3.mp4,1648651951,1,,1,12,180,1
k0uvt4l6,1097,5558,44528,diss_Soccer1.mp4,1648651968,1,,1,12,180,1
k0uvt4l6,1081,5553,44523,diss_Basketball.mp4,1648651992,1,,1,12,180,1
k0uvt4l6,1089,5569,44539,diss_car12.mp4,1648652016,1,,1,12,180,1
k0uvt4l6,1102,5561,44531,diss_Walking.mp4,1648652033,1,,1,12,180,1
k0uvt4l6,1096,5572,44542,diss_person22.mp4,1648652051,1,,1,12,180,1
k0uvt4l6,1093,5555,44525,diss_Girl2.mp4,1648652075,1,,1,12,180,1
k0uvt4l6,1101,5574,44544,diss_truck3.mp4,1648652098,1,,1,12,180,1
k0uvt4l6,1095,5557,44527,diss_ManRunning2.mp4,1648652116,1,,1,12,180,1
k0uvt4l6,1087,5567,44537,diss_building4.mp4,1648652133,1,,1,12,180,1
k0uvt4l6,1100,5573,44543,diss_truck2.mp4,1648652153,1,,1,12,180,1
k0uvt4l6,1088,5568,44538,diss_car11.mp4,1648652173,1,,1,12,180,1
k0uvt4l6,1082,5562,44532,diss_bike2.mp4,1648652189,1,,1,12,180,1
k0uvt4l6,1092,5554,44524,diss_Girl1.mp4,1648652205,1,,1,12,180,1
k0uvt4l6,1098,5559,44529,diss_Soccer2.mp4,1648652216,1,,1,12,180,1
k0uvt4l6,1091,5571,44541,diss_car15.mp4,1648652225,1,,1,12,180,1
k0uvt4l6,1084,5564,44534,diss_building1.mp4,1648652249,1,,1,12,180,1
