verifToken,stimuli_id,source_id,media_a_id,source_a,created_at,source_name_vote,reversed,source_position_vote,bl,bd,nb_replay
8ewd992o,1096,5572,44542,diss_person22.mp4,1645106708,1,,1,8,180,3
8ewd992o,1101,5574,44544,diss_truck3.mp4,1645106762,1,,1,8,180,1
8ewd992o,1093,5555,44525,diss_Girl2.mp4,1645106779,1,,1,8,180,1
8ewd992o,1098,5559,44529,diss_Soccer2.mp4,1645106801,1,,1,8,180,1
8ewd992o,1082,5562,44532,diss_bike2.mp4,1645106823,1,,1,8,180,1
8ewd992o,1088,5568,44538,diss_car11.mp4,1645106849,1,,1,8,180,3
8ewd992o,1100,5573,44543,diss_truck2.mp4,1645106872,1,,1,8,180,1
8ewd992o,1102,5561,44531,diss_Walking.mp4,1645106898,1,,1,8,180,1
8ewd992o,1097,5558,44528,diss_Soccer1.mp4,1645106914,1,,1,8,180,2
8ewd992o,1094,5556,44526,diss_ManRunning1.mp4,1645106939,1,,1,8,180,1
8ewd992o,1089,5569,44539,diss_car12.mp4,1645106961,1,,1,8,180,1
8ewd992o,1086,5566,44536,diss_building3.mp4,1645106978,1,,1,8,180,1
8ewd992o,1084,5564,44534,diss_building1.mp4,1645106994,1,,1,8,180,1
8ewd992o,1083,5563,44533,diss_bike3.mp4,1645107022,1,,1,8,180,1
8ewd992o,1087,5567,44537,diss_building4.mp4,1645107040,1,,1,8,180,1
8ewd992o,1081,5553,44523,diss_Basketball.mp4,1645107065,1,,1,8,180,1
8ewd992o,1095,5557,44527,diss_ManRunning2.mp4,1645107088,1,,1,8,180,1
8ewd992o,1091,5571,44541,diss_car15.mp4,1645107118,1,,1,8,180,2
8ewd992o,1099,5560,44530,diss_StreetBasketball1.mp4,1645107134,1,,1,8,180,1
8ewd992o,1092,5554,44524,diss_Girl1.mp4,1645107160,1,,1,8,180,2
8ewd992o,1085,5565,44535,diss_building2.mp4,1645107183,1,,1,8,180,1
8ewd992o,1090,5570,44540,diss_car13.mp4,1645107208,1,,1,8,180,1
