verifToken,stimuli_id,source_id,media_a_id,source_a,created_at,source_name_vote,reversed,source_position_vote,bl,bd,nb_replay
sdchbq72,1085,5565,44535,diss_building2.mp4,1646917988,1,,1,12,180,1
sdchbq72,1097,5558,44528,diss_Soccer1.mp4,1646918035,1,,1,12,180,1
sdchbq72,1084,5564,44534,diss_building1.mp4,1646918058,1,,1,12,180,1
sdchbq72,1092,5554,44524,diss_Girl1.mp4,1646918077,1,,1,12,180,1
sdchbq72,1089,5569,44539,diss_car12.mp4,1646918096,1,,1,12,180,1
sdchbq72,1098,5559,44529,diss_Soccer2.mp4,1646918107,1,,1,12,180,1
sdchbq72,1082,5562,44532,diss_bike2.mp4,1646918117,1,,1,12,180,1
sdchbq72,1087,5567,44537,diss_building4.mp4,1646918138,1,,1,12,180,1
sdchbq72,1093,5555,44525,diss_Girl2.mp4,1646918157,1,,1,12,180,1
sdchbq72,1090,5570,44540,diss_car13.mp4,1646918168,1,,1,12,180,1
sdchbq72,1100,5573,44543,diss_truck2.mp4,1646918179,1,,1,12,180,1
sdchbq72,1096,5572,44542,diss_person22.mp4,1646918201,1,,1,12,180,1
sdchbq72,1081,5553,44523,diss_Basketball.mp4,1646918222,1,,1,12,180,1
sdchbq72,1086,5566,44536,diss_building3.mp4,1646918252,1,,1,12,180,1
sdchbq72,1094,5556,44526,diss_ManRunning1.mp4,1646918281,1,,1,12,180,1
sdchbq72,1095,5557,44527,diss_ManRunning2.mp4,1646918306,1,,1,12,180,1
sdchbq72,1102,5561,44531,diss_Walking.mp4,1646918329,1,,1,12,180,1
sdchbq72,1099,5560,44530,diss_StreetBasketball1.mp4,1646918347,1,,1,12,180,1
sdchbq72,1091,5571,44541,diss_car15.mp4,1646918363,1,,1,12,180,1
sdchbq72,1088,5568,44538,diss_car11.mp4,1646918387,1,,1,12,180,1
sdchbq72,1083,5563,44533,diss_bike3.mp4,1646918410,1,,1,12,180,1
sdchbq72,1101,5574,44544,diss_truck3.mp4,1646918423,1,,1,12,180,1
