verifToken,stimuli_id,source_id,media_a_id,source_a,created_at,source_name_vote,reversed,source_position_vote,bl,bd,nb_replay
pfo5x16i,1097,5558,44528,diss_Soccer1.mp4,1645001648,1,,1,12,120,2
pfo5x16i,1095,5557,44527,diss_ManRunning2.mp4,1645001703,1,,1,12,120,1
pfo5x16i,1100,5573,44543,diss_truck2.mp4,1645001716,1,,1,12,120,1
pfo5x16i,1093,5555,44525,diss_Girl2.mp4,1645001727,1,,1,12,120,1
pfo5x16i,1088,5568,44538,diss_car11.mp4,1645001751,1,,1,12,120,1
pfo5x16i,1094,5556,44526,diss_ManRunning1.mp4,1645001774,1,,1,12,120,1
pfo5x16i,1082,5562,44532,diss_bike2.mp4,1645001799,1,,1,12,120,1
pfo5x16i,1089,5569,44539,diss_car12.mp4,1645001823,1,,1,12,120,1
pfo5x16i,1084,5564,44534,diss_building1.mp4,1645001838,1,,1,12,120,1
pfo5x16i,1086,5566,44536,diss_building3.mp4,1645001853,1,,1,12,120,1
pfo5x16i,1083,5563,44533,diss_bike3.mp4,1645001877,1,,1,12,120,1
pfo5x16i,1098,5559,44529,diss_Soccer2.mp4,1645001901,1,,1,12,120,1
pfo5x16i,1092,5554,44524,diss_Girl1.mp4,1645001924,1,,1,12,120,1
pfo5x16i,1087,5567,44537,diss_building4.mp4,1645001946,1,,1,12,120,1
pfo5x16i,1102,5561,44531,diss_Walking.mp4,1645001966,1,,1,12,120,1
pfo5x16i,1081,5553,44523,diss_Basketball.mp4,1645001986,1,,1,12,120,1
pfo5x16i,1090,5570,44540,diss_car13.mp4,1645002005,1,,1,12,120,1
pfo5x16i,1101,5574,44544,diss_truck3.mp4,1645002024,1,,1,12,120,1
pfo5x16i,1096,5572,44542,diss_person22.mp4,1645002055,1,,1,12,120,1
pfo5x16i,1099,5560,44530,diss_StreetBasketball1.mp4,1645002086,1,,1,12,120,1
pfo5x16i,1085,5565,44535,diss_building2.mp4,1645002104,1,,1,12,120,1
pfo5x16i,1091,5571,44541,diss_car15.mp4,1645002121,1,,1,12,120,1
