verifToken,stimuli_id,source_id,media_a_id,source_a,created_at,source_name_vote,reversed,source_position_vote,bl,bd,nb_replay
hntu7hfv,1069,4275,14066,diss_bike2.mp4,1644431727,1,,1,8,120,1
hntu7hfv,1073,4274,14065,diss_Soccer2.mp4,1644431767,1,,1,8,120,0
hntu7hfv,1071,4277,14068,diss_car12.mp4,1644431789,1,,1,8,120,0
hntu7hfv,1072,4273,14064,diss_ManRunning2.mp4,1644431802,1,,1,8,120,0
hntu7hfv,1074,4272,14063,diss_Basketball.mp4,1644431820,1,,1,8,120,0
hntu7hfv,1070,4276,14067,diss_building4.mp4,1644431850,1,,1,8,120,0
