timestamp,stimuli_id,mouseX,mouseY,stimuli
0,1060,636,378,diss_person22.mp4
1456,1060,636,379,diss_person22.mp4
1528,1060,636,380,diss_person22.mp4
2032,1060,628,360,diss_person22.mp4
2176,1060,620,336,diss_person22.mp4
2320,1060,602,324,diss_person22.mp4
2496,1060,577,312,diss_person22.mp4
2656,1060,545,302,diss_person22.mp4
2832,1060,519,300,diss_person22.mp4
3008,1060,492,301,diss_person22.mp4
3184,1060,471,307,diss_person22.mp4
3375,1060,447,322,diss_person22.mp4
3535,1060,430,338,diss_person22.mp4
3711,1060,420,357,diss_person22.mp4
3872,1060,416,384,diss_person22.mp4
4064,1060,416,403,diss_person22.mp4
4240,1060,362,450,diss_person22.mp4
4400,1060,199,448,diss_person22.mp4
4567,1060,150,473,diss_person22.mp4
4728,1060,118,504,diss_person22.mp4
4904,1060,108,509,diss_person22.mp4
5064,1060,94,514,diss_person22.mp4
5231,1060,87,522,diss_person22.mp4
5321,1060,86,526,diss_person22.mp4
5728,1060,215,528,diss_person22.mp4
5904,1060,318,508,diss_person22.mp4
6064,1060,479,491,diss_person22.mp4
6240,1060,636,472,diss_person22.mp4
6416,1060,709,461,diss_person22.mp4
6567,1060,752,463,diss_person22.mp4
6600,1060,752,464,diss_person22.mp4
7208,1060,680,409,diss_person22.mp4
0,1058,608,396,diss_car13.mp4
144,1058,587,442,diss_car13.mp4
304,1058,586,490,diss_car13.mp4
472,1058,613,494,diss_car13.mp4
631,1058,638,478,diss_car13.mp4
776,1058,688,450,diss_car13.mp4
943,1058,738,414,diss_car13.mp4
1121,1058,760,305,diss_car13.mp4
1304,1058,708,228,diss_car13.mp4
1473,1058,652,188,diss_car13.mp4
1640,1058,628,180,diss_car13.mp4
1807,1058,586,175,diss_car13.mp4
1968,1058,541,174,diss_car13.mp4
2087,1058,500,184,diss_car13.mp4
2296,1058,492,188,diss_car13.mp4
2487,1058,361,229,diss_car13.mp4
2663,1058,238,284,diss_car13.mp4
2832,1058,171,298,diss_car13.mp4
2984,1058,140,289,diss_car13.mp4
3168,1058,126,266,diss_car13.mp4
3344,1058,130,338,diss_car13.mp4
3520,1058,254,478,diss_car13.mp4
3832,1058,466,502,diss_car13.mp4
3984,1058,500,501,diss_car13.mp4
4152,1058,554,502,diss_car13.mp4
4336,1058,612,507,diss_car13.mp4
4512,1058,650,508,diss_car13.mp4
4680,1058,703,496,diss_car13.mp4
4832,1058,788,510,diss_car13.mp4
4976,1058,851,539,diss_car13.mp4
5184,1058,874,528,diss_car13.mp4
5520,1058,895,486,diss_car13.mp4
5664,1058,934,465,diss_car13.mp4
5992,1058,964,405,diss_car13.mp4
6169,1058,960,394,diss_car13.mp4
6272,1058,956,392,diss_car13.mp4
6776,1058,906,365,diss_car13.mp4
6912,1058,868,353,diss_car13.mp4
7063,1058,768,325,diss_car13.mp4
7232,1058,702,306,diss_car13.mp4
7409,1058,620,267,diss_car13.mp4
7592,1058,602,231,diss_car13.mp4
7743,1058,638,88,diss_car13.mp4
7912,1058,658,39,diss_car13.mp4
8073,1058,708,0,diss_car13.mp4
8168,1058,728,0,diss_car13.mp4
8279,1058,730,0,diss_car13.mp4
9112,1058,697,14,diss_car13.mp4
9120,1058,686,17,diss_car13.mp4
9320,1058,427,85,diss_car13.mp4
9328,1058,421,88,diss_car13.mp4
9663,1058,269,190,diss_car13.mp4
9832,1058,185,220,diss_car13.mp4
9912,1058,173,224,diss_car13.mp4
10088,1058,167,228,diss_car13.mp4
10264,1058,166,227,diss_car13.mp4
10432,1058,160,215,diss_car13.mp4
10608,1058,71,414,diss_car13.mp4
10639,1058,71,420,diss_car13.mp4
11576,1058,128,396,diss_car13.mp4
11720,1058,733,57,diss_car13.mp4
11840,1058,768,32,diss_car13.mp4
12024,1058,784,27,diss_car13.mp4
12376,1058,986,68,diss_car13.mp4
12480,1058,1004,77,diss_car13.mp4
12695,1058,1011,106,diss_car13.mp4
12864,1058,1084,171,diss_car13.mp4
12976,1058,1114,177,diss_car13.mp4
13336,1058,1023,135,diss_car13.mp4
13488,1058,852,87,diss_car13.mp4
0,1058,636,375,diss_car13.mp4
128,1058,636,360,diss_car13.mp4
312,1058,636,350,diss_car13.mp4
464,1058,671,160,diss_car13.mp4
608,1058,664,40,diss_car13.mp4
944,1058,635,0,diss_car13.mp4
1184,1058,620,0,diss_car13.mp4
2720,1058,640,0,diss_car13.mp4
2864,1058,742,0,diss_car13.mp4
3016,1058,772,36,diss_car13.mp4
3193,1058,782,244,diss_car13.mp4
3360,1058,790,304,diss_car13.mp4
3520,1058,779,348,diss_car13.mp4
3696,1058,768,384,diss_car13.mp4
3864,1058,838,418,diss_car13.mp4
4040,1058,978,396,diss_car13.mp4
4207,1058,1059,367,diss_car13.mp4
4392,1058,1121,377,diss_car13.mp4
4712,1058,1098,302,diss_car13.mp4
4888,1058,946,288,diss_car13.mp4
5080,1058,880,292,diss_car13.mp4
5248,1058,816,276,diss_car13.mp4
5424,1058,746,255,diss_car13.mp4
5568,1058,711,253,diss_car13.mp4
5735,1058,696,254,diss_car13.mp4
5896,1058,664,254,diss_car13.mp4
6072,1058,634,256,diss_car13.mp4
6408,1058,542,314,diss_car13.mp4
6568,1058,458,344,diss_car13.mp4
6743,1058,405,342,diss_car13.mp4
6759,1058,400,340,diss_car13.mp4
6919,1058,340,303,diss_car13.mp4
7096,1058,305,290,diss_car13.mp4
7280,1058,256,288,diss_car13.mp4
7440,1058,245,285,diss_car13.mp4
7600,1058,202,275,diss_car13.mp4
7776,1058,98,257,diss_car13.mp4
7952,1058,4,255,diss_car13.mp4
8120,1058,0,267,diss_car13.mp4
8192,1058,0,270,diss_car13.mp4
8616,1058,61,168,diss_car13.mp4
8768,1058,288,148,diss_car13.mp4
8951,1058,549,129,diss_car13.mp4
9136,1058,709,76,diss_car13.mp4
9360,1058,750,57,diss_car13.mp4
9928,1058,811,81,diss_car13.mp4
10064,1058,918,71,diss_car13.mp4
10240,1058,990,114,diss_car13.mp4
10384,1058,992,258,diss_car13.mp4
10488,1058,964,308,diss_car13.mp4
10721,1058,982,202,diss_car13.mp4
11065,1058,872,57,diss_car13.mp4
11232,1058,868,4,diss_car13.mp4
11271,1058,868,0,diss_car13.mp4
11513,1058,867,0,diss_car13.mp4
11704,1058,816,0,diss_car13.mp4
11808,1058,791,0,diss_car13.mp4
12456,1058,791,7,diss_car13.mp4
12760,1058,772,187,diss_car13.mp4
12896,1058,756,210,diss_car13.mp4
13056,1058,746,228,diss_car13.mp4
13239,1058,743,231,diss_car13.mp4
13367,1058,738,238,diss_car13.mp4
13560,1058,729,212,diss_car13.mp4
13744,1058,683,138,diss_car13.mp4
13920,1058,657,106,diss_car13.mp4
14087,1058,632,92,diss_car13.mp4
14103,1058,631,92,diss_car13.mp4
14272,1058,569,92,diss_car13.mp4
0,1059,460,353,diss_Soccer1.mp4
15,1059,444,368,diss_Soccer1.mp4
168,1059,301,496,diss_Soccer1.mp4
352,1059,59,490,diss_Soccer1.mp4
503,1059,50,518,diss_Soccer1.mp4
656,1059,46,524,diss_Soccer1.mp4
823,1059,32,537,diss_Soccer1.mp4
887,1059,26,547,diss_Soccer1.mp4
1097,1059,18,537,diss_Soccer1.mp4
1311,1059,42,554,diss_Soccer1.mp4
1480,1059,64,556,diss_Soccer1.mp4
1647,1059,98,545,diss_Soccer1.mp4
1799,1059,119,542,diss_Soccer1.mp4
1976,1059,164,540,diss_Soccer1.mp4
2160,1059,228,552,diss_Soccer1.mp4
2344,1059,328,545,diss_Soccer1.mp4
2487,1059,351,540,diss_Soccer1.mp4
2664,1059,370,550,diss_Soccer1.mp4
2831,1059,502,574,diss_Soccer1.mp4
3016,1059,624,570,diss_Soccer1.mp4
3073,1059,645,572,diss_Soccer1.mp4
3480,1059,716,586,diss_Soccer1.mp4
3856,1059,716,584,diss_Soccer1.mp4
4056,1059,722,585,diss_Soccer1.mp4
4192,1059,976,602,diss_Soccer1.mp4
4287,1059,1116,612,diss_Soccer1.mp4
4832,1059,226,241,diss_Soccer1.mp4
4984,1059,208,159,diss_Soccer1.mp4
5160,1059,351,134,diss_Soccer1.mp4
5337,1059,521,110,diss_Soccer1.mp4
5504,1059,568,110,diss_Soccer1.mp4
5672,1059,590,167,diss_Soccer1.mp4
5800,1059,602,190,diss_Soccer1.mp4
6160,1059,676,208,diss_Soccer1.mp4
6336,1059,736,188,diss_Soccer1.mp4
6504,1059,782,178,diss_Soccer1.mp4
6567,1059,786,174,diss_Soccer1.mp4
6809,1059,639,205,diss_Soccer1.mp4
6976,1059,439,252,diss_Soccer1.mp4
7143,1059,267,264,diss_Soccer1.mp4
7336,1059,187,312,diss_Soccer1.mp4
7495,1059,154,332,diss_Soccer1.mp4
7656,1059,130,336,diss_Soccer1.mp4
7832,1059,114,349,diss_Soccer1.mp4
7991,1059,222,414,diss_Soccer1.mp4
8176,1059,451,375,diss_Soccer1.mp4
8351,1059,580,324,diss_Soccer1.mp4
8512,1059,707,314,diss_Soccer1.mp4
8672,1059,781,314,diss_Soccer1.mp4
8840,1059,822,314,diss_Soccer1.mp4
8976,1059,858,304,diss_Soccer1.mp4
9176,1059,802,304,diss_Soccer1.mp4
9343,1059,370,254,diss_Soccer1.mp4
9488,1059,0,200,diss_Soccer1.mp4
9688,1059,0,219,diss_Soccer1.mp4
9832,1059,0,230,diss_Soccer1.mp4
9975,1059,0,233,diss_Soccer1.mp4
10031,1059,0,234,diss_Soccer1.mp4
10656,1059,398,332,diss_Soccer1.mp4
10784,1059,580,348,diss_Soccer1.mp4
10936,1059,678,344,diss_Soccer1.mp4
11112,1059,746,343,diss_Soccer1.mp4
11424,1059,818,367,diss_Soccer1.mp4
11896,1059,646,392,diss_Soccer1.mp4
11992,1059,604,396,diss_Soccer1.mp4
13136,1059,604,397,diss_Soccer1.mp4
13320,1059,603,399,diss_Soccer1.mp4
15305,1059,603,406,diss_Soccer1.mp4
15312,1059,603,410,diss_Soccer1.mp4
15488,1059,596,482,diss_Soccer1.mp4
15632,1059,594,497,diss_Soccer1.mp4
15663,1059,594,498,diss_Soccer1.mp4
16112,1059,594,501,diss_Soccer1.mp4
16464,1059,594,504,diss_Soccer1.mp4
16519,1059,594,508,diss_Soccer1.mp4
19584,1059,586,453,diss_Soccer1.mp4
19728,1059,594,366,diss_Soccer1.mp4
19904,1059,607,326,diss_Soccer1.mp4
20071,1059,614,291,diss_Soccer1.mp4
20256,1059,617,253,diss_Soccer1.mp4
20424,1059,622,245,diss_Soccer1.mp4
0,1057,637,373,diss_building2.mp4
72,1057,634,372,diss_building2.mp4
657,1057,628,370,diss_building2.mp4
664,1057,625,369,diss_building2.mp4
833,1057,542,260,diss_building2.mp4
1008,1057,470,166,diss_building2.mp4
1177,1057,446,140,diss_building2.mp4
1441,1057,359,105,diss_building2.mp4
1649,1057,340,100,diss_building2.mp4
1801,1057,338,99,diss_building2.mp4
1953,1057,338,100,diss_building2.mp4
2289,1057,480,130,diss_building2.mp4
2465,1057,518,138,diss_building2.mp4
2641,1057,544,145,diss_building2.mp4
2801,1057,575,148,diss_building2.mp4
2961,1057,604,149,diss_building2.mp4
3121,1057,630,150,diss_building2.mp4
3289,1057,690,158,diss_building2.mp4
3449,1057,774,173,diss_building2.mp4
3625,1057,829,183,diss_building2.mp4
3785,1057,854,191,diss_building2.mp4
3970,1057,896,210,diss_building2.mp4
4137,1057,917,217,diss_building2.mp4
4297,1057,934,220,diss_building2.mp4
4457,1057,952,224,diss_building2.mp4
4641,1057,990,232,diss_building2.mp4
4744,1057,1004,236,diss_building2.mp4
4969,1057,877,324,diss_building2.mp4
5137,1057,689,408,diss_building2.mp4
5321,1057,661,414,diss_building2.mp4
5465,1057,650,415,diss_building2.mp4
5808,1057,650,392,diss_building2.mp4
5977,1057,634,314,diss_building2.mp4
5985,1057,634,311,diss_building2.mp4
6153,1057,697,291,diss_building2.mp4
6337,1057,760,301,diss_building2.mp4
6497,1057,765,301,diss_building2.mp4
6673,1057,802,311,diss_building2.mp4
6841,1057,840,324,diss_building2.mp4
6985,1057,868,329,diss_building2.mp4
7169,1057,916,340,diss_building2.mp4
7353,1057,1003,351,diss_building2.mp4
7537,1057,1036,355,diss_building2.mp4
7705,1057,1037,355,diss_building2.mp4
8160,1057,1006,340,diss_building2.mp4
8337,1057,728,270,diss_building2.mp4
8345,1057,716,269,diss_building2.mp4
8529,1057,512,268,diss_building2.mp4
8705,1057,385,275,diss_building2.mp4
8873,1057,320,273,diss_building2.mp4
9033,1057,260,280,diss_building2.mp4
9185,1057,202,289,diss_building2.mp4
9346,1057,174,300,diss_building2.mp4
9521,1057,234,324,diss_building2.mp4
9705,1057,418,326,diss_building2.mp4
9801,1057,449,328,diss_building2.mp4
10025,1057,426,372,diss_building2.mp4
10353,1057,414,444,diss_building2.mp4
10465,1057,424,452,diss_building2.mp4
10697,1057,380,454,diss_building2.mp4
10865,1057,266,428,diss_building2.mp4
10993,1057,268,424,diss_building2.mp4
11161,1057,480,440,diss_building2.mp4
11321,1057,654,470,diss_building2.mp4
11489,1057,738,454,diss_building2.mp4
11600,1057,746,441,diss_building2.mp4
11769,1057,751,437,diss_building2.mp4
12265,1057,801,376,diss_building2.mp4
12400,1057,812,334,diss_building2.mp4
12440,1057,814,332,diss_building2.mp4
13241,1057,825,331,diss_building2.mp4
13345,1057,848,331,diss_building2.mp4
14082,1057,894,250,diss_building2.mp4
14217,1057,903,191,diss_building2.mp4
14305,1057,904,188,diss_building2.mp4
14744,1057,914,172,diss_building2.mp4
14921,1057,914,168,diss_building2.mp4
15105,1057,877,147,diss_building2.mp4
15257,1057,719,111,diss_building2.mp4
15441,1057,572,107,diss_building2.mp4
15625,1057,518,86,diss_building2.mp4
15848,1057,438,60,diss_building2.mp4
16409,1057,604,86,diss_building2.mp4
16544,1057,783,111,diss_building2.mp4
16712,1057,830,122,diss_building2.mp4
16897,1057,842,124,diss_building2.mp4
17169,1057,838,131,diss_building2.mp4
17321,1057,642,254,diss_building2.mp4
17497,1057,419,350,diss_building2.mp4
17665,1057,348,352,diss_building2.mp4
17841,1057,316,347,diss_building2.mp4
18009,1057,240,324,diss_building2.mp4
18129,1057,234,323,diss_building2.mp4
18313,1057,236,323,diss_building2.mp4
18497,1057,791,250,diss_building2.mp4
18673,1057,1016,170,diss_building2.mp4
18817,1057,1022,143,diss_building2.mp4
18848,1057,1022,142,diss_building2.mp4
0,1061,526,419,diss_truck2.mp4
136,1061,347,475,diss_truck2.mp4
296,1061,349,466,diss_truck2.mp4
480,1061,405,455,diss_truck2.mp4
656,1061,602,402,diss_truck2.mp4
727,1061,628,404,diss_truck2.mp4
1185,1061,627,404,diss_truck2.mp4
1264,1061,626,404,diss_truck2.mp4
2559,1061,626,407,diss_truck2.mp4
2624,1061,626,414,diss_truck2.mp4
3016,1061,636,411,diss_truck2.mp4
3160,1061,742,388,diss_truck2.mp4
3312,1061,902,393,diss_truck2.mp4
3640,1061,856,424,diss_truck2.mp4
3768,1061,852,416,diss_truck2.mp4
3968,1061,904,370,diss_truck2.mp4
4153,1061,1092,462,diss_truck2.mp4
4336,1061,814,539,diss_truck2.mp4
4503,1061,479,326,diss_truck2.mp4
4672,1061,456,234,diss_truck2.mp4
5000,1061,816,342,diss_truck2.mp4
5167,1061,781,396,diss_truck2.mp4
5360,1061,561,427,diss_truck2.mp4
5529,1061,326,383,diss_truck2.mp4
5825,1061,227,367,diss_truck2.mp4
6000,1061,46,335,diss_truck2.mp4
6328,1061,25,334,diss_truck2.mp4
6472,1061,368,348,diss_truck2.mp4
6632,1061,659,350,diss_truck2.mp4
6792,1061,989,336,diss_truck2.mp4
6856,1061,1014,336,diss_truck2.mp4
11904,1061,1014,335,diss_truck2.mp4
12183,1061,1012,333,diss_truck2.mp4
12320,1061,1010,332,diss_truck2.mp4
13608,1061,1009,332,diss_truck2.mp4
13784,1061,1006,326,diss_truck2.mp4
13800,1061,1006,325,diss_truck2.mp4
13847,1061,1005,320,diss_truck2.mp4
14104,1061,1004,320,diss_truck2.mp4
14455,1061,988,317,diss_truck2.mp4
14511,1061,978,317,diss_truck2.mp4
15056,1061,714,272,diss_truck2.mp4
15191,1061,296,188,diss_truck2.mp4
15368,1061,188,254,diss_truck2.mp4
15520,1061,178,256,diss_truck2.mp4
15856,1061,308,273,diss_truck2.mp4
15992,1061,462,275,diss_truck2.mp4
16176,1061,668,284,diss_truck2.mp4
16351,1061,772,288,diss_truck2.mp4
16528,1061,849,282,diss_truck2.mp4
16687,1061,862,303,diss_truck2.mp4
16848,1061,722,333,diss_truck2.mp4
17016,1061,336,322,diss_truck2.mp4
17184,1061,204,326,diss_truck2.mp4
17336,1061,126,338,diss_truck2.mp4
17664,1061,64,336,diss_truck2.mp4
17840,1061,67,384,diss_truck2.mp4
18023,1061,184,407,diss_truck2.mp4
18175,1061,296,404,diss_truck2.mp4
18344,1061,384,393,diss_truck2.mp4
18352,1061,390,393,diss_truck2.mp4
18513,1061,478,375,diss_truck2.mp4
18848,1061,750,385,diss_truck2.mp4
18999,1061,776,402,diss_truck2.mp4
19168,1061,688,456,diss_truck2.mp4
19352,1061,474,430,diss_truck2.mp4
19528,1061,345,381,diss_truck2.mp4
19688,1061,309,372,diss_truck2.mp4
19783,1061,298,370,diss_truck2.mp4
20160,1061,512,404,diss_truck2.mp4
0,1062,727,247,diss_building2.mp4
72,1062,756,112,diss_building2.mp4
296,1062,743,118,diss_building2.mp4
440,1062,708,162,diss_building2.mp4
616,1062,750,182,diss_building2.mp4
799,1062,940,192,diss_building2.mp4
960,1062,983,198,diss_building2.mp4
1128,1062,1008,252,diss_building2.mp4
1296,1062,1071,268,diss_building2.mp4
1464,1062,1112,275,diss_building2.mp4
1784,1062,1102,280,diss_building2.mp4
1968,1062,907,248,diss_building2.mp4
2144,1062,718,179,diss_building2.mp4
2312,1062,588,148,diss_building2.mp4
2472,1062,516,126,diss_building2.mp4
2480,1062,512,125,diss_building2.mp4
2664,1062,417,106,diss_building2.mp4
2833,1062,285,116,diss_building2.mp4
3016,1062,229,144,diss_building2.mp4
3199,1062,228,188,diss_building2.mp4
3376,1062,198,243,diss_building2.mp4
3552,1062,202,295,diss_building2.mp4
3720,1062,258,369,diss_building2.mp4
3896,1062,321,415,diss_building2.mp4
4064,1062,411,445,diss_building2.mp4
4392,1062,586,462,diss_building2.mp4
4536,1062,670,473,diss_building2.mp4
4712,1062,772,494,diss_building2.mp4
4880,1062,912,524,diss_building2.mp4
5056,1062,1078,532,diss_building2.mp4
5231,1062,1228,484,diss_building2.mp4
5399,1062,1228,408,diss_building2.mp4
5552,1062,1170,318,diss_building2.mp4
5720,1062,1134,268,diss_building2.mp4
5888,1062,1111,162,diss_building2.mp4
6224,1062,1234,114,diss_building2.mp4
6384,1062,1279,117,diss_building2.mp4
6551,1062,1279,118,diss_building2.mp4
6703,1062,1279,87,diss_building2.mp4
7017,1062,1236,70,diss_building2.mp4
7176,1062,1150,72,diss_building2.mp4
7344,1062,1032,117,diss_building2.mp4
7512,1062,844,128,diss_building2.mp4
7672,1062,728,146,diss_building2.mp4
7840,1062,584,189,diss_building2.mp4
7847,1062,575,191,diss_building2.mp4
8008,1062,340,242,diss_building2.mp4
8200,1062,222,324,diss_building2.mp4
8368,1062,82,393,diss_building2.mp4
8711,1062,141,490,diss_building2.mp4
8888,1062,370,482,diss_building2.mp4
9056,1062,540,404,diss_building2.mp4
9223,1062,670,314,diss_building2.mp4
9392,1062,878,246,diss_building2.mp4
9552,1062,1015,240,diss_building2.mp4
9615,1062,1027,240,diss_building2.mp4
9799,1062,1030,240,diss_building2.mp4
10034,1062,1050,241,diss_building2.mp4
10168,1062,1053,241,diss_building2.mp4
10512,1062,927,286,diss_building2.mp4
10656,1062,779,382,diss_building2.mp4
10663,1062,776,386,diss_building2.mp4
10751,1062,771,396,diss_building2.mp4
10968,1062,737,386,diss_building2.mp4
11136,1062,659,366,diss_building2.mp4
11456,1062,604,366,diss_building2.mp4
11601,1062,670,362,diss_building2.mp4
11673,1062,673,362,diss_building2.mp4
12984,1062,522,346,diss_building2.mp4
13128,1062,319,345,diss_building2.mp4
13296,1062,260,356,diss_building2.mp4
13464,1062,89,364,diss_building2.mp4
13623,1062,66,370,diss_building2.mp4
13808,1062,21,381,diss_building2.mp4
13944,1062,4,392,diss_building2.mp4
14120,1062,24,430,diss_building2.mp4
14296,1062,102,450,diss_building2.mp4
14456,1062,146,453,diss_building2.mp4
14624,1062,184,450,diss_building2.mp4
14792,1062,275,425,diss_building2.mp4
14895,1062,328,407,diss_building2.mp4
15096,1062,334,405,diss_building2.mp4
15711,1062,361,398,diss_building2.mp4
15872,1062,425,386,diss_building2.mp4
16048,1062,524,370,diss_building2.mp4
16216,1062,563,364,diss_building2.mp4
16383,1062,622,361,diss_building2.mp4
16559,1062,718,354,diss_building2.mp4
16712,1062,767,350,diss_building2.mp4
17065,1062,927,321,diss_building2.mp4
17231,1062,1051,292,diss_building2.mp4
17360,1062,1105,283,diss_building2.mp4
