verifToken,stimuli_id,source_id,media_a_id,source_a,created_at,source_name_vote,reversed,source_position_vote,bl,bd,nb_replay
7npnnjb4,1093,5555,44525,diss_Girl2.mp4,1645023356,1,,1,8,180,1
7npnnjb4,1102,5561,44531,diss_Walking.mp4,1645023403,1,,1,8,180,1
7npnnjb4,1091,5571,44541,diss_car15.mp4,1645023419,1,,1,8,180,1
7npnnjb4,1094,5556,44526,diss_ManRunning1.mp4,1645023441,1,,1,8,180,1
7npnnjb4,1086,5566,44536,diss_building3.mp4,1645023459,1,,1,8,180,1
7npnnjb4,1099,5560,44530,diss_StreetBasketball1.mp4,1645023484,1,,1,8,180,1
7npnnjb4,1081,5553,44523,diss_Basketball.mp4,1645023508,1,,1,8,180,1
7npnnjb4,1083,5563,44533,diss_bike3.mp4,1645023540,1,,1,8,180,1
7npnnjb4,1098,5559,44529,diss_Soccer2.mp4,1645023571,1,,1,8,180,1
7npnnjb4,1084,5564,44534,diss_building1.mp4,1645023583,1,,1,8,180,1
7npnnjb4,1089,5569,44539,diss_car12.mp4,1645023594,1,,1,8,180,1
7npnnjb4,1100,5573,44543,diss_truck2.mp4,1645023612,1,,1,8,180,1
7npnnjb4,1090,5570,44540,diss_car13.mp4,1645023629,1,,1,8,180,1
7npnnjb4,1092,5554,44524,diss_Girl1.mp4,1645023647,1,,1,8,180,1
7npnnjb4,1101,5574,44544,diss_truck3.mp4,1645023665,1,,1,8,180,1
7npnnjb4,1087,5567,44537,diss_building4.mp4,1645023677,1,,1,8,180,1
7npnnjb4,1085,5565,44535,diss_building2.mp4,1645023688,1,,1,8,180,1
7npnnjb4,1082,5562,44532,diss_bike2.mp4,1645023708,1,,1,8,180,1
7npnnjb4,1097,5558,44528,diss_Soccer1.mp4,1645023726,1,,1,8,180,1
7npnnjb4,1096,5572,44542,diss_person22.mp4,1645023748,1,,1,8,180,1
7npnnjb4,1095,5557,44527,diss_ManRunning2.mp4,1645023767,1,,1,8,180,1
7npnnjb4,1088,5568,44538,diss_car11.mp4,1645023791,1,,1,8,180,1
