timestamp,stimuli_id,mouseX,mouseY,stimuli
-1,1058,-1,-1,diss_car13.mp4
0,1057,639,382,diss_building2.mp4
62,1057,638,382,diss_building2.mp4
78,1057,637,382,diss_building2.mp4
90,1057,636,383,diss_building2.mp4
128,1057,628,388,diss_building2.mp4
168,1057,604,394,diss_building2.mp4
198,1057,584,396,diss_building2.mp4
230,1057,569,396,diss_building2.mp4
262,1057,558,397,diss_building2.mp4
301,1057,538,402,diss_building2.mp4
333,1057,527,406,diss_building2.mp4
364,1057,514,412,diss_building2.mp4
402,1057,500,418,diss_building2.mp4
434,1057,486,425,diss_building2.mp4
464,1057,467,432,diss_building2.mp4
496,1057,449,441,diss_building2.mp4
598,1057,420,463,diss_building2.mp4
644,1057,412,468,diss_building2.mp4
660,1057,410,470,diss_building2.mp4
676,1057,409,470,diss_building2.mp4
684,1057,408,471,diss_building2.mp4
706,1057,407,471,diss_building2.mp4
730,1057,405,472,diss_building2.mp4
778,1057,397,475,diss_building2.mp4
800,1057,394,476,diss_building2.mp4
832,1057,391,476,diss_building2.mp4
910,1057,390,476,diss_building2.mp4
942,1057,388,476,diss_building2.mp4
958,1057,387,476,diss_building2.mp4
996,1057,385,476,diss_building2.mp4
1016,1057,384,476,diss_building2.mp4
1066,1057,379,476,diss_building2.mp4
1106,1057,367,480,diss_building2.mp4
1200,1057,347,492,diss_building2.mp4
1208,1057,347,493,diss_building2.mp4
1270,1057,339,500,diss_building2.mp4
1278,1057,338,500,diss_building2.mp4
1294,1057,337,502,diss_building2.mp4
1312,1057,336,503,diss_building2.mp4
1332,1057,332,505,diss_building2.mp4
1364,1057,327,510,diss_building2.mp4
1402,1057,321,514,diss_building2.mp4
1434,1057,314,518,diss_building2.mp4
1466,1057,306,522,diss_building2.mp4
1496,1057,301,524,diss_building2.mp4
1536,1057,295,524,diss_building2.mp4
1566,1057,289,524,diss_building2.mp4
1598,1057,284,524,diss_building2.mp4
1630,1057,279,524,diss_building2.mp4
1668,1057,272,523,diss_building2.mp4
1700,1057,267,523,diss_building2.mp4
1730,1057,262,522,diss_building2.mp4
1832,1057,241,516,diss_building2.mp4
1873,1057,230,512,diss_building2.mp4
1888,1057,222,511,diss_building2.mp4
1910,1057,212,508,diss_building2.mp4
1926,1057,206,504,diss_building2.mp4
1988,1057,181,492,diss_building2.mp4
2020,1057,172,486,diss_building2.mp4
2052,1057,163,480,diss_building2.mp4
2082,1057,153,471,diss_building2.mp4
2114,1057,145,462,diss_building2.mp4
2146,1057,139,454,diss_building2.mp4
2180,1057,134,448,diss_building2.mp4
2212,1057,130,443,diss_building2.mp4
2242,1057,128,437,diss_building2.mp4
2282,1057,124,430,diss_building2.mp4
2322,1057,122,423,diss_building2.mp4
2416,1057,112,405,diss_building2.mp4
2454,1057,107,398,diss_building2.mp4
2478,1057,107,395,diss_building2.mp4
2494,1057,105,392,diss_building2.mp4
2510,1057,104,389,diss_building2.mp4
2534,1057,103,385,diss_building2.mp4
2564,1057,102,382,diss_building2.mp4
2588,1057,102,381,diss_building2.mp4
2620,1057,102,380,diss_building2.mp4
2662,1057,102,378,diss_building2.mp4
2702,1057,102,376,diss_building2.mp4
2718,1057,102,375,diss_building2.mp4
2768,1057,102,372,diss_building2.mp4
2788,1057,102,371,diss_building2.mp4
2830,1057,101,369,diss_building2.mp4
2854,1057,101,368,diss_building2.mp4
2890,1057,100,367,diss_building2.mp4
2952,1057,99,366,diss_building2.mp4
3014,1057,95,363,diss_building2.mp4
3070,1057,92,363,diss_building2.mp4
3088,1057,91,363,diss_building2.mp4
3112,1057,90,363,diss_building2.mp4
3154,1057,88,363,diss_building2.mp4
3170,1057,87,363,diss_building2.mp4
3186,1057,86,363,diss_building2.mp4
3230,1057,83,363,diss_building2.mp4
3260,1057,82,364,diss_building2.mp4
3300,1057,81,364,diss_building2.mp4
3374,1057,80,364,diss_building2.mp4
3436,1057,79,364,diss_building2.mp4
3452,1057,78,364,diss_building2.mp4
3502,1057,75,364,diss_building2.mp4
3542,1057,73,365,diss_building2.mp4
3628,1057,69,366,diss_building2.mp4
3792,1057,69,365,diss_building2.mp4
3801,1057,70,365,diss_building2.mp4
3832,1057,74,363,diss_building2.mp4
3862,1057,80,361,diss_building2.mp4
3902,1057,87,358,diss_building2.mp4
3932,1057,92,353,diss_building2.mp4
3964,1057,97,349,diss_building2.mp4
3996,1057,102,343,diss_building2.mp4
4034,1057,105,340,diss_building2.mp4
4078,1057,107,338,diss_building2.mp4
4100,1057,109,335,diss_building2.mp4
4132,1057,111,332,diss_building2.mp4
4169,1057,114,329,diss_building2.mp4
4268,1057,130,314,diss_building2.mp4
4276,1057,131,313,diss_building2.mp4
4340,1057,143,302,diss_building2.mp4
4362,1057,148,298,diss_building2.mp4
4378,1057,150,296,diss_building2.mp4
4394,1057,153,293,diss_building2.mp4
4402,1057,155,292,diss_building2.mp4
4440,1057,159,290,diss_building2.mp4
4472,1057,164,287,diss_building2.mp4
4512,1057,168,284,diss_building2.mp4
4550,1057,175,279,diss_building2.mp4
4582,1057,181,275,diss_building2.mp4
4612,1057,187,269,diss_building2.mp4
4652,1057,196,263,diss_building2.mp4
4684,1057,205,258,diss_building2.mp4
4714,1057,213,254,diss_building2.mp4
4754,1057,222,250,diss_building2.mp4
4858,1057,242,235,diss_building2.mp4
4886,1057,248,230,diss_building2.mp4
4894,1057,249,230,diss_building2.mp4
4910,1057,252,228,diss_building2.mp4
4926,1057,256,227,diss_building2.mp4
4948,1057,260,223,diss_building2.mp4
4980,1057,269,219,diss_building2.mp4
5012,1057,276,213,diss_building2.mp4
5050,1057,284,209,diss_building2.mp4
5082,1057,293,205,diss_building2.mp4
5114,1057,306,199,diss_building2.mp4
5152,1057,320,192,diss_building2.mp4
5184,1057,327,189,diss_building2.mp4
5214,1057,333,184,diss_building2.mp4
5246,1057,339,182,diss_building2.mp4
5286,1057,345,177,diss_building2.mp4
5316,1057,351,175,diss_building2.mp4
5348,1057,357,172,diss_building2.mp4
5378,1057,362,170,diss_building2.mp4
5480,1057,382,159,diss_building2.mp4
5528,1057,390,155,diss_building2.mp4
5542,1057,393,155,diss_building2.mp4
5558,1057,395,154,diss_building2.mp4
5574,1057,397,153,diss_building2.mp4
5606,1057,402,151,diss_building2.mp4
5636,1057,408,151,diss_building2.mp4
5668,1057,413,150,diss_building2.mp4
5700,1057,417,150,diss_building2.mp4
5730,1057,422,150,diss_building2.mp4
5762,1057,427,150,diss_building2.mp4
5801,1057,434,150,diss_building2.mp4
5832,1057,442,150,diss_building2.mp4
5864,1057,448,149,diss_building2.mp4
5902,1057,454,149,diss_building2.mp4
5934,1057,459,149,diss_building2.mp4
5964,1057,464,149,diss_building2.mp4
5996,1057,470,149,diss_building2.mp4
6098,1057,505,154,diss_building2.mp4
6144,1057,535,156,diss_building2.mp4
6160,1057,545,157,diss_building2.mp4
6176,1057,552,157,diss_building2.mp4
6192,1057,556,157,diss_building2.mp4
6208,1057,559,157,diss_building2.mp4
6230,1057,563,157,diss_building2.mp4
6262,1057,572,158,diss_building2.mp4
6302,1057,581,159,diss_building2.mp4
6332,1057,593,160,diss_building2.mp4
6364,1057,609,162,diss_building2.mp4
6402,1057,621,164,diss_building2.mp4
6434,1057,628,165,diss_building2.mp4
6466,1057,634,166,diss_building2.mp4
6496,1057,639,166,diss_building2.mp4
6536,1057,646,166,diss_building2.mp4
6566,1057,651,166,diss_building2.mp4
6598,1057,656,166,diss_building2.mp4
6700,1057,688,167,diss_building2.mp4
6738,1057,699,169,diss_building2.mp4
6754,1057,701,170,diss_building2.mp4
6778,1057,705,171,diss_building2.mp4
6794,1057,708,171,diss_building2.mp4
6824,1057,712,172,diss_building2.mp4
6864,1057,714,173,diss_building2.mp4
6872,1057,714,174,diss_building2.mp4
6910,1057,715,175,diss_building2.mp4
7516,1057,716,175,diss_building2.mp4
7532,1057,717,175,diss_building2.mp4
7548,1057,719,175,diss_building2.mp4
7580,1057,723,178,diss_building2.mp4
7612,1057,727,179,diss_building2.mp4
7646,1057,729,180,diss_building2.mp4
7678,1057,732,180,diss_building2.mp4
7708,1057,736,181,diss_building2.mp4
7740,1057,738,181,diss_building2.mp4
7756,1057,739,181,diss_building2.mp4
7802,1057,741,181,diss_building2.mp4
7928,1057,772,200,diss_building2.mp4
7934,1057,773,200,diss_building2.mp4
8170,1057,773,201,diss_building2.mp4
8186,1057,773,202,diss_building2.mp4
8216,1057,772,214,diss_building2.mp4
8248,1057,767,234,diss_building2.mp4
8286,1057,757,260,diss_building2.mp4
8318,1057,752,266,diss_building2.mp4
8350,1057,747,272,diss_building2.mp4
8380,1057,741,278,diss_building2.mp4
8412,1057,735,283,diss_building2.mp4
8514,1057,719,297,diss_building2.mp4
8560,1057,710,306,diss_building2.mp4
8576,1057,705,309,diss_building2.mp4
8592,1057,700,312,diss_building2.mp4
8608,1057,695,315,diss_building2.mp4
8638,1057,687,321,diss_building2.mp4
8662,1057,681,324,diss_building2.mp4
8702,1057,675,330,diss_building2.mp4
8728,1057,674,331,diss_building2.mp4
8764,1057,670,334,diss_building2.mp4
8802,1057,664,339,diss_building2.mp4
8834,1057,658,344,diss_building2.mp4
8866,1057,652,350,diss_building2.mp4
8896,1057,647,355,diss_building2.mp4
8928,1057,641,360,diss_building2.mp4
8966,1057,634,367,diss_building2.mp4
8998,1057,628,373,diss_building2.mp4
9030,1057,623,377,diss_building2.mp4
9130,1057,604,394,diss_building2.mp4
9170,1057,599,397,diss_building2.mp4
9194,1057,597,399,diss_building2.mp4
9210,1057,594,401,diss_building2.mp4
9224,1057,591,404,diss_building2.mp4
9302,1057,577,418,diss_building2.mp4
9334,1057,571,424,diss_building2.mp4
9366,1057,566,430,diss_building2.mp4
9396,1057,560,435,diss_building2.mp4
9428,1057,553,441,diss_building2.mp4
9468,1057,546,448,diss_building2.mp4
9498,1057,541,454,diss_building2.mp4
9530,1057,535,460,diss_building2.mp4
9568,1057,528,467,diss_building2.mp4
9600,1057,522,472,diss_building2.mp4
9632,1057,517,477,diss_building2.mp4
9732,1057,502,492,diss_building2.mp4
9740,1057,502,493,diss_building2.mp4
9804,1057,497,498,diss_building2.mp4
9810,1057,497,499,diss_building2.mp4
9826,1057,496,500,diss_building2.mp4
9834,1057,496,501,diss_building2.mp4
9858,1057,496,502,diss_building2.mp4
9900,1057,495,502,diss_building2.mp4
10702,1057,496,502,diss_building2.mp4
10718,1057,497,502,diss_building2.mp4
10726,1057,498,504,diss_building2.mp4
10750,1057,505,509,diss_building2.mp4
10780,1057,512,515,diss_building2.mp4
10812,1057,518,522,diss_building2.mp4
10850,1057,526,529,diss_building2.mp4
10952,1057,575,526,diss_building2.mp4
10960,1057,580,524,diss_building2.mp4
11022,1057,629,505,diss_building2.mp4
11030,1057,635,502,diss_building2.mp4
11038,1057,641,499,diss_building2.mp4
11054,1057,652,494,diss_building2.mp4
11078,1057,668,489,diss_building2.mp4
11094,1057,680,483,diss_building2.mp4
11132,1057,696,474,diss_building2.mp4
11168,1057,715,464,diss_building2.mp4
11198,1057,733,452,diss_building2.mp4
11230,1057,755,430,diss_building2.mp4
11268,1057,775,403,diss_building2.mp4
11300,1057,786,381,diss_building2.mp4
11332,1057,792,361,diss_building2.mp4
11370,1057,798,334,diss_building2.mp4
11402,1057,800,320,diss_building2.mp4
11440,1057,801,312,diss_building2.mp4
11534,1057,801,289,diss_building2.mp4
11574,1057,802,275,diss_building2.mp4
11590,1057,802,271,diss_building2.mp4
11612,1057,802,266,diss_building2.mp4
11628,1057,802,263,diss_building2.mp4
11668,1057,800,255,diss_building2.mp4
11698,1057,798,247,diss_building2.mp4
11730,1057,794,241,diss_building2.mp4
11770,1057,792,236,diss_building2.mp4
11792,1057,790,234,diss_building2.mp4
11944,1057,789,234,diss_building2.mp4
12082,1057,788,234,diss_building2.mp4
12136,1057,785,234,diss_building2.mp4
12176,1057,783,234,diss_building2.mp4
12184,1057,782,234,diss_building2.mp4
12196,1057,781,234,diss_building2.mp4
12214,1057,780,234,diss_building2.mp4
12238,1057,778,234,diss_building2.mp4
12258,1057,777,234,diss_building2.mp4
12308,1057,774,234,diss_building2.mp4
12348,1057,770,233,diss_building2.mp4
12382,1057,767,233,diss_building2.mp4
12414,1057,763,233,diss_building2.mp4
12446,1057,758,232,diss_building2.mp4
12484,1057,750,232,diss_building2.mp4
12516,1057,745,232,diss_building2.mp4
12548,1057,738,231,diss_building2.mp4
12578,1057,732,231,diss_building2.mp4
12618,1057,724,231,diss_building2.mp4
12656,1057,716,230,diss_building2.mp4
12688,1057,713,230,diss_building2.mp4
12804,1057,713,232,diss_building2.mp4
12812,1057,713,233,diss_building2.mp4
12844,1057,713,236,diss_building2.mp4
12860,1057,713,238,diss_building2.mp4
12914,1057,717,263,diss_building2.mp4
12946,1057,719,272,diss_building2.mp4
12984,1057,720,278,diss_building2.mp4
13004,1057,720,279,diss_building2.mp4
13040,1057,720,281,diss_building2.mp4
13082,1057,720,284,diss_building2.mp4
13114,1057,720,288,diss_building2.mp4
13152,1057,720,292,diss_building2.mp4
13185,1057,721,298,diss_building2.mp4
13216,1057,723,307,diss_building2.mp4
13246,1057,726,316,diss_building2.mp4
13278,1057,728,321,diss_building2.mp4
13384,1057,728,330,diss_building2.mp4
13430,1057,728,338,diss_building2.mp4
13446,1057,728,339,diss_building2.mp4
13454,1057,728,340,diss_building2.mp4
13470,1057,728,343,diss_building2.mp4
13524,1057,728,348,diss_building2.mp4
13562,1057,728,351,diss_building2.mp4
13602,1057,727,355,diss_building2.mp4
13634,1057,727,359,diss_building2.mp4
13664,1057,726,363,diss_building2.mp4
13696,1057,726,366,diss_building2.mp4
13732,1057,726,369,diss_building2.mp4
13884,1057,726,370,diss_building2.mp4
13958,1057,725,374,diss_building2.mp4
14004,1057,724,380,diss_building2.mp4
14028,1057,724,384,diss_building2.mp4
14044,1057,724,385,diss_building2.mp4
14060,1057,724,387,diss_building2.mp4
14098,1057,724,392,diss_building2.mp4
14130,1057,724,398,diss_building2.mp4
14168,1057,724,404,diss_building2.mp4
14200,1057,724,409,diss_building2.mp4
14232,1057,724,414,diss_building2.mp4
14262,1057,726,419,diss_building2.mp4
14294,1057,727,421,diss_building2.mp4
14364,1057,728,421,diss_building2.mp4
14384,1057,730,421,diss_building2.mp4
14400,1057,731,420,diss_building2.mp4
14430,1057,740,414,diss_building2.mp4
14478,1057,767,396,diss_building2.mp4
14572,1057,813,354,diss_building2.mp4
14610,1057,827,334,diss_building2.mp4
14626,1057,832,327,diss_building2.mp4
14642,1057,838,321,diss_building2.mp4
14658,1057,841,318,diss_building2.mp4
14672,1057,846,313,diss_building2.mp4
14696,1057,854,308,diss_building2.mp4
14728,1057,860,302,diss_building2.mp4
14766,1057,867,296,diss_building2.mp4
14798,1057,873,290,diss_building2.mp4
14830,1057,879,284,diss_building2.mp4
14868,1057,886,277,diss_building2.mp4
14900,1057,892,272,diss_building2.mp4
14930,1057,897,266,diss_building2.mp4
14962,1057,903,261,diss_building2.mp4
15002,1057,908,256,diss_building2.mp4
15024,1057,910,254,diss_building2.mp4
15064,1057,912,251,diss_building2.mp4
15102,1057,913,249,diss_building2.mp4
15200,1057,919,242,diss_building2.mp4
15208,1057,921,241,diss_building2.mp4
15270,1057,932,232,diss_building2.mp4
15278,1057,933,232,diss_building2.mp4
15294,1057,936,229,diss_building2.mp4
15310,1057,938,228,diss_building2.mp4
15334,1057,942,225,diss_building2.mp4
15364,1057,946,223,diss_building2.mp4
15396,1057,950,221,diss_building2.mp4
15428,1057,955,219,diss_building2.mp4
15458,1057,958,219,diss_building2.mp4
15486,1057,960,218,diss_building2.mp4
15518,1057,961,217,diss_building2.mp4
15544,1057,962,217,diss_building2.mp4
15634,1057,963,217,diss_building2.mp4
15696,1057,964,217,diss_building2.mp4
15724,1057,965,217,diss_building2.mp4
15802,1057,981,214,diss_building2.mp4
15810,1057,984,214,diss_building2.mp4
15872,1057,995,208,diss_building2.mp4
15888,1057,997,207,diss_building2.mp4
15904,1057,1000,206,diss_building2.mp4
15928,1057,1003,204,diss_building2.mp4
16006,1057,1018,196,diss_building2.mp4
16030,1057,1022,193,diss_building2.mp4
16068,1057,1029,189,diss_building2.mp4
16100,1057,1034,186,diss_building2.mp4
16130,1057,1040,182,diss_building2.mp4
16212,1057,1046,179,diss_building2.mp4
16318,1057,1047,179,diss_building2.mp4
16354,1057,1052,176,diss_building2.mp4
16384,1057,1066,170,diss_building2.mp4
16392,1057,1070,169,diss_building2.mp4
16408,1057,1076,168,diss_building2.mp4
16424,1057,1082,165,diss_building2.mp4
16448,1057,1088,164,diss_building2.mp4
16486,1057,1094,163,diss_building2.mp4
16518,1057,1099,162,diss_building2.mp4
16548,1057,1105,161,diss_building2.mp4
16580,1057,1110,160,diss_building2.mp4
16612,1057,1115,159,diss_building2.mp4
16650,1057,1123,156,diss_building2.mp4
16698,1057,1131,152,diss_building2.mp4
16730,1057,1136,149,diss_building2.mp4
16768,1057,1143,145,diss_building2.mp4
16798,1057,1149,140,diss_building2.mp4
16830,1057,1154,136,diss_building2.mp4
16862,1057,1160,131,diss_building2.mp4
16900,1057,1167,125,diss_building2.mp4
17002,1057,1179,115,diss_building2.mp4
17026,1057,1180,115,diss_building2.mp4
17144,1057,1180,114,diss_building2.mp4
17292,1057,1180,113,diss_building2.mp4
17854,1057,1180,114,diss_building2.mp4
17890,1057,1179,115,diss_building2.mp4
17910,1057,1179,116,diss_building2.mp4
17948,1057,1177,119,diss_building2.mp4
17980,1057,1176,122,diss_building2.mp4
18014,1057,1175,124,diss_building2.mp4
18050,1057,1173,125,diss_building2.mp4
18066,1057,1173,126,diss_building2.mp4
-1,1057,-1,-1,diss_building2.mp4
-1,1060,-1,-1,diss_person22.mp4
-1,1062,-1,-1,diss_building2.mp4
-1,1059,-1,-1,diss_Soccer1.mp4
-1,1061,-1,-1,diss_truck2.mp4
