timestamp,stimuli_id,mouseX,mouseY,stimuli
0,1076,640,370,diss_car11.mp4
-1,1075,-1,-1,diss_building1.mp4
0,1075,642,368,diss_building1.mp4
3312,1075,639,368,diss_building1.mp4
3320,1075,619,369,diss_building1.mp4
3344,1075,511,384,diss_building1.mp4
3360,1075,472,391,diss_building1.mp4
3384,1075,449,394,diss_building1.mp4
3392,1075,447,395,diss_building1.mp4
3528,1075,449,392,diss_building1.mp4
3552,1075,454,390,diss_building1.mp4
3568,1075,455,388,diss_building1.mp4
3992,1075,455,389,diss_building1.mp4
4000,1075,455,392,diss_building1.mp4
4008,1075,455,394,diss_building1.mp4
4032,1075,455,404,diss_building1.mp4
4072,1075,463,418,diss_building1.mp4
4096,1075,464,422,diss_building1.mp4
4137,1075,471,435,diss_building1.mp4
4168,1075,473,450,diss_building1.mp4
4200,1075,473,463,diss_building1.mp4
4208,1075,473,467,diss_building1.mp4
4240,1075,462,482,diss_building1.mp4
4272,1075,439,493,diss_building1.mp4
4305,1075,398,499,diss_building1.mp4
4345,1075,366,504,diss_building1.mp4
4376,1075,360,506,diss_building1.mp4
4408,1075,354,508,diss_building1.mp4
4440,1075,336,514,diss_building1.mp4
4465,1075,322,517,diss_building1.mp4
4488,1075,308,520,diss_building1.mp4
4520,1075,288,524,diss_building1.mp4
4552,1075,279,525,diss_building1.mp4
4592,1075,268,528,diss_building1.mp4
4616,1075,261,530,diss_building1.mp4
4656,1075,248,533,diss_building1.mp4
4688,1075,243,535,diss_building1.mp4
4728,1075,237,537,diss_building1.mp4
4744,1075,233,539,diss_building1.mp4
4768,1075,226,543,diss_building1.mp4
4784,1075,221,545,diss_building1.mp4
4793,1075,220,545,diss_building1.mp4
4944,1075,219,546,diss_building1.mp4
4977,1075,212,546,diss_building1.mp4
4992,1075,210,546,diss_building1.mp4
5008,1075,208,547,diss_building1.mp4
5024,1075,207,547,diss_building1.mp4
5376,1075,209,547,diss_building1.mp4
5400,1075,217,546,diss_building1.mp4
5440,1075,232,544,diss_building1.mp4
5472,1075,243,542,diss_building1.mp4
5504,1075,252,542,diss_building1.mp4
5520,1075,255,542,diss_building1.mp4
5624,1075,257,542,diss_building1.mp4
5632,1075,259,542,diss_building1.mp4
5648,1075,264,543,diss_building1.mp4
5664,1075,267,546,diss_building1.mp4
5681,1075,270,548,diss_building1.mp4
5704,1075,278,550,diss_building1.mp4
5728,1075,282,550,diss_building1.mp4
5752,1075,284,550,diss_building1.mp4
5784,1075,287,550,diss_building1.mp4
5816,1075,288,549,diss_building1.mp4
6232,1075,289,549,diss_building1.mp4
6240,1075,293,549,diss_building1.mp4
6248,1075,298,551,diss_building1.mp4
6297,1075,316,561,diss_building1.mp4
6304,1075,317,561,diss_building1.mp4
6328,1075,318,563,diss_building1.mp4
6425,1075,324,565,diss_building1.mp4
6456,1075,338,571,diss_building1.mp4
6488,1075,354,578,diss_building1.mp4
6496,1075,358,578,diss_building1.mp4
6520,1075,371,581,diss_building1.mp4
6560,1075,401,590,diss_building1.mp4
6584,1075,419,592,diss_building1.mp4
6616,1075,444,596,diss_building1.mp4
6656,1075,459,596,diss_building1.mp4
6696,1075,467,596,diss_building1.mp4
6753,1075,473,596,diss_building1.mp4
6784,1075,475,596,diss_building1.mp4
6824,1075,480,596,diss_building1.mp4
6864,1075,491,597,diss_building1.mp4
6888,1075,503,599,diss_building1.mp4
6896,1075,508,600,diss_building1.mp4
6936,1075,528,601,diss_building1.mp4
6969,1075,546,601,diss_building1.mp4
6992,1075,566,601,diss_building1.mp4
7008,1075,582,601,diss_building1.mp4
7040,1075,600,601,diss_building1.mp4
7072,1075,612,604,diss_building1.mp4
7104,1075,625,605,diss_building1.mp4
7144,1075,643,609,diss_building1.mp4
7168,1075,652,610,diss_building1.mp4
7208,1075,671,613,diss_building1.mp4
7240,1075,696,613,diss_building1.mp4
7272,1075,730,613,diss_building1.mp4
7313,1075,772,611,diss_building1.mp4
7344,1075,792,610,diss_building1.mp4
7368,1075,805,610,diss_building1.mp4
7376,1075,809,610,diss_building1.mp4
7416,1075,830,610,diss_building1.mp4
7456,1075,842,610,diss_building1.mp4
7488,1075,857,612,diss_building1.mp4
7520,1075,871,614,diss_building1.mp4
7552,1075,888,616,diss_building1.mp4
7592,1075,912,616,diss_building1.mp4
7616,1075,929,614,diss_building1.mp4
7656,1075,957,612,diss_building1.mp4
7688,1075,975,612,diss_building1.mp4
7720,1075,989,612,diss_building1.mp4
7744,1075,997,612,diss_building1.mp4
7776,1075,1000,612,diss_building1.mp4
7864,1075,1001,613,diss_building1.mp4
7888,1075,1009,619,diss_building1.mp4
7897,1075,1011,620,diss_building1.mp4
7920,1075,1014,622,diss_building1.mp4
7953,1075,1016,622,diss_building1.mp4
8056,1075,1011,621,diss_building1.mp4
8088,1075,971,611,diss_building1.mp4
8120,1075,950,610,diss_building1.mp4
8129,1075,949,610,diss_building1.mp4
8152,1075,941,610,diss_building1.mp4
8184,1075,932,611,diss_building1.mp4
8224,1075,918,618,diss_building1.mp4
8256,1075,912,620,diss_building1.mp4
8272,1075,910,621,diss_building1.mp4
8313,1075,901,623,diss_building1.mp4
8344,1075,875,626,diss_building1.mp4
8368,1075,868,626,diss_building1.mp4
8384,1075,867,627,diss_building1.mp4
8472,1075,864,627,diss_building1.mp4
8504,1075,859,627,diss_building1.mp4
8528,1075,858,627,diss_building1.mp4
8632,1075,857,627,diss_building1.mp4
8648,1075,854,627,diss_building1.mp4
8664,1075,848,627,diss_building1.mp4
8704,1075,838,625,diss_building1.mp4
8824,1075,837,625,diss_building1.mp4
8832,1075,835,625,diss_building1.mp4
8872,1075,823,623,diss_building1.mp4
8896,1075,812,622,diss_building1.mp4
8936,1075,807,621,diss_building1.mp4
9176,1075,812,621,diss_building1.mp4
9192,1075,828,621,diss_building1.mp4
9208,1075,847,621,diss_building1.mp4
9224,1075,872,621,diss_building1.mp4
9256,1075,927,615,diss_building1.mp4
9288,1075,970,597,diss_building1.mp4
9320,1075,1002,552,diss_building1.mp4
9353,1075,1013,494,diss_building1.mp4
9385,1075,1015,438,diss_building1.mp4
9416,1075,1015,400,diss_building1.mp4
9448,1075,1009,365,diss_building1.mp4
0,1077,623,362,diss_Girl1.mp4
8,1077,621,359,diss_Girl1.mp4
32,1077,613,350,diss_Girl1.mp4
49,1077,602,342,diss_Girl1.mp4
72,1077,577,327,diss_Girl1.mp4
88,1077,564,321,diss_Girl1.mp4
112,1077,549,314,diss_Girl1.mp4
128,1077,547,312,diss_Girl1.mp4
232,1077,548,312,diss_Girl1.mp4
249,1077,564,312,diss_Girl1.mp4
272,1077,588,314,diss_Girl1.mp4
305,1077,627,325,diss_Girl1.mp4
328,1077,662,335,diss_Girl1.mp4
376,1077,712,342,diss_Girl1.mp4
384,1077,714,342,diss_Girl1.mp4
392,1077,717,341,diss_Girl1.mp4
424,1077,719,331,diss_Girl1.mp4
457,1077,696,309,diss_Girl1.mp4
489,1077,647,286,diss_Girl1.mp4
520,1077,593,267,diss_Girl1.mp4
536,1077,587,266,diss_Girl1.mp4
616,1077,593,266,diss_Girl1.mp4
632,1077,601,268,diss_Girl1.mp4
657,1077,613,273,diss_Girl1.mp4
688,1077,647,283,diss_Girl1.mp4
712,1077,674,289,diss_Girl1.mp4
744,1077,701,293,diss_Girl1.mp4
768,1077,715,293,diss_Girl1.mp4
784,1077,720,293,diss_Girl1.mp4
896,1077,721,293,diss_Girl1.mp4
904,1077,722,293,diss_Girl1.mp4
928,1077,736,293,diss_Girl1.mp4
976,1077,777,292,diss_Girl1.mp4
1000,1077,790,289,diss_Girl1.mp4
1016,1077,795,286,diss_Girl1.mp4
1056,1077,788,270,diss_Girl1.mp4
1064,1077,782,264,diss_Girl1.mp4
1080,1077,760,249,diss_Girl1.mp4
1097,1077,723,228,diss_Girl1.mp4
1144,1077,643,198,diss_Girl1.mp4
1176,1077,608,194,diss_Girl1.mp4
1209,1077,597,194,diss_Girl1.mp4
1240,1077,577,195,diss_Girl1.mp4
1272,1077,559,197,diss_Girl1.mp4
1280,1077,558,197,diss_Girl1.mp4
1368,1077,559,197,diss_Girl1.mp4
1400,1077,588,197,diss_Girl1.mp4
1440,1077,640,192,diss_Girl1.mp4
1449,1077,651,190,diss_Girl1.mp4
1473,1077,667,187,diss_Girl1.mp4
1497,1077,678,183,diss_Girl1.mp4
1544,1077,683,178,diss_Girl1.mp4
1552,1077,684,178,diss_Girl1.mp4
1592,1077,695,178,diss_Girl1.mp4
1616,1077,712,178,diss_Girl1.mp4
1656,1077,745,183,diss_Girl1.mp4
1696,1077,778,189,diss_Girl1.mp4
1720,1077,787,190,diss_Girl1.mp4
1792,1077,787,189,diss_Girl1.mp4
1840,1077,787,188,diss_Girl1.mp4
2000,1077,788,188,diss_Girl1.mp4
2032,1077,797,190,diss_Girl1.mp4
2048,1077,799,190,diss_Girl1.mp4
2208,1077,800,190,diss_Girl1.mp4
2328,1077,801,193,diss_Girl1.mp4
2344,1077,801,199,diss_Girl1.mp4
2360,1077,807,210,diss_Girl1.mp4
2368,1077,810,214,diss_Girl1.mp4
2400,1077,836,242,diss_Girl1.mp4
2432,1077,867,261,diss_Girl1.mp4
2472,1077,906,277,diss_Girl1.mp4
2497,1077,916,281,diss_Girl1.mp4
2536,1077,933,289,diss_Girl1.mp4
2545,1077,936,290,diss_Girl1.mp4
2568,1077,940,292,diss_Girl1.mp4
2632,1077,946,298,diss_Girl1.mp4
2672,1077,970,312,diss_Girl1.mp4
2704,1077,987,317,diss_Girl1.mp4
2736,1077,1007,319,diss_Girl1.mp4
2744,1077,1012,319,diss_Girl1.mp4
2768,1077,1021,319,diss_Girl1.mp4
2800,1077,1027,319,diss_Girl1.mp4
2840,1077,1033,318,diss_Girl1.mp4
2872,1077,1034,312,diss_Girl1.mp4
2896,1077,1014,291,diss_Girl1.mp4
2913,1077,939,260,diss_Girl1.mp4
2960,1077,515,139,diss_Girl1.mp4
2984,1077,364,111,diss_Girl1.mp4
3016,1077,271,111,diss_Girl1.mp4
3056,1077,186,111,diss_Girl1.mp4
3096,1077,158,112,diss_Girl1.mp4
3112,1077,156,112,diss_Girl1.mp4
3160,1077,138,116,diss_Girl1.mp4
3168,1077,130,116,diss_Girl1.mp4
3184,1077,116,116,diss_Girl1.mp4
3216,1077,106,117,diss_Girl1.mp4
3281,1077,98,117,diss_Girl1.mp4
3312,1077,71,121,diss_Girl1.mp4
3328,1077,62,126,diss_Girl1.mp4
3376,1077,59,132,diss_Girl1.mp4
3400,1077,59,140,diss_Girl1.mp4
3416,1077,61,152,diss_Girl1.mp4
3456,1077,80,180,diss_Girl1.mp4
3480,1077,87,186,diss_Girl1.mp4
3496,1077,88,186,diss_Girl1.mp4
3680,1077,88,194,diss_Girl1.mp4
3696,1077,88,200,diss_Girl1.mp4
3713,1077,93,206,diss_Girl1.mp4
3728,1077,97,212,diss_Girl1.mp4
3744,1077,100,214,diss_Girl1.mp4
3753,1077,102,215,diss_Girl1.mp4
3776,1077,104,215,diss_Girl1.mp4
3944,1077,106,215,diss_Girl1.mp4
3960,1077,110,215,diss_Girl1.mp4
3985,1077,122,215,diss_Girl1.mp4
4024,1077,165,216,diss_Girl1.mp4
4048,1077,179,216,diss_Girl1.mp4
4064,1077,182,216,diss_Girl1.mp4
4400,1077,180,215,diss_Girl1.mp4
4408,1077,174,214,diss_Girl1.mp4
4424,1077,164,211,diss_Girl1.mp4
4440,1077,157,211,diss_Girl1.mp4
4464,1077,148,210,diss_Girl1.mp4
4504,1077,145,210,diss_Girl1.mp4
4536,1077,139,209,diss_Girl1.mp4
4568,1077,134,207,diss_Girl1.mp4
4616,1077,133,206,diss_Girl1.mp4
4640,1077,129,201,diss_Girl1.mp4
4648,1077,129,199,diss_Girl1.mp4
4664,1077,125,193,diss_Girl1.mp4
4688,1077,122,189,diss_Girl1.mp4
4704,1077,122,187,diss_Girl1.mp4
4728,1077,121,184,diss_Girl1.mp4
4768,1077,117,178,diss_Girl1.mp4
4800,1077,110,171,diss_Girl1.mp4
4833,1077,102,167,diss_Girl1.mp4
4841,1077,102,166,diss_Girl1.mp4
5008,1077,101,166,diss_Girl1.mp4
5024,1077,101,165,diss_Girl1.mp4
5040,1077,101,162,diss_Girl1.mp4
5056,1077,101,159,diss_Girl1.mp4
5072,1077,101,156,diss_Girl1.mp4
5096,1077,101,152,diss_Girl1.mp4
5128,1077,103,145,diss_Girl1.mp4
5168,1077,105,143,diss_Girl1.mp4
5288,1077,105,142,diss_Girl1.mp4
5304,1077,110,141,diss_Girl1.mp4
5312,1077,115,141,diss_Girl1.mp4
5329,1077,123,141,diss_Girl1.mp4
5360,1077,143,141,diss_Girl1.mp4
5384,1077,153,141,diss_Girl1.mp4
5400,1077,159,141,diss_Girl1.mp4
5440,1077,194,145,diss_Girl1.mp4
5464,1077,216,146,diss_Girl1.mp4
5504,1077,234,146,diss_Girl1.mp4
5537,1077,239,146,diss_Girl1.mp4
5568,1077,244,146,diss_Girl1.mp4
5592,1077,248,144,diss_Girl1.mp4
5624,1077,251,143,diss_Girl1.mp4
5704,1077,253,142,diss_Girl1.mp4
5713,1077,254,141,diss_Girl1.mp4
5736,1077,261,141,diss_Girl1.mp4
5769,1077,269,140,diss_Girl1.mp4
5809,1077,283,140,diss_Girl1.mp4
5832,1077,293,140,diss_Girl1.mp4
5864,1077,313,140,diss_Girl1.mp4
5904,1077,329,140,diss_Girl1.mp4
5936,1077,337,140,diss_Girl1.mp4
5962,1077,341,140,diss_Girl1.mp4
5984,1077,344,140,diss_Girl1.mp4
6025,1077,346,140,diss_Girl1.mp4
6048,1077,348,140,diss_Girl1.mp4
6088,1077,358,140,diss_Girl1.mp4
6120,1077,364,140,diss_Girl1.mp4
6152,1077,377,140,diss_Girl1.mp4
6184,1077,387,140,diss_Girl1.mp4
6208,1077,393,140,diss_Girl1.mp4
6240,1077,396,140,diss_Girl1.mp4
6281,1077,399,140,diss_Girl1.mp4
6312,1077,402,140,diss_Girl1.mp4
6352,1077,406,140,diss_Girl1.mp4
6385,1077,411,138,diss_Girl1.mp4
6416,1077,419,138,diss_Girl1.mp4
6448,1077,426,137,diss_Girl1.mp4
6488,1077,435,136,diss_Girl1.mp4
6520,1077,443,135,diss_Girl1.mp4
6552,1077,451,133,diss_Girl1.mp4
6576,1077,454,133,diss_Girl1.mp4
6592,1077,455,133,diss_Girl1.mp4
6616,1077,458,133,diss_Girl1.mp4
6648,1077,466,133,diss_Girl1.mp4
6688,1077,479,133,diss_Girl1.mp4
6720,1077,487,133,diss_Girl1.mp4
6752,1077,502,134,diss_Girl1.mp4
6776,1077,516,135,diss_Girl1.mp4
6800,1077,536,135,diss_Girl1.mp4
6840,1077,574,135,diss_Girl1.mp4
6856,1077,585,135,diss_Girl1.mp4
6888,1077,604,135,diss_Girl1.mp4
6920,1077,613,135,diss_Girl1.mp4
6953,1077,621,135,diss_Girl1.mp4
6984,1077,629,135,diss_Girl1.mp4
7016,1077,638,135,diss_Girl1.mp4
7056,1077,651,137,diss_Girl1.mp4
7088,1077,666,141,diss_Girl1.mp4
7112,1077,681,145,diss_Girl1.mp4
7152,1077,702,150,diss_Girl1.mp4
7184,1077,712,152,diss_Girl1.mp4
7216,1077,717,152,diss_Girl1.mp4
7312,1077,719,152,diss_Girl1.mp4
7320,1077,721,152,diss_Girl1.mp4
7360,1077,736,152,diss_Girl1.mp4
7376,1077,741,152,diss_Girl1.mp4
7392,1077,749,152,diss_Girl1.mp4
7408,1077,755,152,diss_Girl1.mp4
7440,1077,772,156,diss_Girl1.mp4
7472,1077,793,158,diss_Girl1.mp4
7496,1077,809,161,diss_Girl1.mp4
7520,1077,822,164,diss_Girl1.mp4
7545,1077,838,169,diss_Girl1.mp4
7576,1077,852,173,diss_Girl1.mp4
7616,1077,874,182,diss_Girl1.mp4
7648,1077,890,187,diss_Girl1.mp4
7672,1077,897,188,diss_Girl1.mp4
7697,1077,901,190,diss_Girl1.mp4
7704,1077,904,190,diss_Girl1.mp4
7728,1077,915,194,diss_Girl1.mp4
7744,1077,919,194,diss_Girl1.mp4
7760,1077,924,195,diss_Girl1.mp4
7800,1077,938,197,diss_Girl1.mp4
7833,1077,947,197,diss_Girl1.mp4
7856,1077,952,197,diss_Girl1.mp4
7880,1077,957,198,diss_Girl1.mp4
7888,1077,958,199,diss_Girl1.mp4
7920,1077,965,203,diss_Girl1.mp4
7929,1077,967,205,diss_Girl1.mp4
7944,1077,972,210,diss_Girl1.mp4
7960,1077,978,218,diss_Girl1.mp4
8000,1077,994,254,diss_Girl1.mp4
8040,1077,1003,302,diss_Girl1.mp4
8049,1077,1003,309,diss_Girl1.mp4
8064,1077,1008,324,diss_Girl1.mp4
8080,1077,1012,337,diss_Girl1.mp4
8089,1077,1015,344,diss_Girl1.mp4
8112,1077,1022,357,diss_Girl1.mp4
8128,1077,1030,365,diss_Girl1.mp4
8152,1077,1051,379,diss_Girl1.mp4
8184,1077,1083,392,diss_Girl1.mp4
8216,1077,1115,398,diss_Girl1.mp4
8248,1077,1138,400,diss_Girl1.mp4
8265,1077,1141,400,diss_Girl1.mp4
8704,1077,1140,398,diss_Girl1.mp4
8712,1077,1136,397,diss_Girl1.mp4
8729,1077,1124,393,diss_Girl1.mp4
8745,1077,1108,392,diss_Girl1.mp4
8768,1077,1081,390,diss_Girl1.mp4
8808,1077,969,394,diss_Girl1.mp4
8848,1077,783,420,diss_Girl1.mp4
0,1078,634,360,diss_ManRunning1.mp4
16,1078,615,361,diss_ManRunning1.mp4
32,1078,590,373,diss_ManRunning1.mp4
48,1078,564,392,diss_ManRunning1.mp4
73,1078,526,419,diss_ManRunning1.mp4
112,1078,491,449,diss_ManRunning1.mp4
120,1078,487,453,diss_ManRunning1.mp4
144,1078,475,462,diss_ManRunning1.mp4
184,1078,467,469,diss_ManRunning1.mp4
200,1078,465,470,diss_ManRunning1.mp4
408,1078,464,470,diss_ManRunning1.mp4
424,1078,457,470,diss_ManRunning1.mp4
432,1078,454,470,diss_ManRunning1.mp4
456,1078,445,470,diss_ManRunning1.mp4
488,1078,436,469,diss_ManRunning1.mp4
552,1078,436,467,diss_ManRunning1.mp4
576,1078,436,463,diss_ManRunning1.mp4
585,1078,436,461,diss_ManRunning1.mp4
592,1078,436,458,diss_ManRunning1.mp4
616,1078,442,446,diss_ManRunning1.mp4
640,1078,455,431,diss_ManRunning1.mp4
672,1078,471,412,diss_ManRunning1.mp4
712,1078,478,403,diss_ManRunning1.mp4
744,1078,480,395,diss_ManRunning1.mp4
769,1078,481,390,diss_ManRunning1.mp4
833,1078,483,378,diss_ManRunning1.mp4
888,1078,483,362,diss_ManRunning1.mp4
905,1078,482,357,diss_ManRunning1.mp4
953,1078,461,335,diss_ManRunning1.mp4
976,1078,444,322,diss_ManRunning1.mp4
1000,1078,424,309,diss_ManRunning1.mp4
1024,1078,403,302,diss_ManRunning1.mp4
1032,1078,396,300,diss_ManRunning1.mp4
1064,1078,365,294,diss_ManRunning1.mp4
1080,1078,345,292,diss_ManRunning1.mp4
1104,1078,314,289,diss_ManRunning1.mp4
1144,1078,264,289,diss_ManRunning1.mp4
1192,1078,218,289,diss_ManRunning1.mp4
1216,1078,203,289,diss_ManRunning1.mp4
1232,1078,192,289,diss_ManRunning1.mp4
1272,1078,168,289,diss_ManRunning1.mp4
1288,1078,164,289,diss_ManRunning1.mp4
1377,1078,163,289,diss_ManRunning1.mp4
1385,1078,161,288,diss_ManRunning1.mp4
1408,1078,152,287,diss_ManRunning1.mp4
1432,1078,139,284,diss_ManRunning1.mp4
1472,1078,116,280,diss_ManRunning1.mp4
1504,1078,109,280,diss_ManRunning1.mp4
1544,1078,104,280,diss_ManRunning1.mp4
1673,1078,103,276,diss_ManRunning1.mp4
1680,1078,106,274,diss_ManRunning1.mp4
1712,1078,141,264,diss_ManRunning1.mp4
1728,1078,171,257,diss_ManRunning1.mp4
1776,1078,329,227,diss_ManRunning1.mp4
1808,1078,447,199,diss_ManRunning1.mp4
1816,1078,466,198,diss_ManRunning1.mp4
1840,1078,523,190,diss_ManRunning1.mp4
1872,1078,581,180,diss_ManRunning1.mp4
1904,1078,616,173,diss_ManRunning1.mp4
1944,1078,629,170,diss_ManRunning1.mp4
1952,1078,630,169,diss_ManRunning1.mp4
2152,1078,630,170,diss_ManRunning1.mp4
2177,1078,629,181,diss_ManRunning1.mp4
2208,1078,607,215,diss_ManRunning1.mp4
2224,1078,587,241,diss_ManRunning1.mp4
2248,1078,519,299,diss_ManRunning1.mp4
2297,1078,429,376,diss_ManRunning1.mp4
2304,1078,419,385,diss_ManRunning1.mp4
2320,1078,400,402,diss_ManRunning1.mp4
2328,1078,390,410,diss_ManRunning1.mp4
2344,1078,377,425,diss_ManRunning1.mp4
2352,1078,372,431,diss_ManRunning1.mp4
2392,1078,352,454,diss_ManRunning1.mp4
2424,1078,341,462,diss_ManRunning1.mp4
2457,1078,332,467,diss_ManRunning1.mp4
2480,1078,328,470,diss_ManRunning1.mp4
2560,1078,316,474,diss_ManRunning1.mp4
2592,1078,297,482,diss_ManRunning1.mp4
2624,1078,287,487,diss_ManRunning1.mp4
2808,1078,298,482,diss_ManRunning1.mp4
2848,1078,409,398,diss_ManRunning1.mp4
2864,1078,473,349,diss_ManRunning1.mp4
2896,1078,599,245,diss_ManRunning1.mp4
2905,1078,624,223,diss_ManRunning1.mp4
2921,1078,670,184,diss_ManRunning1.mp4
2944,1078,731,131,diss_ManRunning1.mp4
2985,1078,752,105,diss_ManRunning1.mp4
3009,1078,753,99,diss_ManRunning1.mp4
3264,1078,753,98,diss_ManRunning1.mp4
3280,1078,744,93,diss_ManRunning1.mp4
3296,1078,728,86,diss_ManRunning1.mp4
3312,1078,694,75,diss_ManRunning1.mp4
3328,1078,664,72,diss_ManRunning1.mp4
3360,1078,633,70,diss_ManRunning1.mp4
3392,1078,622,78,diss_ManRunning1.mp4
3400,1078,620,82,diss_ManRunning1.mp4
3417,1078,612,95,diss_ManRunning1.mp4
3448,1078,602,114,diss_ManRunning1.mp4
3472,1078,600,123,diss_ManRunning1.mp4
3496,1078,600,128,diss_ManRunning1.mp4
3512,1078,600,129,diss_ManRunning1.mp4
3640,1078,599,130,diss_ManRunning1.mp4
3657,1078,598,131,diss_ManRunning1.mp4
3672,1078,596,132,diss_ManRunning1.mp4
3696,1078,592,137,diss_ManRunning1.mp4
3728,1078,587,143,diss_ManRunning1.mp4
3760,1078,582,156,diss_ManRunning1.mp4
3784,1078,577,168,diss_ManRunning1.mp4
3800,1078,576,171,diss_ManRunning1.mp4
4096,1078,577,171,diss_ManRunning1.mp4
4112,1078,578,171,diss_ManRunning1.mp4
4137,1078,579,171,diss_ManRunning1.mp4
4168,1078,581,171,diss_ManRunning1.mp4
4216,1078,584,170,diss_ManRunning1.mp4
4257,1078,588,169,diss_ManRunning1.mp4
4288,1078,591,168,diss_ManRunning1.mp4
4328,1078,598,166,diss_ManRunning1.mp4
4352,1078,603,164,diss_ManRunning1.mp4
4392,1078,611,152,diss_ManRunning1.mp4
4401,1078,613,149,diss_ManRunning1.mp4
4424,1078,619,134,diss_ManRunning1.mp4
4456,1078,627,117,diss_ManRunning1.mp4
4488,1078,635,103,diss_ManRunning1.mp4
4528,1078,647,90,diss_ManRunning1.mp4
4544,1078,651,87,diss_ManRunning1.mp4
4576,1078,661,84,diss_ManRunning1.mp4
4600,1078,664,82,diss_ManRunning1.mp4
4776,1078,663,82,diss_ManRunning1.mp4
4880,1078,660,82,diss_ManRunning1.mp4
4896,1078,652,82,diss_ManRunning1.mp4
4928,1078,622,81,diss_ManRunning1.mp4
4952,1078,599,79,diss_ManRunning1.mp4
4992,1078,581,78,diss_ManRunning1.mp4
5096,1078,580,78,diss_ManRunning1.mp4
5112,1078,577,78,diss_ManRunning1.mp4
5120,1078,576,78,diss_ManRunning1.mp4
5128,1078,573,78,diss_ManRunning1.mp4
5176,1078,557,82,diss_ManRunning1.mp4
5208,1078,549,83,diss_ManRunning1.mp4
5240,1078,540,84,diss_ManRunning1.mp4
5272,1078,535,85,diss_ManRunning1.mp4
5304,1078,529,85,diss_ManRunning1.mp4
5320,1078,527,85,diss_ManRunning1.mp4
5360,1078,519,85,diss_ManRunning1.mp4
5384,1078,512,85,diss_ManRunning1.mp4
5424,1078,495,85,diss_ManRunning1.mp4
5456,1078,487,86,diss_ManRunning1.mp4
5464,1078,485,86,diss_ManRunning1.mp4
5488,1078,482,87,diss_ManRunning1.mp4
5601,1078,474,87,diss_ManRunning1.mp4
5616,1078,467,89,diss_ManRunning1.mp4
5640,1078,457,90,diss_ManRunning1.mp4
5680,1078,448,91,diss_ManRunning1.mp4
5696,1078,445,91,diss_ManRunning1.mp4
5720,1078,443,91,diss_ManRunning1.mp4
5760,1078,429,94,diss_ManRunning1.mp4
5768,1078,427,94,diss_ManRunning1.mp4
5784,1078,420,95,diss_ManRunning1.mp4
5808,1078,408,97,diss_ManRunning1.mp4
5841,1078,390,103,diss_ManRunning1.mp4
5872,1078,365,117,diss_ManRunning1.mp4
5904,1078,336,149,diss_ManRunning1.mp4
5944,1078,318,200,diss_ManRunning1.mp4
5968,1078,312,228,diss_ManRunning1.mp4
6008,1078,309,258,diss_ManRunning1.mp4
6040,1078,315,283,diss_ManRunning1.mp4
6080,1078,320,299,diss_ManRunning1.mp4
6105,1078,323,305,diss_ManRunning1.mp4
6128,1078,323,308,diss_ManRunning1.mp4
6160,1078,323,312,diss_ManRunning1.mp4
6184,1078,323,319,diss_ManRunning1.mp4
6200,1078,323,327,diss_ManRunning1.mp4
6218,1078,323,337,diss_ManRunning1.mp4
6232,1078,323,349,diss_ManRunning1.mp4
6248,1078,323,362,diss_ManRunning1.mp4
6272,1078,323,394,diss_ManRunning1.mp4
6304,1078,323,426,diss_ManRunning1.mp4
6344,1078,326,439,diss_ManRunning1.mp4
6360,1078,326,441,diss_ManRunning1.mp4
6440,1078,332,441,diss_ManRunning1.mp4
6448,1078,333,441,diss_ManRunning1.mp4
6472,1078,341,441,diss_ManRunning1.mp4
6512,1078,361,438,diss_ManRunning1.mp4
6544,1078,372,434,diss_ManRunning1.mp4
6576,1078,377,429,diss_ManRunning1.mp4
6608,1078,379,428,diss_ManRunning1.mp4
6624,1078,380,427,diss_ManRunning1.mp4
6736,1078,382,430,diss_ManRunning1.mp4
6784,1078,384,447,diss_ManRunning1.mp4
6808,1078,386,452,diss_ManRunning1.mp4
6944,1078,386,453,diss_ManRunning1.mp4
6969,1078,389,453,diss_ManRunning1.mp4
6985,1078,390,453,diss_ManRunning1.mp4
7024,1078,394,453,diss_ManRunning1.mp4
7048,1078,404,453,diss_ManRunning1.mp4
7088,1078,430,455,diss_ManRunning1.mp4
7129,1078,453,455,diss_ManRunning1.mp4
7136,1078,455,455,diss_ManRunning1.mp4
7248,1078,456,455,diss_ManRunning1.mp4
7264,1078,459,454,diss_ManRunning1.mp4
7281,1078,464,452,diss_ManRunning1.mp4
7304,1078,468,451,diss_ManRunning1.mp4
7320,1078,472,450,diss_ManRunning1.mp4
7328,1078,476,450,diss_ManRunning1.mp4
7360,1078,490,447,diss_ManRunning1.mp4
7392,1078,509,447,diss_ManRunning1.mp4
7400,1078,516,446,diss_ManRunning1.mp4
7409,1078,522,446,diss_ManRunning1.mp4
7432,1078,538,446,diss_ManRunning1.mp4
7448,1078,547,446,diss_ManRunning1.mp4
7489,1078,566,446,diss_ManRunning1.mp4
7520,1078,584,446,diss_ManRunning1.mp4
7552,1078,616,443,diss_ManRunning1.mp4
7570,1078,629,440,diss_ManRunning1.mp4
7584,1078,632,437,diss_ManRunning1.mp4
7664,1078,643,434,diss_ManRunning1.mp4
7672,1078,650,433,diss_ManRunning1.mp4
7696,1078,675,424,diss_ManRunning1.mp4
7720,1078,702,417,diss_ManRunning1.mp4
7736,1078,710,416,diss_ManRunning1.mp4
7768,1078,717,414,diss_ManRunning1.mp4
7800,1078,736,414,diss_ManRunning1.mp4
7816,1078,747,414,diss_ManRunning1.mp4
7832,1078,766,414,diss_ManRunning1.mp4
7849,1078,804,414,diss_ManRunning1.mp4
7864,1078,833,413,diss_ManRunning1.mp4
7880,1078,857,406,diss_ManRunning1.mp4
7904,1078,883,397,diss_ManRunning1.mp4
7920,1078,893,392,diss_ManRunning1.mp4
7930,1078,898,391,diss_ManRunning1.mp4
7961,1078,901,388,diss_ManRunning1.mp4
7984,1078,907,386,diss_ManRunning1.mp4
8000,1078,915,385,diss_ManRunning1.mp4
8016,1078,926,383,diss_ManRunning1.mp4
8032,1078,937,381,diss_ManRunning1.mp4
8049,1078,946,380,diss_ManRunning1.mp4
8064,1078,954,380,diss_ManRunning1.mp4
8104,1078,973,380,diss_ManRunning1.mp4
8136,1078,985,380,diss_ManRunning1.mp4
8144,1078,988,380,diss_ManRunning1.mp4
8177,1078,1001,382,diss_ManRunning1.mp4
8184,1078,1003,382,diss_ManRunning1.mp4
8200,1078,1011,383,diss_ManRunning1.mp4
8216,1078,1013,383,diss_ManRunning1.mp4
8280,1078,1012,383,diss_ManRunning1.mp4
8288,1078,1010,381,diss_ManRunning1.mp4
8296,1078,1009,381,diss_ManRunning1.mp4
8352,1078,1003,381,diss_ManRunning1.mp4
8386,1078,999,381,diss_ManRunning1.mp4
8400,1078,998,381,diss_ManRunning1.mp4
8696,1078,998,382,diss_ManRunning1.mp4
8705,1078,998,384,diss_ManRunning1.mp4
8728,1078,1005,393,diss_ManRunning1.mp4
8744,1078,1011,396,diss_ManRunning1.mp4
8760,1078,1018,399,diss_ManRunning1.mp4
8784,1078,1033,407,diss_ManRunning1.mp4
8792,1078,1038,408,diss_ManRunning1.mp4
8816,1078,1052,410,diss_ManRunning1.mp4
8824,1078,1056,411,diss_ManRunning1.mp4
8849,1078,1062,412,diss_ManRunning1.mp4
8864,1078,1065,412,diss_ManRunning1.mp4
8904,1078,1074,412,diss_ManRunning1.mp4
8920,1078,1080,412,diss_ManRunning1.mp4
8944,1078,1087,414,diss_ManRunning1.mp4
8968,1078,1088,414,diss_ManRunning1.mp4
8992,1078,1090,414,diss_ManRunning1.mp4
9032,1078,1096,414,diss_ManRunning1.mp4
9041,1078,1098,414,diss_ManRunning1.mp4
9080,1078,1103,415,diss_ManRunning1.mp4
9337,1078,1104,415,diss_ManRunning1.mp4
9345,1078,1107,415,diss_ManRunning1.mp4
9369,1078,1114,419,diss_ManRunning1.mp4
9392,1078,1120,422,diss_ManRunning1.mp4
9416,1078,1123,422,diss_ManRunning1.mp4
9424,1078,1124,423,diss_ManRunning1.mp4
9496,1078,1130,423,diss_ManRunning1.mp4
9512,1078,1132,424,diss_ManRunning1.mp4
9528,1078,1135,425,diss_ManRunning1.mp4
9544,1078,1138,426,diss_ManRunning1.mp4
9560,1078,1139,426,diss_ManRunning1.mp4
9576,1078,1140,426,diss_ManRunning1.mp4
9616,1078,1145,429,diss_ManRunning1.mp4
9633,1078,1147,430,diss_ManRunning1.mp4
9640,1078,1148,430,diss_ManRunning1.mp4
9673,1078,1150,430,diss_ManRunning1.mp4
9688,1078,1151,432,diss_ManRunning1.mp4
9712,1078,1155,433,diss_ManRunning1.mp4
9737,1078,1160,437,diss_ManRunning1.mp4
9744,1078,1162,437,diss_ManRunning1.mp4
9760,1078,1164,439,diss_ManRunning1.mp4
9776,1078,1165,439,diss_ManRunning1.mp4
9944,1078,1166,440,diss_ManRunning1.mp4
9960,1078,1167,446,diss_ManRunning1.mp4
9984,1078,1170,449,diss_ManRunning1.mp4
9992,1078,1171,450,diss_ManRunning1.mp4
10016,1078,1172,451,diss_ManRunning1.mp4
10137,1078,1169,451,diss_ManRunning1.mp4
10152,1078,1148,446,diss_ManRunning1.mp4
10176,1078,1041,402,diss_ManRunning1.mp4
10200,1078,897,353,diss_ManRunning1.mp4
10216,1078,858,346,diss_ManRunning1.mp4
10248,1078,816,348,diss_ManRunning1.mp4
10265,1078,788,348,diss_ManRunning1.mp4
10304,1078,619,320,diss_ManRunning1.mp4
10336,1078,508,310,diss_ManRunning1.mp4
10352,1078,480,310,diss_ManRunning1.mp4
10384,1078,404,306,diss_ManRunning1.mp4
10400,1078,365,297,diss_ManRunning1.mp4
10416,1078,334,288,diss_ManRunning1.mp4
10432,1078,315,285,diss_ManRunning1.mp4
10457,1078,293,284,diss_ManRunning1.mp4
10480,1078,269,282,diss_ManRunning1.mp4
10512,1078,210,273,diss_ManRunning1.mp4
10552,1078,180,269,diss_ManRunning1.mp4
10624,1078,178,269,diss_ManRunning1.mp4
10656,1078,164,269,diss_ManRunning1.mp4
10665,1078,161,269,diss_ManRunning1.mp4
10688,1078,157,269,diss_ManRunning1.mp4
10833,1078,156,270,diss_ManRunning1.mp4
10849,1078,152,272,diss_ManRunning1.mp4
10888,1078,141,280,diss_ManRunning1.mp4
10912,1078,135,285,diss_ManRunning1.mp4
10992,1078,121,293,diss_ManRunning1.mp4
11016,1078,117,297,diss_ManRunning1.mp4
11032,1078,113,301,diss_ManRunning1.mp4
11049,1078,108,305,diss_ManRunning1.mp4
11080,1078,92,316,diss_ManRunning1.mp4
11104,1078,86,321,diss_ManRunning1.mp4
11138,1078,81,324,diss_ManRunning1.mp4
11152,1078,79,326,diss_ManRunning1.mp4
11184,1078,76,328,diss_ManRunning1.mp4
11192,1078,75,329,diss_ManRunning1.mp4
11225,1078,71,332,diss_ManRunning1.mp4
11233,1078,70,333,diss_ManRunning1.mp4
11248,1078,65,334,diss_ManRunning1.mp4
11264,1078,61,336,diss_ManRunning1.mp4
11280,1078,59,337,diss_ManRunning1.mp4
11296,1078,58,338,diss_ManRunning1.mp4
11560,1078,58,337,diss_ManRunning1.mp4
11576,1078,61,333,diss_ManRunning1.mp4
11600,1078,88,321,diss_ManRunning1.mp4
11616,1078,112,315,diss_ManRunning1.mp4
11649,1078,180,314,diss_ManRunning1.mp4
11681,1078,305,328,diss_ManRunning1.mp4
11720,1078,541,417,diss_ManRunning1.mp4
11752,1078,705,485,diss_ManRunning1.mp4
11784,1078,848,546,diss_ManRunning1.mp4
11816,1078,911,574,diss_ManRunning1.mp4
11850,1078,939,581,diss_ManRunning1.mp4
11881,1078,962,588,diss_ManRunning1.mp4
11928,1078,996,595,diss_ManRunning1.mp4
11945,1078,1002,595,diss_ManRunning1.mp4
11960,1078,1005,597,diss_ManRunning1.mp4
11984,1078,1008,597,diss_ManRunning1.mp4
12001,1078,1012,597,diss_ManRunning1.mp4
12016,1078,1015,598,diss_ManRunning1.mp4
12056,1078,1028,602,diss_ManRunning1.mp4
12080,1078,1040,605,diss_ManRunning1.mp4
12088,1078,1046,606,diss_ManRunning1.mp4
12120,1078,1064,610,diss_ManRunning1.mp4
12136,1078,1070,611,diss_ManRunning1.mp4
12152,1078,1079,613,diss_ManRunning1.mp4
12168,1078,1086,615,diss_ManRunning1.mp4
12184,1078,1093,618,diss_ManRunning1.mp4
12193,1078,1096,618,diss_ManRunning1.mp4
12216,1078,1106,620,diss_ManRunning1.mp4
12248,1078,1123,625,diss_ManRunning1.mp4
12264,1078,1126,625,diss_ManRunning1.mp4
12528,1078,1125,625,diss_ManRunning1.mp4
12544,1078,1122,625,diss_ManRunning1.mp4
12560,1078,1120,625,diss_ManRunning1.mp4
12568,1078,1118,625,diss_ManRunning1.mp4
12592,1078,1117,625,diss_ManRunning1.mp4
12712,1078,1115,625,diss_ManRunning1.mp4
12728,1078,1111,625,diss_ManRunning1.mp4
12744,1078,1109,625,diss_ManRunning1.mp4
12760,1078,1104,625,diss_ManRunning1.mp4
12776,1078,1097,625,diss_ManRunning1.mp4
12792,1078,1095,624,diss_ManRunning1.mp4
12968,1078,1093,624,diss_ManRunning1.mp4
12984,1078,1089,623,diss_ManRunning1.mp4
12992,1078,1086,623,diss_ManRunning1.mp4
13009,1078,1083,622,diss_ManRunning1.mp4
13032,1078,1080,622,diss_ManRunning1.mp4
13040,1078,1078,621,diss_ManRunning1.mp4
13168,1078,1077,621,diss_ManRunning1.mp4
13176,1078,1073,620,diss_ManRunning1.mp4
13192,1078,1068,618,diss_ManRunning1.mp4
13208,1078,1065,616,diss_ManRunning1.mp4
13226,1078,1063,615,diss_ManRunning1.mp4
13240,1078,1061,614,diss_ManRunning1.mp4
13297,1078,1061,612,diss_ManRunning1.mp4
13336,1078,1061,606,diss_ManRunning1.mp4
13368,1078,1061,599,diss_ManRunning1.mp4
13417,1078,1062,588,diss_ManRunning1.mp4
13425,1078,1062,587,diss_ManRunning1.mp4
13448,1078,1062,583,diss_ManRunning1.mp4
13481,1078,1062,579,diss_ManRunning1.mp4
13568,1078,1062,578,diss_ManRunning1.mp4
13584,1078,1062,575,diss_ManRunning1.mp4
13592,1078,1062,574,diss_ManRunning1.mp4
13617,1078,1062,569,diss_ManRunning1.mp4
13633,1078,1064,566,diss_ManRunning1.mp4
13649,1078,1066,565,diss_ManRunning1.mp4
13680,1078,1068,562,diss_ManRunning1.mp4
13697,1078,1069,562,diss_ManRunning1.mp4
13720,1078,1072,560,diss_ManRunning1.mp4
13736,1078,1073,559,diss_ManRunning1.mp4
13745,1078,1074,558,diss_ManRunning1.mp4
13760,1078,1076,557,diss_ManRunning1.mp4
13776,1078,1078,556,diss_ManRunning1.mp4
13792,1078,1080,556,diss_ManRunning1.mp4
13817,1078,1083,555,diss_ManRunning1.mp4
13832,1078,1086,553,diss_ManRunning1.mp4
13856,1078,1089,552,diss_ManRunning1.mp4
13864,1078,1090,551,diss_ManRunning1.mp4
13880,1078,1094,551,diss_ManRunning1.mp4
13912,1078,1101,546,diss_ManRunning1.mp4
13952,1078,1104,538,diss_ManRunning1.mp4
13984,1078,1105,534,diss_ManRunning1.mp4
13992,1078,1105,533,diss_ManRunning1.mp4
14016,1078,1106,532,diss_ManRunning1.mp4
14208,1078,1107,532,diss_ManRunning1.mp4
14216,1078,1108,532,diss_ManRunning1.mp4
14232,1078,1110,529,diss_ManRunning1.mp4
14248,1078,1112,528,diss_ManRunning1.mp4
14256,1078,1114,526,diss_ManRunning1.mp4
14281,1078,1118,524,diss_ManRunning1.mp4
14296,1078,1122,520,diss_ManRunning1.mp4
14312,1078,1126,516,diss_ManRunning1.mp4
14328,1078,1132,512,diss_ManRunning1.mp4
14344,1078,1137,509,diss_ManRunning1.mp4
14360,1078,1142,507,diss_ManRunning1.mp4
14393,1078,1151,504,diss_ManRunning1.mp4
14401,1078,1154,503,diss_ManRunning1.mp4
14408,1078,1156,503,diss_ManRunning1.mp4
14432,1078,1161,502,diss_ManRunning1.mp4
14448,1078,1164,501,diss_ManRunning1.mp4
14472,1078,1168,501,diss_ManRunning1.mp4
14496,1078,1171,499,diss_ManRunning1.mp4
14552,1078,1178,493,diss_ManRunning1.mp4
14584,1078,1182,489,diss_ManRunning1.mp4
14616,1078,1188,484,diss_ManRunning1.mp4
14656,1078,1194,476,diss_ManRunning1.mp4
14682,1078,1195,471,diss_ManRunning1.mp4
14856,1078,1196,470,diss_ManRunning1.mp4
14899,1078,1198,468,diss_ManRunning1.mp4
14928,1078,1199,468,diss_ManRunning1.mp4
14936,1078,1201,465,diss_ManRunning1.mp4
15072,1078,1202,464,diss_ManRunning1.mp4
15088,1078,1205,464,diss_ManRunning1.mp4
15096,1078,1207,463,diss_ManRunning1.mp4
15104,1078,1208,462,diss_ManRunning1.mp4
15201,1078,1209,462,diss_ManRunning1.mp4
15232,1078,1210,463,diss_ManRunning1.mp4
15248,1078,1210,469,diss_ManRunning1.mp4
15264,1078,1210,474,diss_ManRunning1.mp4
15297,1078,1210,487,diss_ManRunning1.mp4
15304,1078,1210,488,diss_ManRunning1.mp4
15328,1078,1210,492,diss_ManRunning1.mp4
15665,1078,1210,494,diss_ManRunning1.mp4
15672,1078,1210,495,diss_ManRunning1.mp4
15696,1078,1210,498,diss_ManRunning1.mp4
15713,1078,1210,501,diss_ManRunning1.mp4
15728,1078,1210,508,diss_ManRunning1.mp4
15744,1078,1210,517,diss_ManRunning1.mp4
15760,1078,1210,524,diss_ManRunning1.mp4
15776,1078,1209,531,diss_ManRunning1.mp4
15793,1078,1207,537,diss_ManRunning1.mp4
15816,1078,1206,540,diss_ManRunning1.mp4
15824,1078,1206,542,diss_ManRunning1.mp4
15992,1078,1206,543,diss_ManRunning1.mp4
16000,1078,1206,544,diss_ManRunning1.mp4
16008,1078,1206,545,diss_ManRunning1.mp4
16032,1078,1204,548,diss_ManRunning1.mp4
16056,1078,1203,549,diss_ManRunning1.mp4
16081,1078,1203,550,diss_ManRunning1.mp4
16088,1078,1202,550,diss_ManRunning1.mp4
16184,1078,1200,552,diss_ManRunning1.mp4
16192,1078,1197,552,diss_ManRunning1.mp4
16216,1078,1191,555,diss_ManRunning1.mp4
16224,1078,1190,555,diss_ManRunning1.mp4
16248,1078,1184,558,diss_ManRunning1.mp4
16264,1078,1180,561,diss_ManRunning1.mp4
16272,1078,1179,562,diss_ManRunning1.mp4
16313,1078,1174,565,diss_ManRunning1.mp4
16352,1078,1171,566,diss_ManRunning1.mp4
16384,1078,1158,566,diss_ManRunning1.mp4
16416,1078,1148,566,diss_ManRunning1.mp4
16448,1078,1137,566,diss_ManRunning1.mp4
16480,1078,1122,562,diss_ManRunning1.mp4
16512,1078,1107,558,diss_ManRunning1.mp4
16536,1078,1105,558,diss_ManRunning1.mp4
16608,1078,1101,554,diss_ManRunning1.mp4
16624,1078,1095,552,diss_ManRunning1.mp4
16648,1078,1085,548,diss_ManRunning1.mp4
16673,1078,1081,547,diss_ManRunning1.mp4
16745,1078,1077,547,diss_ManRunning1.mp4
16760,1078,1071,547,diss_ManRunning1.mp4
16776,1078,1064,547,diss_ManRunning1.mp4
16793,1078,1057,546,diss_ManRunning1.mp4
16809,1078,1052,545,diss_ManRunning1.mp4
16824,1078,1049,545,diss_ManRunning1.mp4
16848,1078,1047,545,diss_ManRunning1.mp4
16856,1078,1046,545,diss_ManRunning1.mp4
16881,1078,1045,545,diss_ManRunning1.mp4
16897,1078,1042,545,diss_ManRunning1.mp4
16913,1078,1037,545,diss_ManRunning1.mp4
16929,1078,1031,545,diss_ManRunning1.mp4
16952,1078,1021,548,diss_ManRunning1.mp4
16968,1078,1013,551,diss_ManRunning1.mp4
16976,1078,1011,551,diss_ManRunning1.mp4
17000,1078,1001,553,diss_ManRunning1.mp4
17008,1078,997,553,diss_ManRunning1.mp4
17032,1078,966,551,diss_ManRunning1.mp4
17048,1078,945,545,diss_ManRunning1.mp4
17056,1078,939,545,diss_ManRunning1.mp4
17081,1078,924,544,diss_ManRunning1.mp4
17096,1078,917,544,diss_ManRunning1.mp4
17121,1078,909,542,diss_ManRunning1.mp4
17152,1078,887,534,diss_ManRunning1.mp4
17168,1078,883,534,diss_ManRunning1.mp4
17177,1078,881,533,diss_ManRunning1.mp4
17192,1078,878,533,diss_ManRunning1.mp4
17208,1078,873,532,diss_ManRunning1.mp4
17241,1078,853,530,diss_ManRunning1.mp4
17256,1078,844,528,diss_ManRunning1.mp4
17264,1078,841,528,diss_ManRunning1.mp4
17272,1078,837,528,diss_ManRunning1.mp4
17305,1078,822,528,diss_ManRunning1.mp4
17336,1078,797,526,diss_ManRunning1.mp4
17352,1078,780,523,diss_ManRunning1.mp4
17384,1078,754,521,diss_ManRunning1.mp4
17400,1078,746,521,diss_ManRunning1.mp4
17416,1078,739,521,diss_ManRunning1.mp4
17425,1078,737,521,diss_ManRunning1.mp4
17440,1078,735,521,diss_ManRunning1.mp4
17464,1078,733,520,diss_ManRunning1.mp4
17488,1078,722,513,diss_ManRunning1.mp4
17497,1078,716,509,diss_ManRunning1.mp4
17512,1078,691,495,diss_ManRunning1.mp4
17528,1078,639,472,diss_ManRunning1.mp4
17544,1078,581,452,diss_ManRunning1.mp4
17584,1078,512,437,diss_ManRunning1.mp4
17616,1078,471,435,diss_ManRunning1.mp4
17648,1078,452,435,diss_ManRunning1.mp4
17680,1078,443,435,diss_ManRunning1.mp4
17712,1078,438,435,diss_ManRunning1.mp4
17736,1078,437,435,diss_ManRunning1.mp4
17952,1078,435,435,diss_ManRunning1.mp4
17960,1078,429,435,diss_ManRunning1.mp4
17985,1078,417,435,diss_ManRunning1.mp4
18000,1078,411,435,diss_ManRunning1.mp4
18032,1078,399,432,diss_ManRunning1.mp4
18040,1078,397,432,diss_ManRunning1.mp4
18056,1078,392,430,diss_ManRunning1.mp4
18080,1078,384,425,diss_ManRunning1.mp4
18096,1078,376,419,diss_ManRunning1.mp4
18112,1078,362,412,diss_ManRunning1.mp4
18136,1078,345,406,diss_ManRunning1.mp4
18144,1078,342,406,diss_ManRunning1.mp4
18336,1078,341,406,diss_ManRunning1.mp4
18344,1078,339,406,diss_ManRunning1.mp4
18360,1078,334,406,diss_ManRunning1.mp4
18368,1078,330,406,diss_ManRunning1.mp4
18392,1078,308,406,diss_ManRunning1.mp4
18416,1078,291,406,diss_ManRunning1.mp4
18432,1078,280,406,diss_ManRunning1.mp4
18448,1078,273,406,diss_ManRunning1.mp4
18480,1078,262,406,diss_ManRunning1.mp4
18496,1078,259,406,diss_ManRunning1.mp4
18521,1078,255,406,diss_ManRunning1.mp4
18536,1078,253,407,diss_ManRunning1.mp4
18568,1078,248,407,diss_ManRunning1.mp4
18584,1078,242,407,diss_ManRunning1.mp4
18600,1078,234,407,diss_ManRunning1.mp4
18616,1078,224,407,diss_ManRunning1.mp4
18624,1078,220,407,diss_ManRunning1.mp4
18649,1078,204,407,diss_ManRunning1.mp4
18664,1078,198,407,diss_ManRunning1.mp4
18688,1078,194,407,diss_ManRunning1.mp4
18744,1078,193,407,diss_ManRunning1.mp4
18777,1078,204,405,diss_ManRunning1.mp4
18792,1078,250,398,diss_ManRunning1.mp4
18800,1078,304,394,diss_ManRunning1.mp4
18824,1078,525,369,diss_ManRunning1.mp4
18848,1078,741,311,diss_ManRunning1.mp4
18856,1078,814,290,diss_ManRunning1.mp4
18880,1078,997,224,diss_ManRunning1.mp4
18896,1078,1075,186,diss_ManRunning1.mp4
18912,1078,1116,163,diss_ManRunning1.mp4
18928,1078,1131,145,diss_ManRunning1.mp4
18944,1078,1140,129,diss_ManRunning1.mp4
18960,1078,1142,115,diss_ManRunning1.mp4
18985,1078,1142,92,diss_ManRunning1.mp4
19000,1078,1141,81,diss_ManRunning1.mp4
19017,1078,1141,75,diss_ManRunning1.mp4
19032,1078,1141,71,diss_ManRunning1.mp4
19048,1078,1141,67,diss_ManRunning1.mp4
19072,1078,1146,62,diss_ManRunning1.mp4
19080,1078,1148,60,diss_ManRunning1.mp4
19088,1078,1151,59,diss_ManRunning1.mp4
19112,1078,1161,52,diss_ManRunning1.mp4
19128,1078,1168,48,diss_ManRunning1.mp4
19136,1078,1170,46,diss_ManRunning1.mp4
19161,1078,1172,45,diss_ManRunning1.mp4
19288,1078,1171,45,diss_ManRunning1.mp4
19296,1078,1169,45,diss_ManRunning1.mp4
19312,1078,1166,45,diss_ManRunning1.mp4
19328,1078,1160,50,diss_ManRunning1.mp4
19344,1078,1153,56,diss_ManRunning1.mp4
19360,1078,1147,60,diss_ManRunning1.mp4
19368,1078,1144,61,diss_ManRunning1.mp4
19392,1078,1142,62,diss_ManRunning1.mp4
19400,1078,1141,62,diss_ManRunning1.mp4
19424,1078,1139,62,diss_ManRunning1.mp4
19440,1078,1136,62,diss_ManRunning1.mp4
19456,1078,1130,62,diss_ManRunning1.mp4
19544,1078,1124,59,diss_ManRunning1.mp4
19560,1078,1110,50,diss_ManRunning1.mp4
19576,1078,1092,40,diss_ManRunning1.mp4
19592,1078,1067,29,diss_ManRunning1.mp4
19608,1078,1036,15,diss_ManRunning1.mp4
19624,1078,999,0,diss_ManRunning1.mp4
19912,1078,707,1,diss_ManRunning1.mp4
19928,1078,636,12,diss_ManRunning1.mp4
19944,1078,557,24,diss_ManRunning1.mp4
19960,1078,476,35,diss_ManRunning1.mp4
19976,1078,404,47,diss_ManRunning1.mp4
19992,1078,334,65,diss_ManRunning1.mp4
20016,1078,206,111,diss_ManRunning1.mp4
20032,1078,144,138,diss_ManRunning1.mp4
20048,1078,88,171,diss_ManRunning1.mp4
20064,1078,56,191,diss_ManRunning1.mp4
20080,1078,40,205,diss_ManRunning1.mp4
20088,1078,32,214,diss_ManRunning1.mp4
20112,1078,17,232,diss_ManRunning1.mp4
20128,1078,7,243,diss_ManRunning1.mp4
20576,1078,10,480,diss_ManRunning1.mp4
20592,1078,31,484,diss_ManRunning1.mp4
20608,1078,53,487,diss_ManRunning1.mp4
20624,1078,68,487,diss_ManRunning1.mp4
20640,1078,78,487,diss_ManRunning1.mp4
20656,1078,82,487,diss_ManRunning1.mp4
20664,1078,83,487,diss_ManRunning1.mp4
20680,1078,84,487,diss_ManRunning1.mp4
20761,1078,93,488,diss_ManRunning1.mp4
20776,1078,98,488,diss_ManRunning1.mp4
20792,1078,103,490,diss_ManRunning1.mp4
20808,1078,106,492,diss_ManRunning1.mp4
20824,1078,108,492,diss_ManRunning1.mp4
20832,1078,108,493,diss_ManRunning1.mp4
20864,1078,109,494,diss_ManRunning1.mp4
20880,1078,109,499,diss_ManRunning1.mp4
20897,1078,110,506,diss_ManRunning1.mp4
20912,1078,112,512,diss_ManRunning1.mp4
20928,1078,114,518,diss_ManRunning1.mp4
20944,1078,117,526,diss_ManRunning1.mp4
20960,1078,122,534,diss_ManRunning1.mp4
20976,1078,127,541,diss_ManRunning1.mp4
20993,1078,133,550,diss_ManRunning1.mp4
21017,1078,142,558,diss_ManRunning1.mp4
21032,1078,145,560,diss_ManRunning1.mp4
21049,1078,148,562,diss_ManRunning1.mp4
21064,1078,153,565,diss_ManRunning1.mp4
21080,1078,158,567,diss_ManRunning1.mp4
21096,1078,164,570,diss_ManRunning1.mp4
21104,1078,166,571,diss_ManRunning1.mp4
21128,1078,169,574,diss_ManRunning1.mp4
21144,1078,170,575,diss_ManRunning1.mp4
0,1080,646,373,diss_Walking.mp4
8,1080,646,371,diss_Walking.mp4
32,1080,647,365,diss_Walking.mp4
56,1080,652,362,diss_Walking.mp4
96,1080,674,358,diss_Walking.mp4
129,1080,701,358,diss_Walking.mp4
168,1080,725,365,diss_Walking.mp4
184,1080,728,365,diss_Walking.mp4
272,1080,729,365,diss_Walking.mp4
313,1080,729,353,diss_Walking.mp4
329,1080,729,346,diss_Walking.mp4
408,1080,729,323,diss_Walking.mp4
440,1080,729,319,diss_Walking.mp4
473,1080,730,313,diss_Walking.mp4
496,1080,731,309,diss_Walking.mp4
537,1080,731,304,diss_Walking.mp4
568,1080,726,293,diss_Walking.mp4
600,1080,720,285,diss_Walking.mp4
608,1080,720,284,diss_Walking.mp4
704,1080,720,279,diss_Walking.mp4
712,1080,720,275,diss_Walking.mp4
728,1080,720,269,diss_Walking.mp4
768,1080,724,256,diss_Walking.mp4
792,1080,724,252,diss_Walking.mp4
824,1080,724,249,diss_Walking.mp4
856,1080,723,245,diss_Walking.mp4
880,1080,720,243,diss_Walking.mp4
2560,1080,720,242,diss_Walking.mp4
2777,1080,718,242,diss_Walking.mp4
2792,1080,715,242,diss_Walking.mp4
2800,1080,714,242,diss_Walking.mp4
2816,1080,712,242,diss_Walking.mp4
3232,1080,711,242,diss_Walking.mp4
3249,1080,709,244,diss_Walking.mp4
3265,1080,706,245,diss_Walking.mp4
3272,1080,705,245,diss_Walking.mp4
3296,1080,704,246,diss_Walking.mp4
3496,1080,701,247,diss_Walking.mp4
3512,1080,699,248,diss_Walking.mp4
3528,1080,698,249,diss_Walking.mp4
3576,1080,697,252,diss_Walking.mp4
3609,1080,697,254,diss_Walking.mp4
3640,1080,697,255,diss_Walking.mp4
3672,1080,697,257,diss_Walking.mp4
3688,1080,697,258,diss_Walking.mp4
3713,1080,698,259,diss_Walking.mp4
3752,1080,698,262,diss_Walking.mp4
3776,1080,699,264,diss_Walking.mp4
3784,1080,699,265,diss_Walking.mp4
3832,1080,698,269,diss_Walking.mp4
3864,1080,698,273,diss_Walking.mp4
3896,1080,697,274,diss_Walking.mp4
4792,1080,697,277,diss_Walking.mp4
4809,1080,697,281,diss_Walking.mp4
4817,1080,697,284,diss_Walking.mp4
4841,1080,697,287,diss_Walking.mp4
4880,1080,697,290,diss_Walking.mp4
5128,1080,697,291,diss_Walking.mp4
5144,1080,696,294,diss_Walking.mp4
5176,1080,693,297,diss_Walking.mp4
5360,1080,692,298,diss_Walking.mp4
5368,1080,691,298,diss_Walking.mp4
5384,1080,688,301,diss_Walking.mp4
5408,1080,683,304,diss_Walking.mp4
5424,1080,680,307,diss_Walking.mp4
5440,1080,677,309,diss_Walking.mp4
5464,1080,674,311,diss_Walking.mp4
5488,1080,673,312,diss_Walking.mp4
5544,1080,672,312,diss_Walking.mp4
5616,1080,672,313,diss_Walking.mp4
5632,1080,670,314,diss_Walking.mp4
5656,1080,668,319,diss_Walking.mp4
5688,1080,665,323,diss_Walking.mp4
5881,1080,667,323,diss_Walking.mp4
5904,1080,672,323,diss_Walking.mp4
5920,1080,676,323,diss_Walking.mp4
5928,1080,678,323,diss_Walking.mp4
6104,1080,679,324,diss_Walking.mp4
6120,1080,679,328,diss_Walking.mp4
6136,1080,679,335,diss_Walking.mp4
6152,1080,679,340,diss_Walking.mp4
6168,1080,679,346,diss_Walking.mp4
6200,1080,678,357,diss_Walking.mp4
6224,1080,676,361,diss_Walking.mp4
6264,1080,670,370,diss_Walking.mp4
6296,1080,663,381,diss_Walking.mp4
6304,1080,662,382,diss_Walking.mp4
6344,1080,660,390,diss_Walking.mp4
6360,1080,658,391,diss_Walking.mp4
6400,1080,652,396,diss_Walking.mp4
6432,1080,644,400,diss_Walking.mp4
6473,1080,638,402,diss_Walking.mp4
6488,1080,637,402,diss_Walking.mp4
6496,1080,635,402,diss_Walking.mp4
6536,1080,632,402,diss_Walking.mp4
6888,1080,631,405,diss_Walking.mp4
6904,1080,631,408,diss_Walking.mp4
6920,1080,631,412,diss_Walking.mp4
6936,1080,632,415,diss_Walking.mp4
6952,1080,632,418,diss_Walking.mp4
7033,1080,632,419,diss_Walking.mp4
7048,1080,632,421,diss_Walking.mp4
7081,1080,632,423,diss_Walking.mp4
7088,1080,632,424,diss_Walking.mp4
7136,1080,630,425,diss_Walking.mp4
7704,1080,629,426,diss_Walking.mp4
7720,1080,628,427,diss_Walking.mp4
7737,1080,627,428,diss_Walking.mp4
7752,1080,626,428,diss_Walking.mp4
7768,1080,622,429,diss_Walking.mp4
7784,1080,621,429,diss_Walking.mp4
7808,1080,619,429,diss_Walking.mp4
8328,1080,618,430,diss_Walking.mp4
8336,1080,617,430,diss_Walking.mp4
8352,1080,615,430,diss_Walking.mp4
8368,1080,611,430,diss_Walking.mp4
8392,1080,607,431,diss_Walking.mp4
8616,1080,605,431,diss_Walking.mp4
8624,1080,603,431,diss_Walking.mp4
8640,1080,601,431,diss_Walking.mp4
8648,1080,600,431,diss_Walking.mp4
8792,1080,601,431,diss_Walking.mp4
8800,1080,603,431,diss_Walking.mp4
8832,1080,610,431,diss_Walking.mp4
8864,1080,616,431,diss_Walking.mp4
9520,1080,616,430,diss_Walking.mp4
9536,1080,616,429,diss_Walking.mp4
9552,1080,615,428,diss_Walking.mp4
9568,1080,615,427,diss_Walking.mp4
9584,1080,613,423,diss_Walking.mp4
9616,1080,611,416,diss_Walking.mp4
9632,1080,611,415,diss_Walking.mp4
9984,1080,611,414,diss_Walking.mp4
10000,1080,615,414,diss_Walking.mp4
10016,1080,622,414,diss_Walking.mp4
10033,1080,631,414,diss_Walking.mp4
10064,1080,644,412,diss_Walking.mp4
10072,1080,646,412,diss_Walking.mp4
10088,1080,653,412,diss_Walking.mp4
10128,1080,670,410,diss_Walking.mp4
10160,1080,680,408,diss_Walking.mp4
10192,1080,684,408,diss_Walking.mp4
10265,1080,710,409,diss_Walking.mp4
10296,1080,729,411,diss_Walking.mp4
10312,1080,734,411,diss_Walking.mp4
10522,1080,734,408,diss_Walking.mp4
10528,1080,734,406,diss_Walking.mp4
10608,1080,734,405,diss_Walking.mp4
10632,1080,734,403,diss_Walking.mp4
10680,1080,734,400,diss_Walking.mp4
10712,1080,734,399,diss_Walking.mp4
10736,1080,736,396,diss_Walking.mp4
10752,1080,739,392,diss_Walking.mp4
10800,1080,743,374,diss_Walking.mp4
10832,1080,744,367,diss_Walking.mp4
10840,1080,744,366,diss_Walking.mp4
11040,1080,744,365,diss_Walking.mp4
11048,1080,744,363,diss_Walking.mp4
11072,1080,744,361,diss_Walking.mp4
11097,1080,744,360,diss_Walking.mp4
11104,1080,744,359,diss_Walking.mp4
11512,1080,744,358,diss_Walking.mp4
11520,1080,744,357,diss_Walking.mp4
11536,1080,744,354,diss_Walking.mp4
11552,1080,744,352,diss_Walking.mp4
11568,1080,744,348,diss_Walking.mp4
11600,1080,746,338,diss_Walking.mp4
11624,1080,753,324,diss_Walking.mp4
11640,1080,757,316,diss_Walking.mp4
11664,1080,760,308,diss_Walking.mp4
11688,1080,762,304,diss_Walking.mp4
11728,1080,764,299,diss_Walking.mp4
11752,1080,764,296,diss_Walking.mp4
11776,1080,764,293,diss_Walking.mp4
11816,1080,767,287,diss_Walking.mp4
11848,1080,773,281,diss_Walking.mp4
11880,1080,788,276,diss_Walking.mp4
11913,1080,800,269,diss_Walking.mp4
11928,1080,804,267,diss_Walking.mp4
12352,1080,802,267,diss_Walking.mp4
12368,1080,798,267,diss_Walking.mp4
12384,1080,795,267,diss_Walking.mp4
12400,1080,792,267,diss_Walking.mp4
12416,1080,791,267,diss_Walking.mp4
12432,1080,787,268,diss_Walking.mp4
12448,1080,786,269,diss_Walking.mp4
12488,1080,784,270,diss_Walking.mp4
12529,1080,784,271,diss_Walking.mp4
12544,1080,783,271,diss_Walking.mp4
12609,1080,779,273,diss_Walking.mp4
12624,1080,774,275,diss_Walking.mp4
12656,1080,764,280,diss_Walking.mp4
12673,1080,760,281,diss_Walking.mp4
12688,1080,757,283,diss_Walking.mp4
12704,1080,754,284,diss_Walking.mp4
12729,1080,750,289,diss_Walking.mp4
12752,1080,747,293,diss_Walking.mp4
12800,1080,741,306,diss_Walking.mp4
12816,1080,739,308,diss_Walking.mp4
12848,1080,739,310,diss_Walking.mp4
12968,1080,739,311,diss_Walking.mp4
12992,1080,739,314,diss_Walking.mp4
13032,1080,742,314,diss_Walking.mp4
0,1079,644,357,diss_truck3.mp4
8,1079,642,357,diss_truck3.mp4
24,1079,631,357,diss_truck3.mp4
40,1079,612,357,diss_truck3.mp4
72,1079,575,363,diss_truck3.mp4
104,1079,544,377,diss_truck3.mp4
136,1079,524,388,diss_truck3.mp4
176,1079,500,401,diss_truck3.mp4
200,1079,484,410,diss_truck3.mp4
240,1079,459,421,diss_truck3.mp4
264,1079,450,425,diss_truck3.mp4
296,1079,429,429,diss_truck3.mp4
304,1079,425,430,diss_truck3.mp4
352,1079,395,435,diss_truck3.mp4
361,1079,388,436,diss_truck3.mp4
392,1079,370,442,diss_truck3.mp4
425,1079,349,449,diss_truck3.mp4
448,1079,334,458,diss_truck3.mp4
464,1079,327,461,diss_truck3.mp4
488,1079,324,462,diss_truck3.mp4
920,1079,324,461,diss_truck3.mp4
937,1079,326,460,diss_truck3.mp4
953,1079,332,458,diss_truck3.mp4
984,1079,349,457,diss_truck3.mp4
992,1079,357,457,diss_truck3.mp4
1016,1079,380,453,diss_truck3.mp4
1048,1079,441,444,diss_truck3.mp4
1088,1079,529,431,diss_truck3.mp4
1112,1079,557,429,diss_truck3.mp4
1152,1079,581,428,diss_truck3.mp4
1193,1079,590,425,diss_truck3.mp4
1208,1079,591,424,diss_truck3.mp4
1304,1079,592,424,diss_truck3.mp4
1336,1079,602,423,diss_truck3.mp4
1344,1079,605,422,diss_truck3.mp4
1368,1079,620,421,diss_truck3.mp4
1400,1079,645,419,diss_truck3.mp4
1432,1079,656,417,diss_truck3.mp4
1440,1079,657,416,diss_truck3.mp4
1536,1079,639,400,diss_truck3.mp4
1568,1079,629,397,diss_truck3.mp4
1576,1079,628,397,diss_truck3.mp4
1737,1079,626,396,diss_truck3.mp4
1752,1079,623,391,diss_truck3.mp4
1768,1079,617,383,diss_truck3.mp4
1784,1079,605,371,diss_truck3.mp4
1816,1079,574,344,diss_truck3.mp4
1856,1079,539,319,diss_truck3.mp4
1880,1079,536,318,diss_truck3.mp4
2032,1079,534,316,diss_truck3.mp4
2049,1079,528,310,diss_truck3.mp4
2081,1079,518,296,diss_truck3.mp4
2097,1079,513,286,diss_truck3.mp4
2120,1079,506,269,diss_truck3.mp4
2152,1079,499,244,diss_truck3.mp4
2185,1079,491,212,diss_truck3.mp4
2216,1079,479,175,diss_truck3.mp4
2248,1079,478,162,diss_truck3.mp4
2272,1079,477,157,diss_truck3.mp4
2473,1079,477,156,diss_truck3.mp4
2704,1079,475,164,diss_truck3.mp4
2728,1079,471,184,diss_truck3.mp4
2736,1079,471,191,diss_truck3.mp4
2760,1079,471,207,diss_truck3.mp4
2776,1079,471,215,diss_truck3.mp4
2816,1079,471,224,diss_truck3.mp4
2856,1079,475,234,diss_truck3.mp4
2880,1079,480,246,diss_truck3.mp4
2912,1079,487,264,diss_truck3.mp4
2952,1079,491,280,diss_truck3.mp4
2984,1079,492,283,diss_truck3.mp4
2992,1079,492,285,diss_truck3.mp4
3016,1079,495,292,diss_truck3.mp4
3056,1079,502,309,diss_truck3.mp4
3080,1079,504,312,diss_truck3.mp4
3120,1079,510,316,diss_truck3.mp4
3145,1079,524,321,diss_truck3.mp4
3176,1079,544,325,diss_truck3.mp4
3200,1079,551,328,diss_truck3.mp4
3232,1079,552,331,diss_truck3.mp4
3832,1079,553,331,diss_truck3.mp4
3840,1079,556,331,diss_truck3.mp4
3856,1079,560,327,diss_truck3.mp4
3880,1079,571,314,diss_truck3.mp4
3920,1079,580,284,diss_truck3.mp4
3952,1079,580,265,diss_truck3.mp4
3960,1079,577,259,diss_truck3.mp4
3984,1079,565,241,diss_truck3.mp4
4016,1079,546,220,diss_truck3.mp4
4040,1079,538,213,diss_truck3.mp4
4120,1079,538,212,diss_truck3.mp4
4136,1079,538,210,diss_truck3.mp4
4176,1079,551,205,diss_truck3.mp4
4185,1079,555,203,diss_truck3.mp4
4200,1079,563,201,diss_truck3.mp4
4232,1079,580,195,diss_truck3.mp4
4272,1079,587,191,diss_truck3.mp4
4296,1079,589,189,diss_truck3.mp4
4328,1079,591,182,diss_truck3.mp4
4352,1079,595,173,diss_truck3.mp4
4384,1079,596,166,diss_truck3.mp4
4432,1079,596,163,diss_truck3.mp4
4464,1079,598,161,diss_truck3.mp4
4480,1079,600,159,diss_truck3.mp4
4512,1079,606,149,diss_truck3.mp4
4552,1079,614,139,diss_truck3.mp4
4560,1079,614,138,diss_truck3.mp4
4584,1079,617,135,diss_truck3.mp4
4617,1079,622,131,diss_truck3.mp4
4648,1079,628,124,diss_truck3.mp4
4688,1079,632,118,diss_truck3.mp4
4712,1079,632,116,diss_truck3.mp4
4752,1079,632,111,diss_truck3.mp4
4784,1079,631,108,diss_truck3.mp4
4800,1079,628,106,diss_truck3.mp4
4817,1079,627,105,diss_truck3.mp4
4848,1079,624,105,diss_truck3.mp4
4880,1079,615,104,diss_truck3.mp4
4920,1079,611,103,diss_truck3.mp4
4953,1079,607,103,diss_truck3.mp4
4960,1079,606,103,diss_truck3.mp4
5184,1079,605,103,diss_truck3.mp4
5192,1079,602,103,diss_truck3.mp4
5208,1079,587,103,diss_truck3.mp4
5232,1079,560,99,diss_truck3.mp4
5272,1079,531,94,diss_truck3.mp4
5296,1079,527,93,diss_truck3.mp4
5376,1079,526,92,diss_truck3.mp4
5401,1079,527,90,diss_truck3.mp4
5409,1079,531,89,diss_truck3.mp4
5440,1079,551,88,diss_truck3.mp4
5464,1079,572,88,diss_truck3.mp4
5512,1079,630,106,diss_truck3.mp4
5536,1079,662,120,diss_truck3.mp4
5576,1079,711,142,diss_truck3.mp4
5592,1079,729,148,diss_truck3.mp4
5640,1079,786,168,diss_truck3.mp4
5672,1079,823,189,diss_truck3.mp4
5696,1079,847,204,diss_truck3.mp4
5736,1079,895,233,diss_truck3.mp4
5761,1079,921,251,diss_truck3.mp4
5792,1079,951,271,diss_truck3.mp4
5816,1079,971,282,diss_truck3.mp4
5848,1079,995,294,diss_truck3.mp4
5872,1079,1016,306,diss_truck3.mp4
5904,1079,1032,314,diss_truck3.mp4
5928,1079,1037,315,diss_truck3.mp4
5968,1079,1063,322,diss_truck3.mp4
6000,1079,1091,329,diss_truck3.mp4
6040,1079,1113,329,diss_truck3.mp4
6064,1079,1120,330,diss_truck3.mp4
6073,1079,1122,330,diss_truck3.mp4
6161,1079,1121,327,diss_truck3.mp4
6176,1079,1118,323,diss_truck3.mp4
6504,1079,1115,322,diss_truck3.mp4
6512,1079,1112,320,diss_truck3.mp4
6536,1079,1082,310,diss_truck3.mp4
6577,1079,940,249,diss_truck3.mp4
6592,1079,905,239,diss_truck3.mp4
6608,1079,891,235,diss_truck3.mp4
6656,1079,883,231,diss_truck3.mp4
6672,1079,881,231,diss_truck3.mp4
6688,1079,879,229,diss_truck3.mp4
6720,1079,872,228,diss_truck3.mp4
6752,1079,847,224,diss_truck3.mp4
6784,1079,815,219,diss_truck3.mp4
6817,1079,799,219,diss_truck3.mp4
6848,1079,791,219,diss_truck3.mp4
6880,1079,780,220,diss_truck3.mp4
6920,1079,766,221,diss_truck3.mp4
6952,1079,758,223,diss_truck3.mp4
6984,1079,744,227,diss_truck3.mp4
7008,1079,733,230,diss_truck3.mp4
7048,1079,714,233,diss_truck3.mp4
7080,1079,696,238,diss_truck3.mp4
7120,1079,690,243,diss_truck3.mp4
7137,1079,689,243,diss_truck3.mp4
7297,1079,687,246,diss_truck3.mp4
7321,1079,680,250,diss_truck3.mp4
7336,1079,677,252,diss_truck3.mp4
7360,1079,674,255,diss_truck3.mp4
7384,1079,672,255,diss_truck3.mp4
7512,1079,670,256,diss_truck3.mp4
7520,1079,670,257,diss_truck3.mp4
7544,1079,668,258,diss_truck3.mp4
7584,1079,657,261,diss_truck3.mp4
7600,1079,655,262,diss_truck3.mp4
8113,1079,661,262,diss_truck3.mp4
8128,1079,671,262,diss_truck3.mp4
8144,1079,681,262,diss_truck3.mp4
8153,1079,685,260,diss_truck3.mp4
8168,1079,687,260,diss_truck3.mp4
8256,1079,683,264,diss_truck3.mp4
8280,1079,681,266,diss_truck3.mp4
8328,1079,677,279,diss_truck3.mp4
8352,1079,675,295,diss_truck3.mp4
8360,1079,675,302,diss_truck3.mp4
8384,1079,675,327,diss_truck3.mp4
8416,1079,674,347,diss_truck3.mp4
8456,1079,666,368,diss_truck3.mp4
8488,1079,658,382,diss_truck3.mp4
8520,1079,644,401,diss_truck3.mp4
8552,1079,630,414,diss_truck3.mp4
8584,1079,623,424,diss_truck3.mp4
8616,1079,623,429,diss_truck3.mp4
8656,1079,623,435,diss_truck3.mp4
8680,1079,622,442,diss_truck3.mp4
8696,1079,620,447,diss_truck3.mp4
8712,1079,618,454,diss_truck3.mp4
8744,1079,611,472,diss_truck3.mp4
8777,1079,604,490,diss_truck3.mp4
8800,1079,594,506,diss_truck3.mp4
8833,1079,580,523,diss_truck3.mp4
8864,1079,562,539,diss_truck3.mp4
8896,1079,547,552,diss_truck3.mp4
8936,1079,540,561,diss_truck3.mp4
8968,1079,537,568,diss_truck3.mp4
9016,1079,534,569,diss_truck3.mp4
9048,1079,528,570,diss_truck3.mp4
9064,1079,524,570,diss_truck3.mp4
9072,1079,522,570,diss_truck3.mp4
9104,1079,512,570,diss_truck3.mp4
9136,1079,506,570,diss_truck3.mp4
9144,1079,505,570,diss_truck3.mp4
9264,1079,505,569,diss_truck3.mp4
9281,1079,505,566,diss_truck3.mp4
9296,1079,505,562,diss_truck3.mp4
9328,1079,508,553,diss_truck3.mp4
9352,1079,516,548,diss_truck3.mp4
9384,1079,530,541,diss_truck3.mp4
9408,1079,539,539,diss_truck3.mp4
9432,1079,545,536,diss_truck3.mp4
9464,1079,550,532,diss_truck3.mp4
9496,1079,559,526,diss_truck3.mp4
9520,1079,570,522,diss_truck3.mp4
9569,1079,606,510,diss_truck3.mp4
9584,1079,613,507,diss_truck3.mp4
9616,1079,619,506,diss_truck3.mp4
9632,1079,621,504,diss_truck3.mp4
9648,1079,622,503,diss_truck3.mp4
9664,1079,624,502,diss_truck3.mp4
9680,1079,626,500,diss_truck3.mp4
9729,1079,633,495,diss_truck3.mp4
9744,1079,635,492,diss_truck3.mp4
9752,1079,636,491,diss_truck3.mp4
9777,1079,637,488,diss_truck3.mp4
9792,1079,637,487,diss_truck3.mp4
9808,1079,638,485,diss_truck3.mp4
9840,1079,638,484,diss_truck3.mp4
9856,1079,638,483,diss_truck3.mp4
10112,1079,638,482,diss_truck3.mp4
10128,1079,641,480,diss_truck3.mp4
10144,1079,644,478,diss_truck3.mp4
10160,1079,652,477,diss_truck3.mp4
10193,1079,689,473,diss_truck3.mp4
10224,1079,753,467,diss_truck3.mp4
10264,1079,819,467,diss_truck3.mp4
10288,1079,850,471,diss_truck3.mp4
10297,1079,858,473,diss_truck3.mp4
10312,1079,877,479,diss_truck3.mp4
10320,1079,885,480,diss_truck3.mp4
10353,1079,918,484,diss_truck3.mp4
10361,1079,925,485,diss_truck3.mp4
10376,1079,944,488,diss_truck3.mp4
10392,1079,963,490,diss_truck3.mp4
10416,1079,983,493,diss_truck3.mp4
10440,1079,998,493,diss_truck3.mp4
10464,1079,1018,492,diss_truck3.mp4
10489,1079,1032,480,diss_truck3.mp4
10496,1079,1035,474,diss_truck3.mp4
10536,1079,1044,439,diss_truck3.mp4
10568,1079,1049,404,diss_truck3.mp4
10608,1079,1050,346,diss_truck3.mp4
10624,1079,1039,315,diss_truck3.mp4
10648,1079,993,253,diss_truck3.mp4
10656,1079,979,238,diss_truck3.mp4
10673,1079,957,218,diss_truck3.mp4
10688,1079,941,204,diss_truck3.mp4
10704,1079,934,197,diss_truck3.mp4
10721,1079,931,195,diss_truck3.mp4
10768,1079,929,193,diss_truck3.mp4
10793,1079,920,184,diss_truck3.mp4
10808,1079,913,180,diss_truck3.mp4
10824,1079,910,179,diss_truck3.mp4
10840,1079,909,179,diss_truck3.mp4
10920,1079,905,179,diss_truck3.mp4
10928,1079,904,179,diss_truck3.mp4
10961,1079,902,182,diss_truck3.mp4
10968,1079,901,185,diss_truck3.mp4
11001,1079,901,192,diss_truck3.mp4
11009,1079,901,193,diss_truck3.mp4
11024,1079,901,196,diss_truck3.mp4
11032,1079,901,197,diss_truck3.mp4
11056,1079,901,199,diss_truck3.mp4
11072,1079,901,200,diss_truck3.mp4
11177,1079,906,199,diss_truck3.mp4
11193,1079,913,188,diss_truck3.mp4
11225,1079,928,163,diss_truck3.mp4
11264,1079,937,149,diss_truck3.mp4
11296,1079,940,140,diss_truck3.mp4
11328,1079,942,130,diss_truck3.mp4
11345,1079,942,123,diss_truck3.mp4
11393,1079,926,101,diss_truck3.mp4
11416,1079,918,97,diss_truck3.mp4
11425,1079,917,97,diss_truck3.mp4
11568,1079,916,97,diss_truck3.mp4
11576,1079,913,97,diss_truck3.mp4
11593,1079,907,97,diss_truck3.mp4
11609,1079,900,97,diss_truck3.mp4
11640,1079,884,97,diss_truck3.mp4
11656,1079,877,97,diss_truck3.mp4
11672,1079,872,97,diss_truck3.mp4
11688,1079,870,97,diss_truck3.mp4
11704,1079,867,97,diss_truck3.mp4
11728,1079,863,97,diss_truck3.mp4
11736,1079,862,97,diss_truck3.mp4
11752,1079,860,97,diss_truck3.mp4
11777,1079,858,97,diss_truck3.mp4
11784,1079,857,97,diss_truck3.mp4
11800,1079,856,97,diss_truck3.mp4
11816,1079,855,97,diss_truck3.mp4
11904,1079,854,97,diss_truck3.mp4
11928,1079,848,97,diss_truck3.mp4
11960,1079,839,97,diss_truck3.mp4
12000,1079,830,97,diss_truck3.mp4
12025,1079,823,97,diss_truck3.mp4
12040,1079,818,97,diss_truck3.mp4
12056,1079,814,97,diss_truck3.mp4
12072,1079,812,97,diss_truck3.mp4
12089,1079,809,97,diss_truck3.mp4
12112,1079,804,97,diss_truck3.mp4
12128,1079,798,97,diss_truck3.mp4
12161,1079,780,97,diss_truck3.mp4
12176,1079,772,97,diss_truck3.mp4
12192,1079,766,97,diss_truck3.mp4
12209,1079,760,97,diss_truck3.mp4
12224,1079,755,97,diss_truck3.mp4
12243,1079,754,97,diss_truck3.mp4
12248,1079,753,97,diss_truck3.mp4
12280,1079,751,97,diss_truck3.mp4
12296,1079,747,97,diss_truck3.mp4
12312,1079,742,97,diss_truck3.mp4
12328,1079,736,97,diss_truck3.mp4
12376,1079,725,97,diss_truck3.mp4
12393,1079,721,97,diss_truck3.mp4
12410,1079,715,97,diss_truck3.mp4
12424,1079,708,97,diss_truck3.mp4
12440,1079,704,97,diss_truck3.mp4
12448,1079,701,97,diss_truck3.mp4
12464,1079,699,97,diss_truck3.mp4
12592,1079,698,97,diss_truck3.mp4
12609,1079,696,97,diss_truck3.mp4
12624,1079,693,97,diss_truck3.mp4
12632,1079,688,97,diss_truck3.mp4
12664,1079,668,96,diss_truck3.mp4
12672,1079,662,95,diss_truck3.mp4
12688,1079,654,94,diss_truck3.mp4
12704,1079,648,94,diss_truck3.mp4
12720,1079,647,93,diss_truck3.mp4
12808,1079,644,93,diss_truck3.mp4
12824,1079,642,93,diss_truck3.mp4
12832,1079,639,93,diss_truck3.mp4
12856,1079,628,93,diss_truck3.mp4
12872,1079,621,93,diss_truck3.mp4
12888,1079,614,93,diss_truck3.mp4
12904,1079,606,93,diss_truck3.mp4
12920,1079,600,93,diss_truck3.mp4
12936,1079,595,93,diss_truck3.mp4
12952,1079,590,94,diss_truck3.mp4
12960,1079,587,94,diss_truck3.mp4
12993,1079,578,97,diss_truck3.mp4
13010,1079,574,98,diss_truck3.mp4
13025,1079,569,102,diss_truck3.mp4
13041,1079,563,108,diss_truck3.mp4
13056,1079,560,116,diss_truck3.mp4
13072,1079,558,125,diss_truck3.mp4
13088,1079,558,131,diss_truck3.mp4
13104,1079,558,140,diss_truck3.mp4
13128,1079,558,147,diss_truck3.mp4
13136,1079,558,149,diss_truck3.mp4
13160,1079,558,153,diss_truck3.mp4
13176,1079,558,154,diss_truck3.mp4
13192,1079,558,157,diss_truck3.mp4
13208,1079,558,160,diss_truck3.mp4
13216,1079,558,163,diss_truck3.mp4
13240,1079,557,169,diss_truck3.mp4
13265,1079,557,174,diss_truck3.mp4
13280,1079,556,177,diss_truck3.mp4
13297,1079,556,178,diss_truck3.mp4
13320,1079,556,179,diss_truck3.mp4
13384,1079,555,180,diss_truck3.mp4
13400,1079,555,181,diss_truck3.mp4
13424,1079,554,183,diss_truck3.mp4
13440,1079,553,184,diss_truck3.mp4
13448,1079,552,185,diss_truck3.mp4
13472,1079,551,187,diss_truck3.mp4
13488,1079,550,189,diss_truck3.mp4
13504,1079,550,192,diss_truck3.mp4
13528,1079,550,200,diss_truck3.mp4
13544,1079,550,208,diss_truck3.mp4
13552,1079,550,213,diss_truck3.mp4
13568,1079,550,225,diss_truck3.mp4
13592,1079,560,246,diss_truck3.mp4
13608,1079,567,258,diss_truck3.mp4
13624,1079,575,268,diss_truck3.mp4
13640,1079,584,276,diss_truck3.mp4
13656,1079,594,282,diss_truck3.mp4
13672,1079,600,285,diss_truck3.mp4
13680,1079,604,287,diss_truck3.mp4
13704,1079,616,289,diss_truck3.mp4
13728,1079,624,292,diss_truck3.mp4
13744,1079,630,292,diss_truck3.mp4
13752,1079,633,293,diss_truck3.mp4
13776,1079,637,295,diss_truck3.mp4
13800,1079,641,295,diss_truck3.mp4
13816,1079,643,295,diss_truck3.mp4
13832,1079,644,295,diss_truck3.mp4
13856,1079,645,294,diss_truck3.mp4
13872,1079,647,294,diss_truck3.mp4
13896,1079,649,292,diss_truck3.mp4
13912,1079,651,292,diss_truck3.mp4
13920,1079,651,291,diss_truck3.mp4
13936,1079,653,289,diss_truck3.mp4
13960,1079,654,286,diss_truck3.mp4
13968,1079,655,285,diss_truck3.mp4
14328,1079,655,286,diss_truck3.mp4
14368,1079,655,289,diss_truck3.mp4
14384,1079,654,292,diss_truck3.mp4
14409,1079,654,293,diss_truck3.mp4
14416,1079,654,295,diss_truck3.mp4
14440,1079,654,298,diss_truck3.mp4
14456,1079,653,300,diss_truck3.mp4
14472,1079,651,303,diss_truck3.mp4
14488,1079,649,306,diss_truck3.mp4
14513,1079,642,314,diss_truck3.mp4
14528,1079,631,320,diss_truck3.mp4
14536,1079,624,325,diss_truck3.mp4
14552,1079,603,336,diss_truck3.mp4
14576,1079,562,348,diss_truck3.mp4
14592,1079,522,361,diss_truck3.mp4
14608,1079,476,374,diss_truck3.mp4
14616,1079,453,376,diss_truck3.mp4
14640,1079,368,395,diss_truck3.mp4
14656,1079,344,398,diss_truck3.mp4
14672,1079,324,398,diss_truck3.mp4
14688,1079,314,398,diss_truck3.mp4
14704,1079,307,399,diss_truck3.mp4
14720,1079,304,399,diss_truck3.mp4
14728,1079,303,400,diss_truck3.mp4
15064,1079,301,400,diss_truck3.mp4
15072,1079,300,400,diss_truck3.mp4
15088,1079,298,400,diss_truck3.mp4
15096,1079,297,400,diss_truck3.mp4
15121,1079,295,400,diss_truck3.mp4
15136,1079,293,400,diss_truck3.mp4
15153,1079,291,400,diss_truck3.mp4
15168,1079,288,402,diss_truck3.mp4
15184,1079,284,402,diss_truck3.mp4
15200,1079,280,402,diss_truck3.mp4
15216,1079,274,403,diss_truck3.mp4
15240,1079,264,404,diss_truck3.mp4
15256,1079,259,406,diss_truck3.mp4
15272,1079,254,406,diss_truck3.mp4
15280,1079,252,407,diss_truck3.mp4
15304,1079,246,407,diss_truck3.mp4
15320,1079,239,408,diss_truck3.mp4
15336,1079,228,411,diss_truck3.mp4
15353,1079,220,411,diss_truck3.mp4
15369,1079,207,413,diss_truck3.mp4
15384,1079,198,415,diss_truck3.mp4
15408,1079,195,416,diss_truck3.mp4
15520,1079,196,416,diss_truck3.mp4
15528,1079,198,416,diss_truck3.mp4
15545,1079,203,416,diss_truck3.mp4
15552,1079,206,416,diss_truck3.mp4
15569,1079,216,414,diss_truck3.mp4
15584,1079,230,413,diss_truck3.mp4
15609,1079,261,408,diss_truck3.mp4
15624,1079,278,406,diss_truck3.mp4
15640,1079,296,403,diss_truck3.mp4
15656,1079,312,401,diss_truck3.mp4
15672,1079,323,397,diss_truck3.mp4
15688,1079,328,395,diss_truck3.mp4
15704,1079,331,394,diss_truck3.mp4
15712,1079,331,393,diss_truck3.mp4
15736,1079,333,392,diss_truck3.mp4
15744,1079,334,391,diss_truck3.mp4
15777,1079,340,386,diss_truck3.mp4
15800,1079,346,383,diss_truck3.mp4
15809,1079,348,381,diss_truck3.mp4
15816,1079,349,381,diss_truck3.mp4
16184,1079,351,379,diss_truck3.mp4
16192,1079,351,378,diss_truck3.mp4
16200,1079,354,376,diss_truck3.mp4
16232,1079,367,362,diss_truck3.mp4
16256,1079,387,347,diss_truck3.mp4
16272,1079,399,337,diss_truck3.mp4
16304,1079,422,316,diss_truck3.mp4
16320,1079,434,305,diss_truck3.mp4
16329,1079,439,300,diss_truck3.mp4
16352,1079,455,276,diss_truck3.mp4
16376,1079,474,253,diss_truck3.mp4
16392,1079,483,236,diss_truck3.mp4
16408,1079,488,227,diss_truck3.mp4
16432,1079,490,223,diss_truck3.mp4
16512,1079,491,222,diss_truck3.mp4
16528,1079,492,222,diss_truck3.mp4
16560,1079,495,221,diss_truck3.mp4
16664,1079,496,219,diss_truck3.mp4
16672,1079,498,218,diss_truck3.mp4
16696,1079,505,213,diss_truck3.mp4
16704,1079,509,211,diss_truck3.mp4
16728,1079,515,206,diss_truck3.mp4
16744,1079,517,204,diss_truck3.mp4
16777,1079,524,200,diss_truck3.mp4
16792,1079,526,198,diss_truck3.mp4
16808,1079,528,196,diss_truck3.mp4
16825,1079,532,191,diss_truck3.mp4
16840,1079,533,187,diss_truck3.mp4
16864,1079,537,179,diss_truck3.mp4
16872,1079,537,177,diss_truck3.mp4
16880,1079,537,176,diss_truck3.mp4
16960,1079,526,177,diss_truck3.mp4
16976,1079,507,182,diss_truck3.mp4
16992,1079,477,189,diss_truck3.mp4
17008,1079,440,202,diss_truck3.mp4
17025,1079,394,215,diss_truck3.mp4
17040,1079,341,228,diss_truck3.mp4
17056,1079,286,235,diss_truck3.mp4
17072,1079,207,242,diss_truck3.mp4
17088,1079,168,242,diss_truck3.mp4
17104,1079,137,242,diss_truck3.mp4
17128,1079,105,247,diss_truck3.mp4
17152,1079,83,253,diss_truck3.mp4
17168,1079,67,260,diss_truck3.mp4
17184,1079,56,266,diss_truck3.mp4
17208,1079,45,276,diss_truck3.mp4
17225,1079,38,284,diss_truck3.mp4
17240,1079,31,292,diss_truck3.mp4
17256,1079,23,301,diss_truck3.mp4
17272,1079,17,308,diss_truck3.mp4
17296,1079,8,319,diss_truck3.mp4
17304,1079,7,322,diss_truck3.mp4
17328,1079,3,328,diss_truck3.mp4
17336,1079,2,330,diss_truck3.mp4
17424,1079,2,326,diss_truck3.mp4
17441,1079,5,319,diss_truck3.mp4
17456,1079,6,312,diss_truck3.mp4
17472,1079,10,306,diss_truck3.mp4
17488,1079,14,299,diss_truck3.mp4
17504,1079,17,293,diss_truck3.mp4
17512,1079,20,291,diss_truck3.mp4
17536,1079,22,288,diss_truck3.mp4
17616,1079,24,286,diss_truck3.mp4
17624,1079,24,284,diss_truck3.mp4
17640,1079,28,278,diss_truck3.mp4
17672,1079,29,273,diss_truck3.mp4
17688,1079,29,272,diss_truck3.mp4
17704,1079,29,270,diss_truck3.mp4
17720,1079,29,268,diss_truck3.mp4
17744,1079,29,264,diss_truck3.mp4
17760,1079,30,262,diss_truck3.mp4
17768,1079,30,261,diss_truck3.mp4
17792,1079,31,255,diss_truck3.mp4
17808,1079,33,249,diss_truck3.mp4
17825,1079,35,242,diss_truck3.mp4
17848,1079,35,241,diss_truck3.mp4
17857,1079,36,238,diss_truck3.mp4
17872,1079,36,235,diss_truck3.mp4
17888,1079,38,229,diss_truck3.mp4
17904,1079,42,220,diss_truck3.mp4
17920,1079,47,208,diss_truck3.mp4
17946,1079,53,195,diss_truck3.mp4
17960,1079,56,190,diss_truck3.mp4
17976,1079,59,185,diss_truck3.mp4
18000,1079,59,184,diss_truck3.mp4
18075,1079,62,179,diss_truck3.mp4
18088,1079,63,176,diss_truck3.mp4
18104,1079,65,174,diss_truck3.mp4
18112,1079,66,172,diss_truck3.mp4
18128,1079,66,171,diss_truck3.mp4
18152,1079,68,168,diss_truck3.mp4
18184,1079,68,167,diss_truck3.mp4
18200,1079,69,165,diss_truck3.mp4
18224,1079,70,162,diss_truck3.mp4
18240,1079,71,160,diss_truck3.mp4
18248,1079,72,159,diss_truck3.mp4
18272,1079,72,157,diss_truck3.mp4
18288,1079,72,156,diss_truck3.mp4
18304,1079,73,155,diss_truck3.mp4
18320,1079,73,152,diss_truck3.mp4
18336,1079,74,150,diss_truck3.mp4
18344,1079,75,148,diss_truck3.mp4
18360,1079,76,145,diss_truck3.mp4
18392,1079,78,140,diss_truck3.mp4
18408,1079,82,135,diss_truck3.mp4
18424,1079,86,132,diss_truck3.mp4
18440,1079,88,129,diss_truck3.mp4
18448,1079,90,128,diss_truck3.mp4
18472,1079,93,124,diss_truck3.mp4
18480,1079,93,123,diss_truck3.mp4
18505,1079,94,121,diss_truck3.mp4
18520,1079,95,120,diss_truck3.mp4
18528,1079,96,118,diss_truck3.mp4
18560,1079,98,116,diss_truck3.mp4
18577,1079,98,115,diss_truck3.mp4
18585,1079,99,115,diss_truck3.mp4
18672,1079,100,114,diss_truck3.mp4
18680,1079,102,113,diss_truck3.mp4
18705,1079,115,109,diss_truck3.mp4
18720,1079,132,105,diss_truck3.mp4
18736,1079,156,100,diss_truck3.mp4
18752,1079,185,99,diss_truck3.mp4
18777,1079,228,93,diss_truck3.mp4
18793,1079,252,90,diss_truck3.mp4
18808,1079,276,87,diss_truck3.mp4
18824,1079,305,82,diss_truck3.mp4
