verifToken,stimuli_id,source_id,media_a_id,source_a,created_at,source_name_vote,reversed,source_position_vote,bl,bd,nb_replay
6na0zdmp,1077,4278,14069,diss_Girl1.mp4,1644477306,1,,1,8,120,0
6na0zdmp,1076,4282,14073,diss_car11.mp4,1644477325,1,,1,8,120,0
6na0zdmp,1078,4279,14070,diss_ManRunning1.mp4,1644477351,1,,1,8,120,0
6na0zdmp,1075,4281,14072,diss_building1.mp4,1644477371,1,,1,8,120,0
6na0zdmp,1080,4280,14071,diss_Walking.mp4,1644477388,1,,1,8,120,0
6na0zdmp,1079,4283,14074,diss_truck3.mp4,1644477410,1,,1,8,120,0
