verifToken,stimuli_id,source_id,media_a_id,source_a,created_at,source_name_vote,reversed,source_position_vote,bl,bd,nb_replay
mpdh1pcw,1100,5573,44543,diss_truck2.mp4,1645085154,1,,1,8,180,1
mpdh1pcw,1082,5562,44532,diss_bike2.mp4,1645085201,1,,1,8,180,1
mpdh1pcw,1086,5566,44536,diss_building3.mp4,1645085223,1,,1,8,180,1
mpdh1pcw,1091,5571,44541,diss_car15.mp4,1645085254,1,,1,8,180,1
mpdh1pcw,1093,5555,44525,diss_Girl2.mp4,1645085285,1,,1,8,180,1
mpdh1pcw,1081,5553,44523,diss_Basketball.mp4,1645085306,1,,1,8,180,1
mpdh1pcw,1095,5557,44527,diss_ManRunning2.mp4,1645085325,1,,1,8,180,1
mpdh1pcw,1088,5568,44538,diss_car11.mp4,1645085350,1,,1,8,180,1
mpdh1pcw,1087,5567,44537,diss_building4.mp4,1645085374,1,,1,8,180,2
mpdh1pcw,1098,5559,44529,diss_Soccer2.mp4,1645085393,1,,1,8,180,1
mpdh1pcw,1099,5560,44530,diss_StreetBasketball1.mp4,1645085409,1,,1,8,180,1
mpdh1pcw,1084,5564,44534,diss_building1.mp4,1645085422,1,,1,8,180,2
mpdh1pcw,1092,5554,44524,diss_Girl1.mp4,1645085434,1,,1,8,180,1
mpdh1pcw,1094,5556,44526,diss_ManRunning1.mp4,1645085449,1,,1,8,180,1
mpdh1pcw,1083,5563,44533,diss_bike3.mp4,1645085463,1,,1,8,180,1
mpdh1pcw,1089,5569,44539,diss_car12.mp4,1645085493,1,,1,8,180,1
mpdh1pcw,1085,5565,44535,diss_building2.mp4,1645085523,1,,1,8,180,2
mpdh1pcw,1101,5574,44544,diss_truck3.mp4,1645085553,1,,1,8,180,1
mpdh1pcw,1102,5561,44531,diss_Walking.mp4,1645085566,1,,1,8,180,1
mpdh1pcw,1097,5558,44528,diss_Soccer1.mp4,1645085577,1,,1,8,180,1
mpdh1pcw,1090,5570,44540,diss_car13.mp4,1645085590,1,,1,8,180,1
mpdh1pcw,1096,5572,44542,diss_person22.mp4,1645085600,1,,1,8,180,1
