verifToken,stimuli_id,source_id,media_a_id,source_a,created_at,source_name_vote,reversed,source_position_vote,bl,bd,nb_replay
fne5ixo1,1102,5561,44531,diss_Walking.mp4,1645105117,1,,1,8,180,1
fne5ixo1,1096,5572,44542,diss_person22.mp4,1645105144,1,,1,8,180,1
fne5ixo1,1082,5562,44532,diss_bike2.mp4,1645105153,1,,1,8,180,1
fne5ixo1,1099,5560,44530,diss_StreetBasketball1.mp4,1645105176,1,,1,8,180,1
fne5ixo1,1097,5558,44528,diss_Soccer1.mp4,1645105197,1,,1,8,180,1
fne5ixo1,1095,5557,44527,diss_ManRunning2.mp4,1645105209,1,,1,8,180,1
fne5ixo1,1084,5564,44534,diss_building1.mp4,1645105219,1,,1,8,180,1
fne5ixo1,1088,5568,44538,diss_car11.mp4,1645105244,1,,1,8,180,1
fne5ixo1,1083,5563,44533,diss_bike3.mp4,1645105267,1,,1,8,180,1
fne5ixo1,1092,5554,44524,diss_Girl1.mp4,1645105279,1,,1,8,180,1
fne5ixo1,1091,5571,44541,diss_car15.mp4,1645105291,1,,1,8,180,1
fne5ixo1,1100,5573,44543,diss_truck2.mp4,1645105311,1,,1,8,180,1
fne5ixo1,1101,5574,44544,diss_truck3.mp4,1645105329,1,,1,8,180,1
fne5ixo1,1086,5566,44536,diss_building3.mp4,1645105344,1,,1,8,180,1
fne5ixo1,1094,5556,44526,diss_ManRunning1.mp4,1645105358,1,,1,8,180,1
fne5ixo1,1093,5555,44525,diss_Girl2.mp4,1645105376,1,,1,8,180,1
fne5ixo1,1085,5565,44535,diss_building2.mp4,1645105394,1,,1,8,180,1
fne5ixo1,1090,5570,44540,diss_car13.mp4,1645105404,1,,1,8,180,1
fne5ixo1,1087,5567,44537,diss_building4.mp4,1645105414,1,,1,8,180,1
fne5ixo1,1081,5553,44523,diss_Basketball.mp4,1645105434,1,,1,8,180,1
fne5ixo1,1098,5559,44529,diss_Soccer2.mp4,1645105452,1,,1,8,180,1
fne5ixo1,1089,5569,44539,diss_car12.mp4,1645105475,1,,1,8,180,1
