verifToken,stimuli_id,source_id,media_a_id,source_a,created_at,source_name_vote,reversed,source_position_vote,bl,bd,nb_replay
ccuf1gvl,1100,5573,44543,diss_truck2.mp4,1645717018,1,,1,12,120,1
ccuf1gvl,1094,5556,44526,diss_ManRunning1.mp4,1645717069,1,,1,12,120,1
ccuf1gvl,1099,5560,44530,diss_StreetBasketball1.mp4,1645717092,1,,1,12,120,2
ccuf1gvl,1101,5574,44544,diss_truck3.mp4,1645717104,1,,1,12,120,1
ccuf1gvl,1092,5554,44524,diss_Girl1.mp4,1645717115,1,,1,12,120,1
ccuf1gvl,1081,5553,44523,diss_Basketball.mp4,1645717127,1,,1,12,120,1
ccuf1gvl,1083,5563,44533,diss_bike3.mp4,1645717149,1,,1,12,120,1
ccuf1gvl,1102,5561,44531,diss_Walking.mp4,1645717170,1,,1,12,120,1
ccuf1gvl,1098,5559,44529,diss_Soccer2.mp4,1645717180,1,,1,12,120,1
ccuf1gvl,1096,5572,44542,diss_person22.mp4,1645717190,1,,1,12,120,1
ccuf1gvl,1082,5562,44532,diss_bike2.mp4,1645717208,1,,1,12,120,1
ccuf1gvl,1086,5566,44536,diss_building3.mp4,1645717226,1,,1,12,120,1
ccuf1gvl,1093,5555,44525,diss_Girl2.mp4,1645717245,1,,1,12,120,1
ccuf1gvl,1097,5558,44528,diss_Soccer1.mp4,1645717262,1,,1,12,120,1
ccuf1gvl,1090,5570,44540,diss_car13.mp4,1645717279,1,,1,12,120,1
ccuf1gvl,1085,5565,44535,diss_building2.mp4,1645717295,1,,1,12,120,1
ccuf1gvl,1087,5567,44537,diss_building4.mp4,1645717307,1,,1,12,120,1
ccuf1gvl,1091,5571,44541,diss_car15.mp4,1645717318,1,,1,12,120,1
ccuf1gvl,1089,5569,44539,diss_car12.mp4,1645717329,1,,1,12,120,1
ccuf1gvl,1095,5557,44527,diss_ManRunning2.mp4,1645717338,1,,1,12,120,1
ccuf1gvl,1084,5564,44534,diss_building1.mp4,1645717360,1,,1,12,120,2
ccuf1gvl,1088,5568,44538,diss_car11.mp4,1645717382,1,,1,12,120,3
