verifToken,stimuli_id,source_id,media_a_id,source_a,created_at,source_name_vote,reversed,source_position_vote,bl,bd,nb_replay
pkhizdcf,1096,5572,44542,diss_person22.mp4,1648132482,1,,1,12,180,2
pkhizdcf,1095,5557,44527,diss_ManRunning2.mp4,1648132506,1,,1,12,180,1
pkhizdcf,1085,5565,44535,diss_building2.mp4,1648132522,1,,1,12,180,1
pkhizdcf,1093,5555,44525,diss_Girl2.mp4,1648132534,1,,1,12,180,1
pkhizdcf,1083,5563,44533,diss_bike3.mp4,1648132559,1,,1,12,180,1
pkhizdcf,1086,5566,44536,diss_building3.mp4,1648132581,1,,1,12,180,1
pkhizdcf,1087,5567,44537,diss_building4.mp4,1648132606,1,,1,12,180,1
pkhizdcf,1082,5562,44532,diss_bike2.mp4,1648132630,1,,1,12,180,1
pkhizdcf,1092,5554,44524,diss_Girl1.mp4,1648132648,1,,1,12,180,1
pkhizdcf,1089,5569,44539,diss_car12.mp4,1648132666,1,,1,12,180,1
pkhizdcf,1099,5560,44530,diss_StreetBasketball1.mp4,1648132697,1,,1,12,180,1
pkhizdcf,1097,5558,44528,diss_Soccer1.mp4,1648132727,1,,1,12,180,1
pkhizdcf,1102,5561,44531,diss_Walking.mp4,1648132758,1,,1,12,180,1
pkhizdcf,1084,5564,44534,diss_building1.mp4,1648132787,1,,1,12,180,1
pkhizdcf,1091,5571,44541,diss_car15.mp4,1648132809,1,,1,12,180,1
pkhizdcf,1101,5574,44544,diss_truck3.mp4,1648132831,1,,1,12,180,1
pkhizdcf,1094,5556,44526,diss_ManRunning1.mp4,1648132844,1,,1,12,180,1
pkhizdcf,1088,5568,44538,diss_car11.mp4,1648132854,1,,1,12,180,1
pkhizdcf,1081,5553,44523,diss_Basketball.mp4,1648132874,1,,1,12,180,1
pkhizdcf,1098,5559,44529,diss_Soccer2.mp4,1648132894,1,,1,12,180,1
pkhizdcf,1090,5570,44540,diss_car13.mp4,1648132905,1,,1,12,180,1
pkhizdcf,1100,5573,44543,diss_truck2.mp4,1648132916,1,,1,12,180,1
