verifToken,stimuli_id,source_id,media_a_id,source_a,created_at,source_name_vote,reversed,source_position_vote,bl,bd,nb_replay
6qrtz69b,1091,5571,44541,diss_car15.mp4,1646990896,1,,1,12,180,2
6qrtz69b,1086,5566,44536,diss_building3.mp4,1646990938,1,,1,12,180,2
6qrtz69b,1094,5556,44526,diss_ManRunning1.mp4,1646990971,1,,1,12,180,1
6qrtz69b,1099,5560,44530,diss_StreetBasketball1.mp4,1646991002,1,,1,12,180,2
6qrtz69b,1084,5564,44534,diss_building1.mp4,1646991035,1,,1,12,180,2
6qrtz69b,1100,5573,44543,diss_truck2.mp4,1646991059,1,,1,12,180,1
6qrtz69b,1087,5567,44537,diss_building4.mp4,1646991083,1,,1,12,180,1
6qrtz69b,1083,5563,44533,diss_bike3.mp4,1646991096,1,,1,12,180,2
6qrtz69b,1097,5558,44528,diss_Soccer1.mp4,1646991107,1,,1,12,180,1
6qrtz69b,1101,5574,44544,diss_truck3.mp4,1646991119,1,,1,12,180,2
6qrtz69b,1081,5553,44523,diss_Basketball.mp4,1646991139,1,,1,12,180,2
6qrtz69b,1089,5569,44539,diss_car12.mp4,1646991158,1,,1,12,180,2
6qrtz69b,1090,5570,44540,diss_car13.mp4,1646991182,1,,1,12,180,2
6qrtz69b,1093,5555,44525,diss_Girl2.mp4,1646991206,1,,1,12,180,1
6qrtz69b,1098,5559,44529,diss_Soccer2.mp4,1646991229,1,,1,12,180,1
6qrtz69b,1102,5561,44531,diss_Walking.mp4,1646991259,1,,1,12,180,1
6qrtz69b,1088,5568,44538,diss_car11.mp4,1646991288,1,,1,12,180,2
6qrtz69b,1095,5557,44527,diss_ManRunning2.mp4,1646991308,1,,1,12,180,2
6qrtz69b,1085,5565,44535,diss_building2.mp4,1646991325,1,,1,12,180,2
6qrtz69b,1096,5572,44542,diss_person22.mp4,1646991344,1,,1,12,180,2
6qrtz69b,1092,5554,44524,diss_Girl1.mp4,1646991368,1,,1,12,180,1
6qrtz69b,1082,5562,44532,diss_bike2.mp4,1646991391,1,,1,12,180,5
