verifToken,stimuli_id,source_id,media_a_id,source_a,created_at,source_name_vote,reversed,source_position_vote,bl,bd,nb_replay
twl83jrb,1084,5564,44534,diss_building1.mp4,1645003986,1,,1,12,120,1
twl83jrb,1100,5573,44543,diss_truck2.mp4,1645004035,1,,1,12,120,1
twl83jrb,1094,5556,44526,diss_ManRunning1.mp4,1645004057,1,,1,12,120,1
twl83jrb,1083,5563,44533,diss_bike3.mp4,1645004082,1,,1,12,120,1
twl83jrb,1090,5570,44540,diss_car13.mp4,1645004106,1,,1,12,120,1
twl83jrb,1082,5562,44532,diss_bike2.mp4,1645004125,1,,1,12,120,1
twl83jrb,1096,5572,44542,diss_person22.mp4,1645004142,1,,1,12,120,1
twl83jrb,1092,5554,44524,diss_Girl1.mp4,1645004160,1,,1,12,120,1
twl83jrb,1086,5566,44536,diss_building3.mp4,1645004177,1,,1,12,120,1
twl83jrb,1095,5557,44527,diss_ManRunning2.mp4,1645004200,1,,1,12,120,1
twl83jrb,1081,5553,44523,diss_Basketball.mp4,1645004221,1,,1,12,120,1
twl83jrb,1091,5571,44541,diss_car15.mp4,1645004232,1,,1,12,120,1
twl83jrb,1085,5565,44535,diss_building2.mp4,1645004242,1,,1,12,120,1
twl83jrb,1098,5559,44529,diss_Soccer2.mp4,1645004253,1,,1,12,120,1
twl83jrb,1101,5574,44544,diss_truck3.mp4,1645004263,1,,1,12,120,1
twl83jrb,1097,5558,44528,diss_Soccer1.mp4,1645004294,1,,1,12,120,1
twl83jrb,1089,5569,44539,diss_car12.mp4,1645004325,1,,1,12,120,1
twl83jrb,1102,5561,44531,diss_Walking.mp4,1645004338,1,,1,12,120,1
twl83jrb,1087,5567,44537,diss_building4.mp4,1645004350,1,,1,12,120,1
twl83jrb,1088,5568,44538,diss_car11.mp4,1645004369,1,,1,12,120,1
twl83jrb,1099,5560,44530,diss_StreetBasketball1.mp4,1645004387,1,,1,12,120,1
twl83jrb,1093,5555,44525,diss_Girl2.mp4,1645004407,1,,1,12,120,1
