verifToken,stimuli_id,source_id,media_a_id,source_a,created_at,source_name_vote,reversed,source_position_vote,bl,bd,nb_replay
rmr2rhno,1059,4262,14053,diss_Soccer1.mp4,1644424687,1,,1,8,120,0
rmr2rhno,1057,4263,14054,diss_building2.mp4,1644424712,1,,1,8,120,0
rmr2rhno,1062,4263,14054,diss_building2.mp4,1644424735,1,,1,8,120,0
rmr2rhno,1058,4264,14055,diss_car13.mp4,1644424753,1,,1,8,120,0
rmr2rhno,1061,4266,14057,diss_truck2.mp4,1644424776,1,,1,8,120,0
rmr2rhno,1060,4265,14056,diss_person22.mp4,1644424787,1,,1,8,120,0
