verifToken,stimuli_id,source_id,media_a_id,source_a,created_at,source_name_vote,reversed,source_position_vote,bl,bd,nb_replay
emh25al8,1098,5559,44529,diss_Soccer2.mp4,1647446397,1,,1,12,180,1
emh25al8,1093,5555,44525,diss_Girl2.mp4,1647446433,1,,1,12,180,1
emh25al8,1089,5569,44539,diss_car12.mp4,1647446457,1,,1,12,180,1
emh25al8,1086,5566,44536,diss_building3.mp4,1647446477,1,,1,12,180,1
emh25al8,1087,5567,44537,diss_building4.mp4,1647446496,1,,1,12,180,1
emh25al8,1096,5572,44542,diss_person22.mp4,1647446528,1,,1,12,180,1
emh25al8,1092,5554,44524,diss_Girl1.mp4,1647446558,1,,1,12,180,1
emh25al8,1102,5561,44531,diss_Walking.mp4,1647446588,1,,1,12,180,1
emh25al8,1099,5560,44530,diss_StreetBasketball1.mp4,1647446617,1,,1,12,180,1
emh25al8,1094,5556,44526,diss_ManRunning1.mp4,1647446627,1,,1,12,180,1
emh25al8,1100,5573,44543,diss_truck2.mp4,1647446636,1,,1,12,180,1
emh25al8,1082,5562,44532,diss_bike2.mp4,1647446647,1,,1,12,180,1
emh25al8,1084,5564,44534,diss_building1.mp4,1647446657,1,,1,12,180,1
emh25al8,1101,5574,44544,diss_truck3.mp4,1647446674,1,,1,12,180,1
emh25al8,1081,5553,44523,diss_Basketball.mp4,1647446689,1,,1,12,180,1
emh25al8,1091,5571,44541,diss_car15.mp4,1647446701,1,,1,12,180,1
emh25al8,1097,5558,44528,diss_Soccer1.mp4,1647446712,1,,1,12,180,1
emh25al8,1085,5565,44535,diss_building2.mp4,1647446736,1,,1,12,180,1
emh25al8,1095,5557,44527,diss_ManRunning2.mp4,1647446759,1,,1,12,180,1
emh25al8,1088,5568,44538,diss_car11.mp4,1647446783,1,,1,12,180,1
emh25al8,1083,5563,44533,diss_bike3.mp4,1647446806,1,,1,12,180,1
emh25al8,1090,5570,44540,diss_car13.mp4,1647446828,1,,1,12,180,1
