timestamp,stimuli_id,mouseX,mouseY,stimuli
0,1071,640,356,diss_car12.mp4
8,1071,640,355,diss_car12.mp4
592,1071,641,354,diss_car12.mp4
0,1069,645,362,diss_bike2.mp4
120,1069,647,362,diss_bike2.mp4
296,1069,650,363,diss_bike2.mp4
352,1069,656,365,diss_bike2.mp4
528,1069,658,365,diss_bike2.mp4
568,1069,661,365,diss_bike2.mp4
672,1069,671,365,diss_bike2.mp4
1216,1069,677,362,diss_bike2.mp4
1344,1069,694,343,diss_bike2.mp4
1352,1069,695,342,diss_bike2.mp4
1480,1069,718,322,diss_bike2.mp4
1600,1069,757,316,diss_bike2.mp4
1609,1069,758,316,diss_bike2.mp4
1752,1069,808,309,diss_bike2.mp4
2048,1069,922,323,diss_bike2.mp4
2160,1069,967,329,diss_bike2.mp4
2272,1069,987,332,diss_bike2.mp4
2408,1069,1031,332,diss_bike2.mp4
2496,1069,1064,332,diss_bike2.mp4
2816,1069,1081,332,diss_bike2.mp4
3024,1069,1093,332,diss_bike2.mp4
3128,1069,1117,330,diss_bike2.mp4
3248,1069,1126,330,diss_bike2.mp4
3384,1069,1187,331,diss_bike2.mp4
3512,1069,1234,331,diss_bike2.mp4
4480,1069,1180,321,diss_bike2.mp4
4568,1069,929,315,diss_bike2.mp4
4696,1069,687,285,diss_bike2.mp4
4816,1069,651,282,diss_bike2.mp4
4936,1069,588,282,diss_bike2.mp4
5025,1069,557,282,diss_bike2.mp4
5240,1069,547,283,diss_bike2.mp4
5416,1069,538,298,diss_bike2.mp4
5536,1069,533,330,diss_bike2.mp4
5656,1069,521,378,diss_bike2.mp4
5784,1069,486,404,diss_bike2.mp4
5896,1069,437,426,diss_bike2.mp4
6016,1069,409,454,diss_bike2.mp4
6144,1069,400,449,diss_bike2.mp4
6272,1069,317,392,diss_bike2.mp4
6392,1069,289,289,diss_bike2.mp4
6504,1069,287,209,diss_bike2.mp4
6624,1069,287,142,diss_bike2.mp4
6744,1069,287,121,diss_bike2.mp4
6864,1069,287,104,diss_bike2.mp4
6976,1069,287,103,diss_bike2.mp4
7112,1069,197,112,diss_bike2.mp4
7240,1069,169,125,diss_bike2.mp4
7360,1069,157,138,diss_bike2.mp4
7488,1069,171,152,diss_bike2.mp4
7632,1069,208,166,diss_bike2.mp4
7760,1069,290,169,diss_bike2.mp4
7888,1069,364,162,diss_bike2.mp4
8040,1069,453,145,diss_bike2.mp4
8152,1069,550,138,diss_bike2.mp4
8288,1069,650,136,diss_bike2.mp4
8400,1069,700,136,diss_bike2.mp4
8648,1069,706,140,diss_bike2.mp4
8872,1069,710,163,diss_bike2.mp4
8976,1069,698,180,diss_bike2.mp4
9112,1069,683,195,diss_bike2.mp4
9224,1069,671,225,diss_bike2.mp4
9336,1069,667,237,diss_bike2.mp4
9448,1069,661,243,diss_bike2.mp4
9568,1069,658,249,diss_bike2.mp4
9584,1069,658,250,diss_bike2.mp4
9784,1069,662,251,diss_bike2.mp4
9912,1069,687,254,diss_bike2.mp4
10056,1069,827,235,diss_bike2.mp4
10176,1069,928,192,diss_bike2.mp4
10320,1069,1030,148,diss_bike2.mp4
10440,1069,1062,133,diss_bike2.mp4
10552,1069,1121,108,diss_bike2.mp4
10672,1069,1162,90,diss_bike2.mp4
10792,1069,1198,79,diss_bike2.mp4
10912,1069,1202,80,diss_bike2.mp4
11032,1069,1253,95,diss_bike2.mp4
11144,1069,1268,98,diss_bike2.mp4
11512,1069,1190,121,diss_bike2.mp4
11608,1069,1142,121,diss_bike2.mp4
11752,1069,1100,127,diss_bike2.mp4
11880,1069,1070,128,diss_bike2.mp4
12008,1069,981,128,diss_bike2.mp4
12025,1069,980,128,diss_bike2.mp4
12288,1069,936,128,diss_bike2.mp4
12408,1069,809,128,diss_bike2.mp4
12416,1069,807,128,diss_bike2.mp4
12648,1069,786,126,diss_bike2.mp4
12768,1069,753,121,diss_bike2.mp4
13064,1069,747,121,diss_bike2.mp4
13152,1069,716,121,diss_bike2.mp4
13264,1069,681,121,diss_bike2.mp4
13376,1069,645,121,diss_bike2.mp4
13496,1069,617,121,diss_bike2.mp4
13624,1069,588,120,diss_bike2.mp4
13744,1069,566,121,diss_bike2.mp4
13864,1069,551,122,diss_bike2.mp4
13992,1069,543,122,diss_bike2.mp4
14112,1069,536,175,diss_bike2.mp4
14248,1069,515,387,diss_bike2.mp4
14384,1069,458,534,diss_bike2.mp4
14504,1069,443,575,diss_bike2.mp4
14616,1069,439,616,diss_bike2.mp4
14736,1069,411,670,diss_bike2.mp4
14976,1069,401,668,diss_bike2.mp4
15072,1069,400,608,diss_bike2.mp4
15192,1069,459,496,diss_bike2.mp4
15336,1069,519,399,diss_bike2.mp4
15456,1069,534,363,diss_bike2.mp4
15616,1069,526,319,diss_bike2.mp4
15744,1069,501,297,diss_bike2.mp4
15864,1069,452,273,diss_bike2.mp4
15984,1069,380,281,diss_bike2.mp4
16096,1069,358,292,diss_bike2.mp4
16232,1069,350,302,diss_bike2.mp4
16368,1069,349,306,diss_bike2.mp4
16472,1069,357,313,diss_bike2.mp4
16504,1069,359,313,diss_bike2.mp4
16752,1069,388,310,diss_bike2.mp4
16760,1069,395,309,diss_bike2.mp4
16912,1069,511,294,diss_bike2.mp4
17048,1069,556,291,diss_bike2.mp4
17216,1069,586,289,diss_bike2.mp4
17352,1069,631,288,diss_bike2.mp4
17464,1069,674,288,diss_bike2.mp4
17720,1069,749,286,diss_bike2.mp4
17816,1069,772,286,diss_bike2.mp4
17840,1069,775,287,diss_bike2.mp4
18040,1069,776,291,diss_bike2.mp4
18184,1069,780,324,diss_bike2.mp4
18328,1069,779,405,diss_bike2.mp4
18472,1069,688,492,diss_bike2.mp4
0,1070,632,359,diss_building4.mp4
16,1070,631,358,diss_building4.mp4
152,1070,575,391,diss_building4.mp4
296,1070,477,475,diss_building4.mp4
448,1070,466,552,diss_building4.mp4
568,1070,466,580,diss_building4.mp4
688,1070,466,601,diss_building4.mp4
816,1070,471,625,diss_building4.mp4
928,1070,500,628,diss_building4.mp4
1056,1070,552,596,diss_building4.mp4
1136,1070,561,586,diss_building4.mp4
1296,1070,519,583,diss_building4.mp4
1432,1070,486,584,diss_building4.mp4
1552,1070,449,587,diss_building4.mp4
1664,1070,422,599,diss_building4.mp4
1776,1070,400,613,diss_building4.mp4
1960,1070,401,626,diss_building4.mp4
2088,1070,428,631,diss_building4.mp4
2224,1070,453,641,diss_building4.mp4
2320,1070,475,649,diss_building4.mp4
2440,1070,506,643,diss_building4.mp4
2552,1070,548,625,diss_building4.mp4
2688,1070,641,595,diss_building4.mp4
2808,1070,718,576,diss_building4.mp4
2920,1070,778,565,diss_building4.mp4
3056,1070,810,557,diss_building4.mp4
3176,1070,829,552,diss_building4.mp4
3456,1070,934,537,diss_building4.mp4
3744,1070,935,537,diss_building4.mp4
3800,1070,946,537,diss_building4.mp4
3968,1070,942,537,diss_building4.mp4
4048,1070,890,542,diss_building4.mp4
4224,1070,812,560,diss_building4.mp4
4320,1070,770,575,diss_building4.mp4
4864,1070,767,573,diss_building4.mp4
4960,1070,765,571,diss_building4.mp4
5072,1070,754,546,diss_building4.mp4
5224,1070,667,460,diss_building4.mp4
5368,1070,557,420,diss_building4.mp4
5496,1070,474,390,diss_building4.mp4
5608,1070,393,387,diss_building4.mp4
5824,1070,341,389,diss_building4.mp4
6024,1070,323,392,diss_building4.mp4
6280,1070,321,392,diss_building4.mp4
6376,1070,275,387,diss_building4.mp4
6520,1070,275,377,diss_building4.mp4
6640,1070,284,340,diss_building4.mp4
6752,1070,294,319,diss_building4.mp4
6864,1070,308,296,diss_building4.mp4
6984,1070,310,289,diss_building4.mp4
7120,1070,322,274,diss_building4.mp4
7240,1070,357,260,diss_building4.mp4
7368,1070,409,243,diss_building4.mp4
7512,1070,442,232,diss_building4.mp4
7640,1070,497,217,diss_building4.mp4
7760,1070,551,208,diss_building4.mp4
7904,1070,613,199,diss_building4.mp4
8048,1070,664,192,diss_building4.mp4
8176,1070,724,183,diss_building4.mp4
8312,1070,770,183,diss_building4.mp4
8440,1070,824,180,diss_building4.mp4
8584,1070,859,175,diss_building4.mp4
8728,1070,911,159,diss_building4.mp4
8848,1070,949,145,diss_building4.mp4
8968,1070,1018,135,diss_building4.mp4
9120,1070,1060,127,diss_building4.mp4
9216,1070,1078,123,diss_building4.mp4
9392,1070,1096,118,diss_building4.mp4
9536,1070,1165,108,diss_building4.mp4
9656,1070,1172,105,diss_building4.mp4
9768,1070,1173,95,diss_building4.mp4
9872,1070,1173,71,diss_building4.mp4
10008,1070,1164,52,diss_building4.mp4
10136,1070,1136,40,diss_building4.mp4
10256,1070,1079,34,diss_building4.mp4
10392,1070,978,34,diss_building4.mp4
10512,1070,873,34,diss_building4.mp4
10656,1070,767,34,diss_building4.mp4
10752,1070,744,34,diss_building4.mp4
10888,1070,713,41,diss_building4.mp4
11008,1070,683,46,diss_building4.mp4
11128,1070,623,52,diss_building4.mp4
11272,1070,584,55,diss_building4.mp4
11424,1070,578,56,diss_building4.mp4
11576,1070,656,163,diss_building4.mp4
11720,1070,753,208,diss_building4.mp4
11840,1070,890,218,diss_building4.mp4
11984,1070,896,324,diss_building4.mp4
12128,1070,879,379,diss_building4.mp4
12248,1070,859,404,diss_building4.mp4
12368,1070,838,413,diss_building4.mp4
12520,1070,774,434,diss_building4.mp4
12632,1070,759,437,diss_building4.mp4
12768,1070,684,442,diss_building4.mp4
12880,1070,659,447,diss_building4.mp4
13016,1070,632,464,diss_building4.mp4
13136,1070,626,476,diss_building4.mp4
13248,1070,615,491,diss_building4.mp4
13608,1070,632,489,diss_building4.mp4
13696,1070,669,453,diss_building4.mp4
13816,1070,671,436,diss_building4.mp4
13960,1070,671,404,diss_building4.mp4
14072,1070,671,386,diss_building4.mp4
14352,1070,677,377,diss_building4.mp4
14432,1070,692,366,diss_building4.mp4
14560,1070,712,366,diss_building4.mp4
14808,1070,707,360,diss_building4.mp4
14888,1070,680,361,diss_building4.mp4
15152,1070,670,368,diss_building4.mp4
15240,1070,653,377,diss_building4.mp4
15392,1070,633,385,diss_building4.mp4
15656,1070,629,394,diss_building4.mp4
15808,1070,623,411,diss_building4.mp4
15896,1070,615,425,diss_building4.mp4
15904,1070,614,426,diss_building4.mp4
16144,1070,588,457,diss_building4.mp4
16288,1070,519,470,diss_building4.mp4
16448,1070,494,470,diss_building4.mp4
16560,1070,470,469,diss_building4.mp4
16680,1070,450,460,diss_building4.mp4
16816,1070,428,432,diss_building4.mp4
16960,1070,416,392,diss_building4.mp4
17112,1070,428,369,diss_building4.mp4
17232,1070,438,351,diss_building4.mp4
17352,1070,454,328,diss_building4.mp4
17504,1070,484,322,diss_building4.mp4
17632,1070,491,323,diss_building4.mp4
17752,1070,512,329,diss_building4.mp4
17864,1070,518,329,diss_building4.mp4
17984,1070,509,307,diss_building4.mp4
18120,1070,400,261,diss_building4.mp4
18248,1070,400,250,diss_building4.mp4
18368,1070,385,208,diss_building4.mp4
18424,1070,383,197,diss_building4.mp4
18600,1070,381,195,diss_building4.mp4
18832,1070,398,190,diss_building4.mp4
18952,1070,440,178,diss_building4.mp4
18960,1070,445,178,diss_building4.mp4
19088,1070,460,177,diss_building4.mp4
19208,1070,517,171,diss_building4.mp4
19352,1070,558,163,diss_building4.mp4
19504,1070,592,159,diss_building4.mp4
19584,1070,613,159,diss_building4.mp4
19768,1070,638,160,diss_building4.mp4
19880,1070,671,160,diss_building4.mp4
20008,1070,691,167,diss_building4.mp4
20128,1070,712,182,diss_building4.mp4
20136,1070,714,184,diss_building4.mp4
20256,1070,746,203,diss_building4.mp4
20368,1070,771,217,diss_building4.mp4
20520,1070,815,242,diss_building4.mp4
20648,1070,878,268,diss_building4.mp4
20768,1070,913,278,diss_building4.mp4
20880,1070,952,286,diss_building4.mp4
21000,1070,1007,295,diss_building4.mp4
21120,1070,1049,302,diss_building4.mp4
21240,1070,1082,307,diss_building4.mp4
21360,1070,1097,311,diss_building4.mp4
21488,1070,1133,323,diss_building4.mp4
21624,1070,1142,330,diss_building4.mp4
21864,1070,1165,364,diss_building4.mp4
22024,1070,1165,371,diss_building4.mp4
22176,1070,1076,388,diss_building4.mp4
22320,1070,996,406,diss_building4.mp4
22456,1070,935,430,diss_building4.mp4
22568,1070,928,422,diss_building4.mp4
22688,1070,972,292,diss_building4.mp4
22800,1070,981,227,diss_building4.mp4
22912,1070,987,201,diss_building4.mp4
23032,1070,1002,178,diss_building4.mp4
23232,1070,1009,118,diss_building4.mp4
23608,1070,1043,118,diss_building4.mp4
23696,1070,1076,119,diss_building4.mp4
23824,1070,1133,122,diss_building4.mp4
23944,1070,1162,124,diss_building4.mp4
24080,1070,1204,127,diss_building4.mp4
24208,1070,1229,134,diss_building4.mp4
24336,1070,1238,171,diss_building4.mp4
24456,1070,1225,210,diss_building4.mp4
24568,1070,1175,241,diss_building4.mp4
24712,1070,1024,259,diss_building4.mp4
24824,1070,861,277,diss_building4.mp4
24832,1070,848,277,diss_building4.mp4
24952,1070,730,296,diss_building4.mp4
25080,1070,680,324,diss_building4.mp4
25200,1070,650,356,diss_building4.mp4
25336,1070,643,390,diss_building4.mp4
25472,1070,643,411,diss_building4.mp4
25584,1070,648,424,diss_building4.mp4
25712,1070,662,443,diss_building4.mp4
25824,1070,686,455,diss_building4.mp4
26048,1070,752,430,diss_building4.mp4
26392,1070,707,408,diss_building4.mp4
26480,1070,685,355,diss_building4.mp4
0,1073,627,403,diss_Soccer2.mp4
8,1073,625,406,diss_Soccer2.mp4
160,1073,623,414,diss_Soccer2.mp4
312,1073,607,466,diss_Soccer2.mp4
456,1073,607,499,diss_Soccer2.mp4
568,1073,604,525,diss_Soccer2.mp4
696,1073,599,552,diss_Soccer2.mp4
808,1073,598,577,diss_Soccer2.mp4
944,1073,612,607,diss_Soccer2.mp4
1096,1073,648,628,diss_Soccer2.mp4
1216,1073,683,637,diss_Soccer2.mp4
1328,1073,704,641,diss_Soccer2.mp4
1448,1073,704,654,diss_Soccer2.mp4
1456,1073,703,655,diss_Soccer2.mp4
1680,1073,669,642,diss_Soccer2.mp4
1800,1073,629,627,diss_Soccer2.mp4
1912,1073,591,625,diss_Soccer2.mp4
2000,1073,588,624,diss_Soccer2.mp4
2160,1073,581,611,diss_Soccer2.mp4
2224,1073,580,609,diss_Soccer2.mp4
2544,1073,632,601,diss_Soccer2.mp4
2632,1073,682,598,diss_Soccer2.mp4
2760,1073,730,616,diss_Soccer2.mp4
2880,1073,778,646,diss_Soccer2.mp4
3000,1073,835,650,diss_Soccer2.mp4
3128,1073,872,615,diss_Soccer2.mp4
3248,1073,939,543,diss_Soccer2.mp4
3368,1073,981,464,diss_Soccer2.mp4
3488,1073,993,436,diss_Soccer2.mp4
3720,1073,988,424,diss_Soccer2.mp4
3808,1073,936,408,diss_Soccer2.mp4
3832,1073,931,407,diss_Soccer2.mp4
4176,1073,928,404,diss_Soccer2.mp4
4264,1073,925,383,diss_Soccer2.mp4
4352,1073,920,365,diss_Soccer2.mp4
4704,1073,923,360,diss_Soccer2.mp4
4792,1073,928,358,diss_Soccer2.mp4
4920,1073,931,361,diss_Soccer2.mp4
4968,1073,932,364,diss_Soccer2.mp4
5160,1073,952,367,diss_Soccer2.mp4
5232,1073,983,368,diss_Soccer2.mp4
5400,1073,999,374,diss_Soccer2.mp4
5648,1073,1034,367,diss_Soccer2.mp4
5736,1073,1039,366,diss_Soccer2.mp4
5976,1073,1071,379,diss_Soccer2.mp4
6072,1073,1074,382,diss_Soccer2.mp4
6136,1073,1081,383,diss_Soccer2.mp4
6320,1073,1082,383,diss_Soccer2.mp4
6376,1073,1089,385,diss_Soccer2.mp4
6840,1073,1089,377,diss_Soccer2.mp4
6904,1073,1091,370,diss_Soccer2.mp4
7136,1073,1088,362,diss_Soccer2.mp4
7304,1073,1087,361,diss_Soccer2.mp4
7496,1073,1083,360,diss_Soccer2.mp4
7568,1073,1064,358,diss_Soccer2.mp4
0,1072,660,343,diss_ManRunning2.mp4
96,1072,646,292,diss_ManRunning2.mp4
224,1072,566,239,diss_ManRunning2.mp4
344,1072,517,202,diss_ManRunning2.mp4
464,1072,477,181,diss_ManRunning2.mp4
584,1072,390,145,diss_ManRunning2.mp4
680,1072,363,135,diss_ManRunning2.mp4
808,1072,188,172,diss_ManRunning2.mp4
864,1072,110,183,diss_ManRunning2.mp4
1288,1072,86,165,diss_ManRunning2.mp4
1520,1072,119,169,diss_ManRunning2.mp4
1608,1072,267,156,diss_ManRunning2.mp4
1784,1072,509,108,diss_ManRunning2.mp4
1904,1072,653,94,diss_ManRunning2.mp4
2024,1072,757,94,diss_ManRunning2.mp4
2048,1072,761,94,diss_ManRunning2.mp4
2232,1072,763,93,diss_ManRunning2.mp4
2456,1072,785,74,diss_ManRunning2.mp4
2520,1072,788,68,diss_ManRunning2.mp4
2552,1072,787,66,diss_ManRunning2.mp4
2784,1072,780,64,diss_ManRunning2.mp4
2864,1072,741,60,diss_ManRunning2.mp4
3256,1072,602,46,diss_ManRunning2.mp4
3288,1072,601,47,diss_ManRunning2.mp4
3592,1072,604,47,diss_ManRunning2.mp4
3632,1072,605,46,diss_ManRunning2.mp4
3808,1072,528,21,diss_ManRunning2.mp4
3880,1072,525,22,diss_ManRunning2.mp4
4184,1072,547,7,diss_ManRunning2.mp4
4488,1072,548,5,diss_ManRunning2.mp4
4728,1072,565,5,diss_ManRunning2.mp4
4824,1072,579,24,diss_ManRunning2.mp4
4944,1072,582,58,diss_ManRunning2.mp4
4952,1072,582,60,diss_ManRunning2.mp4
5064,1072,594,94,diss_ManRunning2.mp4
5192,1072,612,141,diss_ManRunning2.mp4
5344,1072,629,169,diss_ManRunning2.mp4
5416,1072,639,172,diss_ManRunning2.mp4
5672,1072,730,193,diss_ManRunning2.mp4
5784,1072,731,194,diss_ManRunning2.mp4
5872,1072,775,223,diss_ManRunning2.mp4
6032,1072,781,223,diss_ManRunning2.mp4
6160,1072,885,220,diss_ManRunning2.mp4
6288,1072,961,223,diss_ManRunning2.mp4
6320,1072,968,224,diss_ManRunning2.mp4
6504,1072,984,241,diss_ManRunning2.mp4
6672,1072,984,243,diss_ManRunning2.mp4
6736,1072,1010,254,diss_ManRunning2.mp4
6912,1072,1002,250,diss_ManRunning2.mp4
7200,1072,771,263,diss_ManRunning2.mp4
7208,1072,768,263,diss_ManRunning2.mp4
7552,1072,765,261,diss_ManRunning2.mp4
7640,1072,719,246,diss_ManRunning2.mp4
7720,1072,675,238,diss_ManRunning2.mp4
7944,1072,671,276,diss_ManRunning2.mp4
8064,1072,681,315,diss_ManRunning2.mp4
8312,1072,718,407,diss_ManRunning2.mp4
8392,1072,734,440,diss_ManRunning2.mp4
8504,1072,749,480,diss_ManRunning2.mp4
8624,1072,750,529,diss_ManRunning2.mp4
8744,1072,753,562,diss_ManRunning2.mp4
0,1074,640,366,diss_Basketball.mp4
88,1074,644,405,diss_Basketball.mp4
216,1074,646,433,diss_Basketball.mp4
312,1074,620,443,diss_Basketball.mp4
440,1074,618,445,diss_Basketball.mp4
552,1074,614,449,diss_Basketball.mp4
832,1074,614,442,diss_Basketball.mp4
928,1074,613,412,diss_Basketball.mp4
936,1074,613,407,diss_Basketball.mp4
1055,1074,627,345,diss_Basketball.mp4
1152,1074,637,316,diss_Basketball.mp4
1272,1074,640,313,diss_Basketball.mp4
1632,1074,654,283,diss_Basketball.mp4
1648,1074,654,280,diss_Basketball.mp4
1968,1074,654,278,diss_Basketball.mp4
2048,1074,653,270,diss_Basketball.mp4
2312,1074,665,281,diss_Basketball.mp4
2400,1074,674,285,diss_Basketball.mp4
2672,1074,697,283,diss_Basketball.mp4
2736,1074,704,279,diss_Basketball.mp4
2904,1074,709,276,diss_Basketball.mp4
2984,1074,721,273,diss_Basketball.mp4
3208,1074,725,273,diss_Basketball.mp4
3248,1074,727,273,diss_Basketball.mp4
3575,1074,736,268,diss_Basketball.mp4
3584,1074,740,268,diss_Basketball.mp4
3704,1074,770,272,diss_Basketball.mp4
3784,1074,792,292,diss_Basketball.mp4
3912,1074,796,296,diss_Basketball.mp4
4032,1074,802,298,diss_Basketball.mp4
4160,1074,824,286,diss_Basketball.mp4
4280,1074,839,254,diss_Basketball.mp4
4400,1074,840,244,diss_Basketball.mp4
4480,1074,843,238,diss_Basketball.mp4
4632,1074,846,232,diss_Basketball.mp4
4751,1074,855,206,diss_Basketball.mp4
4888,1074,877,206,diss_Basketball.mp4
5000,1074,893,215,diss_Basketball.mp4
5120,1074,905,221,diss_Basketball.mp4
5240,1074,915,236,diss_Basketball.mp4
5328,1074,918,244,diss_Basketball.mp4
5472,1074,921,259,diss_Basketball.mp4
5584,1074,921,267,diss_Basketball.mp4
5712,1074,921,273,diss_Basketball.mp4
5840,1074,921,279,diss_Basketball.mp4
5976,1074,924,289,diss_Basketball.mp4
6080,1074,926,298,diss_Basketball.mp4
6248,1074,927,302,diss_Basketball.mp4
6440,1074,930,305,diss_Basketball.mp4
6584,1074,941,307,diss_Basketball.mp4
6704,1074,944,305,diss_Basketball.mp4
6816,1074,945,302,diss_Basketball.mp4
6960,1074,948,295,diss_Basketball.mp4
7048,1074,951,290,diss_Basketball.mp4
7336,1074,950,289,diss_Basketball.mp4
7408,1074,944,289,diss_Basketball.mp4
7528,1074,939,289,diss_Basketball.mp4
7648,1074,933,289,diss_Basketball.mp4
7776,1074,915,289,diss_Basketball.mp4
7896,1074,863,282,diss_Basketball.mp4
7920,1074,861,282,diss_Basketball.mp4
8447,1074,823,273,diss_Basketball.mp4
8552,1074,802,336,diss_Basketball.mp4
8648,1074,794,351,diss_Basketball.mp4
8760,1074,790,361,diss_Basketball.mp4
8976,1074,790,363,diss_Basketball.mp4
9144,1074,789,364,diss_Basketball.mp4
9304,1074,823,370,diss_Basketball.mp4
9320,1074,829,370,diss_Basketball.mp4
9432,1074,830,370,diss_Basketball.mp4
10064,1074,818,374,diss_Basketball.mp4
10080,1074,816,374,diss_Basketball.mp4
10272,1074,815,374,diss_Basketball.mp4
10431,1074,810,373,diss_Basketball.mp4
10544,1074,780,370,diss_Basketball.mp4
10664,1074,750,370,diss_Basketball.mp4
10736,1074,738,370,diss_Basketball.mp4
10903,1074,728,371,diss_Basketball.mp4
11023,1074,666,382,diss_Basketball.mp4
11271,1074,632,382,diss_Basketball.mp4
11351,1074,614,382,diss_Basketball.mp4
11399,1074,605,382,diss_Basketball.mp4
11504,1074,602,382,diss_Basketball.mp4
11640,1074,596,381,diss_Basketball.mp4
11864,1074,570,358,diss_Basketball.mp4
11983,1074,555,359,diss_Basketball.mp4
12231,1074,580,361,diss_Basketball.mp4
12319,1074,685,325,diss_Basketball.mp4
12440,1074,744,304,diss_Basketball.mp4
12560,1074,788,292,diss_Basketball.mp4
12672,1074,811,283,diss_Basketball.mp4
12800,1074,853,253,diss_Basketball.mp4
12912,1074,865,235,diss_Basketball.mp4
13031,1074,863,232,diss_Basketball.mp4
13144,1074,855,228,diss_Basketball.mp4
13272,1074,836,212,diss_Basketball.mp4
13352,1074,824,198,diss_Basketball.mp4
13488,1074,813,196,diss_Basketball.mp4
13552,1074,812,197,diss_Basketball.mp4
14008,1074,814,197,diss_Basketball.mp4
14152,1074,815,197,diss_Basketball.mp4
14200,1074,817,197,diss_Basketball.mp4
14391,1074,818,202,diss_Basketball.mp4
14519,1074,790,250,diss_Basketball.mp4
