timestamp,stimuli_id,mouseX,mouseY,stimuli
0,1058,614,389,diss_car13.mp4
14,1058,608,388,diss_car13.mp4
28,1058,604,387,diss_car13.mp4
49,1058,599,384,diss_car13.mp4
71,1058,595,382,diss_car13.mp4
106,1058,592,380,diss_car13.mp4
142,1058,591,378,diss_car13.mp4
170,1058,590,376,diss_car13.mp4
198,1058,584,372,diss_car13.mp4
234,1058,576,368,diss_car13.mp4
269,1058,566,365,diss_car13.mp4
298,1058,560,364,diss_car13.mp4
341,1058,554,361,diss_car13.mp4
369,1058,550,359,diss_car13.mp4
405,1058,542,350,diss_car13.mp4
433,1058,530,339,diss_car13.mp4
469,1058,519,332,diss_car13.mp4
497,1058,514,330,diss_car13.mp4
533,1058,512,330,diss_car13.mp4
917,1058,497,329,diss_car13.mp4
939,1058,469,328,diss_car13.mp4
967,1058,444,327,diss_car13.mp4
1003,1058,431,328,diss_car13.mp4
1037,1058,425,328,diss_car13.mp4
1066,1058,421,330,diss_car13.mp4
1103,1058,419,331,diss_car13.mp4
1137,1058,416,333,diss_car13.mp4
1173,1058,410,338,diss_car13.mp4
1201,1058,407,344,diss_car13.mp4
1236,1058,402,352,diss_car13.mp4
1272,1058,396,359,diss_car13.mp4
1301,1058,392,364,diss_car13.mp4
1336,1058,384,368,diss_car13.mp4
1372,1058,376,376,diss_car13.mp4
1401,1058,369,383,diss_car13.mp4
1429,1058,364,388,diss_car13.mp4
1472,1058,359,392,diss_car13.mp4
1492,1058,357,394,diss_car13.mp4
1514,1058,356,396,diss_car13.mp4
1571,1058,356,399,diss_car13.mp4
1585,1058,356,400,diss_car13.mp4
1692,1058,354,400,diss_car13.mp4
1749,1058,352,399,diss_car13.mp4
1770,1058,352,396,diss_car13.mp4
2183,1058,352,394,diss_car13.mp4
2203,1058,350,384,diss_car13.mp4
2239,1058,348,363,diss_car13.mp4
2268,1058,348,344,diss_car13.mp4
2303,1058,348,328,diss_car13.mp4
2339,1058,351,312,diss_car13.mp4
2367,1058,352,303,diss_car13.mp4
2403,1058,352,294,diss_car13.mp4
2424,1058,352,291,diss_car13.mp4
2466,1058,352,288,diss_car13.mp4
2503,1058,350,285,diss_car13.mp4
2538,1058,348,277,diss_car13.mp4
2566,1058,348,270,diss_car13.mp4
2595,1058,348,265,diss_car13.mp4
2608,1058,348,264,diss_car13.mp4
2901,1058,352,259,diss_car13.mp4
2914,1058,364,244,diss_car13.mp4
2936,1058,392,228,diss_car13.mp4
2972,1058,443,208,diss_car13.mp4
3000,1058,494,197,diss_car13.mp4
3036,1058,559,185,diss_car13.mp4
3071,1058,607,174,diss_car13.mp4
3099,1058,626,172,diss_car13.mp4
3135,1058,638,171,diss_car13.mp4
3170,1058,643,170,diss_car13.mp4
3178,1058,644,168,diss_car13.mp4
3270,1058,651,171,diss_car13.mp4
3284,1058,658,173,diss_car13.mp4
3298,1058,670,178,diss_car13.mp4
3334,1058,703,189,diss_car13.mp4
3369,1058,720,200,diss_car13.mp4
3405,1058,724,209,diss_car13.mp4
3434,1058,722,215,diss_car13.mp4
3462,1058,712,220,diss_car13.mp4
3497,1058,705,220,diss_car13.mp4
3526,1058,702,221,diss_car13.mp4
3569,1058,697,224,diss_car13.mp4
3604,1058,692,229,diss_car13.mp4
3633,1058,686,234,diss_car13.mp4
3668,1058,682,239,diss_car13.mp4
3696,1058,680,243,diss_car13.mp4
3739,1058,677,248,diss_car13.mp4
3768,1058,676,249,diss_car13.mp4
3803,1058,673,250,diss_car13.mp4
3867,1058,673,248,diss_car13.mp4
3881,1058,673,247,diss_car13.mp4
3896,1058,673,244,diss_car13.mp4
3931,1058,677,239,diss_car13.mp4
3967,1058,687,235,diss_car13.mp4
4003,1058,704,238,diss_car13.mp4
4038,1058,719,247,diss_car13.mp4
4073,1058,728,257,diss_car13.mp4
4095,1058,732,260,diss_car13.mp4
4137,1058,736,264,diss_car13.mp4
4173,1058,740,265,diss_car13.mp4
4203,1058,747,266,diss_car13.mp4
4237,1058,756,268,diss_car13.mp4
4273,1058,764,271,diss_car13.mp4
4301,1058,769,272,diss_car13.mp4
4336,1058,774,273,diss_car13.mp4
4649,1058,796,272,diss_car13.mp4
4671,1058,834,272,diss_car13.mp4
4699,1058,882,270,diss_car13.mp4
4734,1058,924,268,diss_car13.mp4
4770,1058,944,262,diss_car13.mp4
4806,1058,953,260,diss_car13.mp4
4834,1058,961,260,diss_car13.mp4
4869,1058,970,259,diss_car13.mp4
4905,1058,984,255,diss_car13.mp4
4934,1058,999,249,diss_car13.mp4
4969,1058,1013,240,diss_car13.mp4
5005,1058,1021,231,diss_car13.mp4
5033,1058,1026,223,diss_car13.mp4
5062,1058,1028,216,diss_car13.mp4
5104,1058,1028,212,diss_car13.mp4
5133,1058,1032,208,diss_car13.mp4
5170,1058,1039,200,diss_car13.mp4
5204,1058,1047,192,diss_car13.mp4
5239,1058,1053,184,diss_car13.mp4
5268,1058,1054,166,diss_car13.mp4
5303,1058,1041,130,diss_car13.mp4
5339,1058,1028,102,diss_car13.mp4
5367,1058,1019,89,diss_car13.mp4
5403,1058,1013,79,diss_car13.mp4
5417,1058,1013,77,diss_car13.mp4
5751,1058,1013,75,diss_car13.mp4
5772,1058,1013,68,diss_car13.mp4
5801,1058,1012,57,diss_car13.mp4
5836,1058,1009,42,diss_car13.mp4
5872,1058,1008,28,diss_car13.mp4
5943,1058,1009,12,diss_car13.mp4
5972,1058,1009,11,diss_car13.mp4
5986,1058,1009,10,diss_car13.mp4
6035,1058,1009,9,diss_car13.mp4
6071,1058,1009,8,diss_car13.mp4
6135,1058,1008,8,diss_car13.mp4
6199,1058,1008,7,diss_car13.mp4
6206,1058,1006,7,diss_car13.mp4
6235,1058,1000,5,diss_car13.mp4
6270,1058,966,3,diss_car13.mp4
6299,1058,926,3,diss_car13.mp4
6334,1058,877,12,diss_car13.mp4
6370,1058,849,23,diss_car13.mp4
6405,1058,839,28,diss_car13.mp4
6704,1058,812,28,diss_car13.mp4
6711,1058,793,28,diss_car13.mp4
6732,1058,738,27,diss_car13.mp4
6768,1058,636,25,diss_car13.mp4
6803,1058,583,24,diss_car13.mp4
6839,1058,573,22,diss_car13.mp4
7137,1058,567,22,diss_car13.mp4
7144,1058,559,22,diss_car13.mp4
7166,1058,531,22,diss_car13.mp4
7202,1058,500,22,diss_car13.mp4
7237,1058,466,23,diss_car13.mp4
7272,1058,432,24,diss_car13.mp4
7301,1058,407,25,diss_car13.mp4
7336,1058,384,25,diss_car13.mp4
7372,1058,376,25,diss_car13.mp4
7401,1058,373,25,diss_car13.mp4
7429,1058,371,25,diss_car13.mp4
7464,1058,369,25,diss_car13.mp4
7507,1058,367,26,diss_car13.mp4
7536,1058,360,30,diss_car13.mp4
7571,1058,340,36,diss_car13.mp4
7606,1058,311,50,diss_car13.mp4
7635,1058,284,64,diss_car13.mp4
7670,1058,263,81,diss_car13.mp4
7706,1058,249,114,diss_car13.mp4
7735,1058,238,160,diss_car13.mp4
7770,1058,231,212,diss_car13.mp4
7799,1058,227,242,diss_car13.mp4
7834,1058,226,272,diss_car13.mp4
7870,1058,225,290,diss_car13.mp4
7905,1058,223,303,diss_car13.mp4
7933,1058,220,310,diss_car13.mp4
7962,1058,218,316,diss_car13.mp4
8005,1058,216,320,diss_car13.mp4
8033,1058,213,326,diss_car13.mp4
8070,1058,208,352,diss_car13.mp4
8105,1058,201,385,diss_car13.mp4
8133,1058,198,398,diss_car13.mp4
8147,1058,197,400,diss_car13.mp4
8467,1058,192,418,diss_car13.mp4
8481,1058,187,446,diss_car13.mp4
8503,1058,182,488,diss_car13.mp4
8538,1058,180,540,diss_car13.mp4
8566,1058,178,565,diss_car13.mp4
8603,1058,172,589,diss_car13.mp4
8638,1058,163,600,diss_car13.mp4
8673,1058,150,605,diss_car13.mp4
8701,1058,144,608,diss_car13.mp4
8737,1058,139,610,diss_car13.mp4
8751,1058,137,611,diss_car13.mp4
8786,1058,136,612,diss_car13.mp4
8865,1058,136,613,diss_car13.mp4
8901,1058,136,614,diss_car13.mp4
9249,1058,135,614,diss_car13.mp4
9334,1058,135,613,diss_car13.mp4
9341,1058,135,612,diss_car13.mp4
9370,1058,135,610,diss_car13.mp4
9406,1058,136,605,diss_car13.mp4
9434,1058,136,592,diss_car13.mp4
9470,1058,139,538,diss_car13.mp4
9505,1058,147,436,diss_car13.mp4
9540,1058,187,264,diss_car13.mp4
9570,1058,209,193,diss_car13.mp4
9604,1058,218,176,diss_car13.mp4
9620,1058,219,176,diss_car13.mp4
9690,1058,220,176,diss_car13.mp4
9718,1058,222,176,diss_car13.mp4
9732,1058,224,175,diss_car13.mp4
9768,1058,235,171,diss_car13.mp4
9803,1058,277,148,diss_car13.mp4
9839,1058,336,120,diss_car13.mp4
9867,1058,376,97,diss_car13.mp4
9903,1058,414,76,diss_car13.mp4
9939,1058,424,71,diss_car13.mp4
9954,1058,425,71,diss_car13.mp4
10501,1058,427,72,diss_car13.mp4
10514,1058,432,72,diss_car13.mp4
10537,1058,444,79,diss_car13.mp4
10571,1058,460,88,diss_car13.mp4
10607,1058,476,100,diss_car13.mp4
10635,1058,486,110,diss_car13.mp4
10672,1058,495,120,diss_car13.mp4
10678,1058,496,123,diss_car13.mp4
11111,1058,506,132,diss_car13.mp4
11133,1058,525,155,diss_car13.mp4
11169,1058,560,195,diss_car13.mp4
11204,1058,573,215,diss_car13.mp4
11218,1058,575,219,diss_car13.mp4
11246,1058,576,219,diss_car13.mp4
11304,1058,568,203,diss_car13.mp4
11332,1058,564,192,diss_car13.mp4
11360,1058,564,188,diss_car13.mp4
11403,1058,564,185,diss_car13.mp4
11439,1058,564,181,diss_car13.mp4
11467,1058,565,176,diss_car13.mp4
11496,1058,566,175,diss_car13.mp4
11524,1058,567,174,diss_car13.mp4
12050,1058,564,172,diss_car13.mp4
12072,1058,556,164,diss_car13.mp4
12100,1058,540,155,diss_car13.mp4
12137,1058,520,148,diss_car13.mp4
12164,1058,512,146,diss_car13.mp4
12187,1058,508,145,diss_car13.mp4
12235,1058,505,144,diss_car13.mp4
12271,1058,500,144,diss_car13.mp4
12306,1058,488,144,diss_car13.mp4
12335,1058,476,144,diss_car13.mp4
12370,1058,462,144,diss_car13.mp4
12406,1058,448,145,diss_car13.mp4
12434,1058,440,148,diss_car13.mp4
12470,1058,434,150,diss_car13.mp4
12499,1058,432,152,diss_car13.mp4
12534,1058,430,155,diss_car13.mp4
12570,1058,428,159,diss_car13.mp4
12605,1058,425,163,diss_car13.mp4
12633,1058,420,168,diss_car13.mp4
12670,1058,412,176,diss_car13.mp4
12705,1058,406,182,diss_car13.mp4
12740,1058,402,187,diss_car13.mp4
12769,1058,400,191,diss_car13.mp4
12804,1058,397,192,diss_car13.mp4
12818,1058,396,192,diss_car13.mp4
12882,1058,398,191,diss_car13.mp4
12904,1058,402,185,diss_car13.mp4
12932,1058,419,176,diss_car13.mp4
12968,1058,457,170,diss_car13.mp4
13003,1058,507,164,diss_car13.mp4
13039,1058,566,161,diss_car13.mp4
13067,1058,615,163,diss_car13.mp4
13103,1058,667,164,diss_car13.mp4
13138,1058,708,166,diss_car13.mp4
13167,1058,745,164,diss_car13.mp4
0,1057,640,380,diss_building2.mp4
15,1057,631,382,diss_building2.mp4
36,1057,619,387,diss_building2.mp4
58,1057,609,390,diss_building2.mp4
86,1057,604,392,diss_building2.mp4
122,1057,597,392,diss_building2.mp4
157,1057,591,393,diss_building2.mp4
185,1057,584,394,diss_building2.mp4
221,1057,571,394,diss_building2.mp4
256,1057,552,396,diss_building2.mp4
292,1057,539,396,diss_building2.mp4
321,1057,534,396,diss_building2.mp4
356,1057,530,394,diss_building2.mp4
384,1057,527,393,diss_building2.mp4
420,1057,521,392,diss_building2.mp4
456,1057,516,392,diss_building2.mp4
491,1057,512,393,diss_building2.mp4
520,1057,507,393,diss_building2.mp4
556,1057,500,388,diss_building2.mp4
591,1057,488,381,diss_building2.mp4
620,1057,484,379,diss_building2.mp4
647,1057,482,379,diss_building2.mp4
669,1057,481,379,diss_building2.mp4
1024,1057,460,377,diss_building2.mp4
1031,1057,452,376,diss_building2.mp4
1053,1057,432,374,diss_building2.mp4
1096,1057,402,373,diss_building2.mp4
1124,1057,384,373,diss_building2.mp4
1152,1057,372,373,diss_building2.mp4
1180,1057,364,373,diss_building2.mp4
1223,1057,357,375,diss_building2.mp4
1259,1057,351,375,diss_building2.mp4
1287,1057,345,375,diss_building2.mp4
1323,1057,340,375,diss_building2.mp4
1359,1057,335,375,diss_building2.mp4
1387,1057,330,375,diss_building2.mp4
1423,1057,326,375,diss_building2.mp4
1459,1057,322,375,diss_building2.mp4
1486,1057,317,375,diss_building2.mp4
1522,1057,313,375,diss_building2.mp4
1558,1057,311,375,diss_building2.mp4
1593,1057,308,375,diss_building2.mp4
1622,1057,306,375,diss_building2.mp4
1657,1057,300,376,diss_building2.mp4
1685,1057,295,377,diss_building2.mp4
1722,1057,288,378,diss_building2.mp4
1757,1057,281,380,diss_building2.mp4
1785,1057,278,381,diss_building2.mp4
1814,1057,276,381,diss_building2.mp4
1885,1057,276,382,diss_building2.mp4
1920,1057,280,384,diss_building2.mp4
1935,1057,281,384,diss_building2.mp4
1956,1057,287,383,diss_building2.mp4
1992,1057,299,383,diss_building2.mp4
2020,1057,312,382,diss_building2.mp4
2056,1057,334,380,diss_building2.mp4
2091,1057,366,374,diss_building2.mp4
2119,1057,405,369,diss_building2.mp4
2156,1057,450,362,diss_building2.mp4
2191,1057,485,360,diss_building2.mp4
2226,1057,508,360,diss_building2.mp4
2256,1057,526,360,diss_building2.mp4
2291,1057,540,360,diss_building2.mp4
2326,1057,550,358,diss_building2.mp4
2354,1057,559,357,diss_building2.mp4
2390,1057,574,357,diss_building2.mp4
2425,1057,593,357,diss_building2.mp4
2454,1057,616,361,diss_building2.mp4
2489,1057,638,367,diss_building2.mp4
2525,1057,649,370,diss_building2.mp4
2553,1057,661,375,diss_building2.mp4
2581,1057,668,380,diss_building2.mp4
2937,1057,670,381,diss_building2.mp4
2952,1057,678,384,diss_building2.mp4
2987,1057,698,389,diss_building2.mp4
3023,1057,715,394,diss_building2.mp4
3058,1057,728,396,diss_building2.mp4
3086,1057,737,397,diss_building2.mp4
3123,1057,756,403,diss_building2.mp4
3158,1057,776,410,diss_building2.mp4
3194,1057,789,414,diss_building2.mp4
3222,1057,796,416,diss_building2.mp4
3243,1057,800,416,diss_building2.mp4
3258,1057,801,416,diss_building2.mp4
3969,1057,800,416,diss_building2.mp4
3990,1057,788,415,diss_building2.mp4
4026,1057,763,408,diss_building2.mp4
4054,1057,743,404,diss_building2.mp4
4089,1057,716,397,diss_building2.mp4
4125,1057,696,395,diss_building2.mp4
4153,1057,686,393,diss_building2.mp4
4182,1057,678,392,diss_building2.mp4
4196,1057,677,392,diss_building2.mp4
4566,1057,674,389,diss_building2.mp4
4587,1057,667,379,diss_building2.mp4
4623,1057,661,368,diss_building2.mp4
4651,1057,657,360,diss_building2.mp4
4687,1057,652,352,diss_building2.mp4
4723,1057,646,344,diss_building2.mp4
4758,1057,639,334,diss_building2.mp4
4786,1057,635,322,diss_building2.mp4
4823,1057,631,309,diss_building2.mp4
4858,1057,630,296,diss_building2.mp4
4886,1057,630,284,diss_building2.mp4
4923,1057,632,272,diss_building2.mp4
4957,1057,640,260,diss_building2.mp4
4985,1057,656,243,diss_building2.mp4
5021,1057,689,223,diss_building2.mp4
5056,1057,722,210,diss_building2.mp4
5093,1057,752,201,diss_building2.mp4
5121,1057,768,198,diss_building2.mp4
5156,1057,782,192,diss_building2.mp4
5192,1057,788,190,diss_building2.mp4
5220,1057,789,190,diss_building2.mp4
5241,1057,789,189,diss_building2.mp4
5284,1057,790,188,diss_building2.mp4
5320,1057,791,187,diss_building2.mp4
5356,1057,794,185,diss_building2.mp4
5391,1057,800,185,diss_building2.mp4
5426,1057,809,185,diss_building2.mp4
5456,1057,818,185,diss_building2.mp4
5491,1057,835,190,diss_building2.mp4
5526,1057,860,195,diss_building2.mp4
5555,1057,880,196,diss_building2.mp4
5590,1057,898,196,diss_building2.mp4
5626,1057,907,197,diss_building2.mp4
5654,1057,909,197,diss_building2.mp4
5683,1057,910,197,diss_building2.mp4
5711,1057,911,197,diss_building2.mp4
5739,1057,911,198,diss_building2.mp4
5790,1057,912,199,diss_building2.mp4
5853,1057,912,200,diss_building2.mp4
5867,1057,914,200,diss_building2.mp4
5889,1057,916,200,diss_building2.mp4
5924,1057,919,202,diss_building2.mp4
5952,1057,921,204,diss_building2.mp4
5988,1057,927,206,diss_building2.mp4
6024,1057,932,209,diss_building2.mp4
6059,1057,936,212,diss_building2.mp4
6087,1057,938,212,diss_building2.mp4
6145,1057,938,213,diss_building2.mp4
6166,1057,939,213,diss_building2.mp4
6187,1057,939,214,diss_building2.mp4
6237,1057,940,216,diss_building2.mp4
6259,1057,940,217,diss_building2.mp4
6287,1057,940,219,diss_building2.mp4
6322,1057,939,224,diss_building2.mp4
6358,1057,938,229,diss_building2.mp4
6386,1057,936,236,diss_building2.mp4
6423,1057,935,246,diss_building2.mp4
6458,1057,933,253,diss_building2.mp4
6493,1057,932,262,diss_building2.mp4
6521,1057,929,268,diss_building2.mp4
6558,1057,928,275,diss_building2.mp4
6593,1057,925,284,diss_building2.mp4
6621,1057,923,291,diss_building2.mp4
6656,1057,920,300,diss_building2.mp4
6692,1057,918,307,diss_building2.mp4
6721,1057,916,312,diss_building2.mp4
6749,1057,914,316,diss_building2.mp4
6792,1057,911,323,diss_building2.mp4
6820,1057,907,332,diss_building2.mp4
6856,1057,900,344,diss_building2.mp4
6892,1057,896,354,diss_building2.mp4
6920,1057,893,358,diss_building2.mp4
6956,1057,890,362,diss_building2.mp4
6991,1057,886,367,diss_building2.mp4
7020,1057,884,373,diss_building2.mp4
7056,1057,880,383,diss_building2.mp4
7091,1057,879,389,diss_building2.mp4
7126,1057,877,394,diss_building2.mp4
7156,1057,876,397,diss_building2.mp4
7190,1057,873,404,diss_building2.mp4
7226,1057,870,412,diss_building2.mp4
7254,1057,862,424,diss_building2.mp4
7289,1057,849,440,diss_building2.mp4
7325,1057,834,464,diss_building2.mp4
7354,1057,817,487,diss_building2.mp4
7389,1057,797,506,diss_building2.mp4
7425,1057,789,515,diss_building2.mp4
7453,1057,788,516,diss_building2.mp4
7531,1057,786,516,diss_building2.mp4
7553,1057,784,516,diss_building2.mp4
7590,1057,776,512,diss_building2.mp4
7624,1057,752,508,diss_building2.mp4
7659,1057,708,496,diss_building2.mp4
7688,1057,677,483,diss_building2.mp4
7723,1057,653,465,diss_building2.mp4
7759,1057,642,451,diss_building2.mp4
7788,1057,638,443,diss_building2.mp4
7823,1057,633,435,diss_building2.mp4
7859,1057,627,420,diss_building2.mp4
7887,1057,621,408,diss_building2.mp4
7923,1057,612,384,diss_building2.mp4
7959,1057,597,349,diss_building2.mp4
7986,1057,588,312,diss_building2.mp4
8023,1057,585,274,diss_building2.mp4
8058,1057,586,256,diss_building2.mp4
8079,1057,586,253,diss_building2.mp4
8093,1057,586,252,diss_building2.mp4
8186,1057,587,250,diss_building2.mp4
8200,1057,589,245,diss_building2.mp4
8221,1057,592,232,diss_building2.mp4
8257,1057,600,199,diss_building2.mp4
8293,1057,600,168,diss_building2.mp4
8321,1057,596,155,diss_building2.mp4
8356,1057,593,152,diss_building2.mp4
8414,1057,592,152,diss_building2.mp4
8435,1057,592,153,diss_building2.mp4
8449,1057,592,154,diss_building2.mp4
8470,1057,592,156,diss_building2.mp4
8541,1057,592,157,diss_building2.mp4
8584,1057,592,158,diss_building2.mp4
8670,1057,593,158,diss_building2.mp4
8712,1057,594,159,diss_building2.mp4
8748,1057,595,160,diss_building2.mp4
8826,1057,596,160,diss_building2.mp4
8890,1057,600,160,diss_building2.mp4
8904,1057,604,163,diss_building2.mp4
8918,1057,610,164,diss_building2.mp4
8954,1057,627,171,diss_building2.mp4
8990,1057,644,176,diss_building2.mp4
9025,1057,654,179,diss_building2.mp4
9054,1057,658,180,diss_building2.mp4
9089,1057,659,180,diss_building2.mp4
9110,1057,660,180,diss_building2.mp4
9153,1057,667,182,diss_building2.mp4
9190,1057,679,185,diss_building2.mp4
9225,1057,692,188,diss_building2.mp4
9260,1057,699,189,diss_building2.mp4
9281,1057,702,190,diss_building2.mp4
9302,1057,703,190,diss_building2.mp4
9359,1057,708,193,diss_building2.mp4
9388,1057,714,196,diss_building2.mp4
9423,1057,724,200,diss_building2.mp4
9459,1057,737,202,diss_building2.mp4
9487,1057,744,204,diss_building2.mp4
9522,1057,770,204,diss_building2.mp4
9558,1057,799,206,diss_building2.mp4
9587,1057,818,207,diss_building2.mp4
9623,1057,839,214,diss_building2.mp4
9658,1057,851,219,diss_building2.mp4
9665,1057,852,220,diss_building2.mp4
9999,1057,856,220,diss_building2.mp4
10021,1057,867,220,diss_building2.mp4
10056,1057,889,220,diss_building2.mp4
10092,1057,907,221,diss_building2.mp4
10120,1057,920,223,diss_building2.mp4
10156,1057,936,224,diss_building2.mp4
10184,1057,944,227,diss_building2.mp4
10213,1057,948,227,diss_building2.mp4
10256,1057,949,226,diss_building2.mp4
10298,1057,949,225,diss_building2.mp4
10333,1057,949,224,diss_building2.mp4
10355,1057,950,224,diss_building2.mp4
10391,1057,956,224,diss_building2.mp4
10426,1057,965,225,diss_building2.mp4
10454,1057,972,226,diss_building2.mp4
10490,1057,974,226,diss_building2.mp4
10533,1057,975,226,diss_building2.mp4
10632,1057,976,226,diss_building2.mp4
10653,1057,977,228,diss_building2.mp4
10689,1057,989,228,diss_building2.mp4
10725,1057,1008,229,diss_building2.mp4
10753,1057,1029,233,diss_building2.mp4
10789,1057,1056,240,diss_building2.mp4
10824,1057,1082,247,diss_building2.mp4
10853,1057,1100,252,diss_building2.mp4
10888,1057,1108,256,diss_building2.mp4
10917,1057,1112,256,diss_building2.mp4
10945,1057,1113,256,diss_building2.mp4
10987,1057,1114,257,diss_building2.mp4
11024,1057,1115,257,diss_building2.mp4
11336,1057,1120,260,diss_building2.mp4
11358,1057,1144,269,diss_building2.mp4
11386,1057,1165,277,diss_building2.mp4
11421,1057,1175,280,diss_building2.mp4
11450,1057,1178,280,diss_building2.mp4
11486,1057,1180,281,diss_building2.mp4
11523,1057,1183,281,diss_building2.mp4
11556,1057,1187,284,diss_building2.mp4
11564,1057,1188,284,diss_building2.mp4
11599,1057,1189,284,diss_building2.mp4
11642,1057,1190,284,diss_building2.mp4
11684,1057,1190,280,diss_building2.mp4
11720,1057,1190,273,diss_building2.mp4
11756,1057,1190,268,diss_building2.mp4
11791,1057,1190,257,diss_building2.mp4
11820,1057,1190,247,diss_building2.mp4
11857,1057,1187,230,diss_building2.mp4
11891,1057,1184,216,diss_building2.mp4
11919,1057,1180,204,diss_building2.mp4
11956,1057,1176,189,diss_building2.mp4
11983,1057,1174,181,diss_building2.mp4
12005,1057,1174,179,diss_building2.mp4
12097,1057,1172,179,diss_building2.mp4
12190,1057,1170,178,diss_building2.mp4
12204,1057,1168,176,diss_building2.mp4
12218,1057,1166,175,diss_building2.mp4
12254,1057,1161,166,diss_building2.mp4
12290,1057,1156,159,diss_building2.mp4
12325,1057,1148,156,diss_building2.mp4
12340,1057,1146,156,diss_building2.mp4
12666,1057,1138,155,diss_building2.mp4
12687,1057,1100,155,diss_building2.mp4
12723,1057,1033,156,diss_building2.mp4
12759,1057,983,157,diss_building2.mp4
12787,1057,966,158,diss_building2.mp4
12809,1057,962,159,diss_building2.mp4
13156,1057,952,159,diss_building2.mp4
13171,1057,924,158,diss_building2.mp4
13185,1057,895,158,diss_building2.mp4
13221,1057,840,160,diss_building2.mp4
13256,1057,805,163,diss_building2.mp4
13285,1057,796,164,diss_building2.mp4
13718,1057,792,164,diss_building2.mp4
13732,1057,780,165,diss_building2.mp4
13754,1057,755,168,diss_building2.mp4
13789,1057,700,171,diss_building2.mp4
13825,1057,653,178,diss_building2.mp4
13854,1057,628,182,diss_building2.mp4
13890,1057,612,187,diss_building2.mp4
14287,1057,606,188,diss_building2.mp4
14301,1057,591,193,diss_building2.mp4
14323,1057,571,203,diss_building2.mp4
14358,1057,544,221,diss_building2.mp4
14387,1057,527,239,diss_building2.mp4
14423,1057,508,264,diss_building2.mp4
14458,1057,495,284,diss_building2.mp4
14486,1057,484,300,diss_building2.mp4
14523,1057,476,316,diss_building2.mp4
14558,1057,468,330,diss_building2.mp4
14593,1057,462,349,diss_building2.mp4
14622,1057,456,356,diss_building2.mp4
14657,1057,444,363,diss_building2.mp4
14693,1057,434,365,diss_building2.mp4
14721,1057,428,369,diss_building2.mp4
14756,1057,422,372,diss_building2.mp4
14785,1057,420,375,diss_building2.mp4
14799,1057,420,376,diss_building2.mp4
14856,1057,424,380,diss_building2.mp4
14892,1057,438,385,diss_building2.mp4
14920,1057,451,390,diss_building2.mp4
14957,1057,464,394,diss_building2.mp4
14991,1057,493,398,diss_building2.mp4
15020,1057,520,401,diss_building2.mp4
15056,1057,548,401,diss_building2.mp4
15091,1057,570,394,diss_building2.mp4
15126,1057,584,384,diss_building2.mp4
15155,1057,598,372,diss_building2.mp4
15191,1057,629,355,diss_building2.mp4
15226,1057,668,338,diss_building2.mp4
15255,1057,697,328,diss_building2.mp4
15275,1057,708,324,diss_building2.mp4
15667,1057,712,324,diss_building2.mp4
15688,1057,731,320,diss_building2.mp4
15725,1057,762,315,diss_building2.mp4
15752,1057,784,312,diss_building2.mp4
15795,1057,802,310,diss_building2.mp4
15823,1057,810,309,diss_building2.mp4
15851,1057,814,308,diss_building2.mp4
15865,1057,815,308,diss_building2.mp4
15894,1057,816,308,diss_building2.mp4
15959,1057,817,309,diss_building2.mp4
15987,1057,820,310,diss_building2.mp4
16023,1057,829,310,diss_building2.mp4
16058,1057,844,307,diss_building2.mp4
16093,1057,866,303,diss_building2.mp4
16123,1057,894,298,diss_building2.mp4
16158,1057,922,293,diss_building2.mp4
16193,1057,950,290,diss_building2.mp4
16222,1057,964,287,diss_building2.mp4
16250,1057,972,286,diss_building2.mp4
16598,1057,978,286,diss_building2.mp4
16620,1057,1002,286,diss_building2.mp4
16655,1057,1037,287,diss_building2.mp4
16691,1057,1068,292,diss_building2.mp4
16719,1057,1084,298,diss_building2.mp4
16755,1057,1094,301,diss_building2.mp4
16776,1057,1095,302,diss_building2.mp4
16812,1057,1096,302,diss_building2.mp4
16883,1057,1098,302,diss_building2.mp4
16904,1057,1101,301,diss_building2.mp4
16918,1057,1105,300,diss_building2.mp4
16955,1057,1124,298,diss_building2.mp4
16990,1057,1143,296,diss_building2.mp4
17018,1057,1150,296,diss_building2.mp4
17039,1057,1151,296,diss_building2.mp4
17082,1057,1152,296,diss_building2.mp4
17132,1057,1155,296,diss_building2.mp4
17160,1057,1164,296,diss_building2.mp4
17190,1057,1173,296,diss_building2.mp4
17225,1057,1184,296,diss_building2.mp4
17245,1057,1187,296,diss_building2.mp4
17274,1057,1188,296,diss_building2.mp4
17352,1057,1186,296,diss_building2.mp4
17366,1057,1180,294,diss_building2.mp4
17388,1057,1160,288,diss_building2.mp4
17423,1057,1092,272,diss_building2.mp4
17459,1057,1012,257,diss_building2.mp4
17487,1057,981,253,diss_building2.mp4
17509,1057,976,252,diss_building2.mp4
17921,1057,963,256,diss_building2.mp4
17935,1057,949,259,diss_building2.mp4
17957,1057,929,264,diss_building2.mp4
17992,1057,908,266,diss_building2.mp4
18021,1057,902,266,diss_building2.mp4
18035,1057,900,266,diss_building2.mp4
18078,1057,899,265,diss_building2.mp4
18121,1057,896,264,diss_building2.mp4
18156,1057,890,261,diss_building2.mp4
18192,1057,876,260,diss_building2.mp4
18220,1057,858,260,diss_building2.mp4
18257,1057,832,263,diss_building2.mp4
0,1062,640,366,diss_building2.mp4
42,1062,607,366,diss_building2.mp4
49,1062,601,367,diss_building2.mp4
63,1062,588,369,diss_building2.mp4
78,1062,572,371,diss_building2.mp4
99,1062,551,372,diss_building2.mp4
135,1062,520,368,diss_building2.mp4
170,1062,504,361,diss_building2.mp4
198,1062,495,360,diss_building2.mp4
235,1062,483,364,diss_building2.mp4
270,1062,472,368,diss_building2.mp4
305,1062,464,370,diss_building2.mp4
334,1062,454,370,diss_building2.mp4
369,1062,433,368,diss_building2.mp4
405,1062,410,364,diss_building2.mp4
426,1062,400,363,diss_building2.mp4
469,1062,393,364,diss_building2.mp4
845,1062,395,363,diss_building2.mp4
866,1062,406,352,diss_building2.mp4
902,1062,432,331,diss_building2.mp4
937,1062,455,314,diss_building2.mp4
966,1062,475,308,diss_building2.mp4
1002,1062,500,302,diss_building2.mp4
1037,1062,531,302,diss_building2.mp4
1065,1062,598,304,diss_building2.mp4
1102,1062,700,310,diss_building2.mp4
1137,1062,765,315,diss_building2.mp4
1165,1062,782,317,diss_building2.mp4
1193,1062,784,317,diss_building2.mp4
1335,1062,784,316,diss_building2.mp4
1499,1062,784,314,diss_building2.mp4
1513,1062,784,310,diss_building2.mp4
1535,1062,780,298,diss_building2.mp4
1570,1062,768,272,diss_building2.mp4
1605,1062,756,254,diss_building2.mp4
1634,1062,747,244,diss_building2.mp4
1669,1062,737,236,diss_building2.mp4
1690,1062,734,232,diss_building2.mp4
2046,1062,747,226,diss_building2.mp4
2067,1062,770,218,diss_building2.mp4
2103,1062,798,209,diss_building2.mp4
2138,1062,824,207,diss_building2.mp4
2167,1062,843,208,diss_building2.mp4
2202,1062,868,212,diss_building2.mp4
2238,1062,888,216,diss_building2.mp4
2266,1062,900,218,diss_building2.mp4
2302,1062,909,221,diss_building2.mp4
2330,1062,914,221,diss_building2.mp4
2636,1062,950,220,diss_building2.mp4
2650,1062,977,219,diss_building2.mp4
2664,1062,1003,219,diss_building2.mp4
2700,1062,1054,228,diss_building2.mp4
2735,1062,1083,237,diss_building2.mp4
2771,1062,1100,243,diss_building2.mp4
2799,1062,1106,244,diss_building2.mp4
2820,1062,1108,245,diss_building2.mp4
3147,1062,1100,250,diss_building2.mp4
3169,1062,1054,284,diss_building2.mp4
3204,1062,988,328,diss_building2.mp4
3233,1062,948,357,diss_building2.mp4
3269,1062,918,376,diss_building2.mp4
3304,1062,908,380,diss_building2.mp4
3319,1062,906,380,diss_building2.mp4
3567,1062,891,376,diss_building2.mp4
3581,1062,848,368,diss_building2.mp4
3602,1062,790,360,diss_building2.mp4
3637,1062,729,360,diss_building2.mp4
3666,1062,709,361,diss_building2.mp4
3695,1062,705,361,diss_building2.mp4
4015,1062,700,361,diss_building2.mp4
4036,1062,674,356,diss_building2.mp4
4064,1062,626,344,diss_building2.mp4
4099,1062,572,334,diss_building2.mp4
4135,1062,540,329,diss_building2.mp4
4171,1062,515,329,diss_building2.mp4
4192,1062,506,329,diss_building2.mp4
4469,1062,454,315,diss_building2.mp4
4483,1062,412,306,diss_building2.mp4
4505,1062,355,297,diss_building2.mp4
4533,1062,308,295,diss_building2.mp4
4569,1062,284,295,diss_building2.mp4
4604,1062,280,295,diss_building2.mp4
4803,1062,274,295,diss_building2.mp4
4817,1062,258,293,diss_building2.mp4
4831,1062,240,293,diss_building2.mp4
4867,1062,208,286,diss_building2.mp4
4903,1062,184,278,diss_building2.mp4
4938,1062,171,274,diss_building2.mp4
4952,1062,170,273,diss_building2.mp4
5279,1062,195,271,diss_building2.mp4
5300,1062,258,267,diss_building2.mp4
5336,1062,376,260,diss_building2.mp4
5372,1062,461,261,diss_building2.mp4
5400,1062,507,261,diss_building2.mp4
5435,1062,544,261,diss_building2.mp4
5471,1062,563,263,diss_building2.mp4
5486,1062,566,264,diss_building2.mp4
5834,1062,597,274,diss_building2.mp4
5848,1062,624,283,diss_building2.mp4
5869,1062,660,296,diss_building2.mp4
5904,1062,698,309,diss_building2.mp4
5919,1062,704,312,diss_building2.mp4
5983,1062,700,312,diss_building2.mp4
6004,1062,688,312,diss_building2.mp4
6033,1062,660,311,diss_building2.mp4
6069,1062,595,308,diss_building2.mp4
6103,1062,541,307,diss_building2.mp4
6139,1062,509,312,diss_building2.mp4
6167,1062,503,314,diss_building2.mp4
6196,1062,503,316,diss_building2.mp4
6232,1062,504,316,diss_building2.mp4
6253,1062,507,316,diss_building2.mp4
6302,1062,508,318,diss_building2.mp4
6338,1062,504,323,diss_building2.mp4
6367,1062,486,324,diss_building2.mp4
6402,1062,460,328,diss_building2.mp4
6438,1062,431,343,diss_building2.mp4
6466,1062,415,351,diss_building2.mp4
6502,1062,409,355,diss_building2.mp4
6523,1062,408,356,diss_building2.mp4
6552,1062,408,357,diss_building2.mp4
6602,1062,422,356,diss_building2.mp4
6637,1062,456,354,diss_building2.mp4
6672,1062,507,352,diss_building2.mp4
6700,1062,556,344,diss_building2.mp4
6736,1062,598,334,diss_building2.mp4
6765,1062,609,330,diss_building2.mp4
6779,1062,610,329,diss_building2.mp4
6814,1062,610,328,diss_building2.mp4
6871,1062,602,323,diss_building2.mp4
6907,1062,572,308,diss_building2.mp4
6936,1062,549,296,diss_building2.mp4
6971,1062,527,280,diss_building2.mp4
6999,1062,516,272,diss_building2.mp4
7027,1062,514,266,diss_building2.mp4
7071,1062,520,264,diss_building2.mp4
7106,1062,535,266,diss_building2.mp4
7135,1062,576,272,diss_building2.mp4
7170,1062,640,283,diss_building2.mp4
7205,1062,691,290,diss_building2.mp4
7234,1062,707,290,diss_building2.mp4
7255,1062,710,290,diss_building2.mp4
7284,1062,711,290,diss_building2.mp4
7333,1062,708,289,diss_building2.mp4
7369,1062,695,286,diss_building2.mp4
7405,1062,679,284,diss_building2.mp4
7426,1062,673,284,diss_building2.mp4
7454,1062,671,284,diss_building2.mp4
7525,1062,672,284,diss_building2.mp4
7547,1062,692,284,diss_building2.mp4
7569,1062,753,284,diss_building2.mp4
7604,1062,928,277,diss_building2.mp4
7639,1062,1004,264,diss_building2.mp4
7660,1062,1012,262,diss_building2.mp4
8037,1062,1024,252,diss_building2.mp4
8044,1062,1030,247,diss_building2.mp4
8066,1062,1049,231,diss_building2.mp4
8102,1062,1079,217,diss_building2.mp4
8137,1062,1101,212,diss_building2.mp4
8172,1062,1118,212,diss_building2.mp4
8201,1062,1127,212,diss_building2.mp4
8236,1062,1138,213,diss_building2.mp4
8273,1062,1144,216,diss_building2.mp4
8300,1062,1148,216,diss_building2.mp4
8337,1062,1151,216,diss_building2.mp4
8371,1062,1152,216,diss_building2.mp4
8399,1062,1156,209,diss_building2.mp4
8428,1062,1160,204,diss_building2.mp4
8471,1062,1162,202,diss_building2.mp4
8869,1062,1123,195,diss_building2.mp4
8883,1062,1064,184,diss_building2.mp4
8897,1062,999,172,diss_building2.mp4
8934,1062,873,165,diss_building2.mp4
8962,1062,836,167,diss_building2.mp4
9281,1062,812,173,diss_building2.mp4
9302,1062,776,188,diss_building2.mp4
9338,1062,711,218,diss_building2.mp4
9367,1062,673,233,diss_building2.mp4
9395,1062,656,238,diss_building2.mp4
9409,1062,654,238,diss_building2.mp4
9737,1062,659,238,diss_building2.mp4
9750,1062,685,234,diss_building2.mp4
9765,1062,723,232,diss_building2.mp4
9800,1062,824,226,diss_building2.mp4
9836,1062,872,226,diss_building2.mp4
9871,1062,885,226,diss_building2.mp4
9900,1062,889,226,diss_building2.mp4
9936,1062,900,226,diss_building2.mp4
9971,1062,921,226,diss_building2.mp4
10006,1062,947,227,diss_building2.mp4
10036,1062,963,229,diss_building2.mp4
10056,1062,968,231,diss_building2.mp4
10369,1062,985,231,diss_building2.mp4
10383,1062,1010,232,diss_building2.mp4
10405,1062,1045,232,diss_building2.mp4
10433,1062,1084,233,diss_building2.mp4
10469,1062,1107,233,diss_building2.mp4
10490,1062,1112,233,diss_building2.mp4
10582,1062,1112,234,diss_building2.mp4
10646,1062,1112,235,diss_building2.mp4
10660,1062,1112,236,diss_building2.mp4
10703,1062,1111,238,diss_building2.mp4
10738,1062,1113,246,diss_building2.mp4
10767,1062,1119,259,diss_building2.mp4
10802,1062,1121,272,diss_building2.mp4
10838,1062,1121,287,diss_building2.mp4
10867,1062,1121,295,diss_building2.mp4
10881,1062,1121,297,diss_building2.mp4
10923,1062,1122,299,diss_building2.mp4
10952,1062,1122,298,diss_building2.mp4
11215,1062,1112,304,diss_building2.mp4
11236,1062,1064,333,diss_building2.mp4
11272,1062,996,384,diss_building2.mp4
11300,1062,959,419,diss_building2.mp4
11336,1062,922,458,diss_building2.mp4
11371,1062,891,476,diss_building2.mp4
11407,1062,849,489,diss_building2.mp4
11436,1062,818,493,diss_building2.mp4
11471,1062,788,493,diss_building2.mp4
11506,1062,769,496,diss_building2.mp4
11536,1062,761,496,diss_building2.mp4
11563,1062,756,496,diss_building2.mp4
11592,1062,755,496,diss_building2.mp4
11634,1062,752,496,diss_building2.mp4
11670,1062,746,491,diss_building2.mp4
11705,1062,740,483,diss_building2.mp4
11734,1062,737,477,diss_building2.mp4
11769,1062,739,470,diss_building2.mp4
11805,1062,742,456,diss_building2.mp4
11833,1062,746,445,diss_building2.mp4
11869,1062,753,434,diss_building2.mp4
11904,1062,763,424,diss_building2.mp4
11933,1062,771,412,diss_building2.mp4
11969,1062,781,401,diss_building2.mp4
12004,1062,796,392,diss_building2.mp4
12032,1062,811,380,diss_building2.mp4
12068,1062,834,363,diss_building2.mp4
12104,1062,864,347,diss_building2.mp4
12139,1062,900,331,diss_building2.mp4
12167,1062,916,322,diss_building2.mp4
12182,1062,919,319,diss_building2.mp4
12217,1062,920,318,diss_building2.mp4
12281,1062,921,318,diss_building2.mp4
12302,1062,924,318,diss_building2.mp4
12317,1062,925,318,diss_building2.mp4
12366,1062,927,316,diss_building2.mp4
12402,1062,932,302,diss_building2.mp4
12437,1062,936,288,diss_building2.mp4
12466,1062,936,280,diss_building2.mp4
12502,1062,936,275,diss_building2.mp4
12530,1062,936,274,diss_building2.mp4
12623,1062,936,273,diss_building2.mp4
12644,1062,936,272,diss_building2.mp4
12665,1062,935,265,diss_building2.mp4
12701,1062,914,244,diss_building2.mp4
12736,1062,876,224,diss_building2.mp4
12772,1062,840,212,diss_building2.mp4
12800,1062,825,208,diss_building2.mp4
12828,1062,820,208,diss_building2.mp4
12843,1062,819,208,diss_building2.mp4
13184,1062,812,209,diss_building2.mp4
13205,1062,785,220,diss_building2.mp4
13234,1062,751,234,diss_building2.mp4
13269,1062,730,244,diss_building2.mp4
13305,1062,720,250,diss_building2.mp4
13334,1062,717,252,diss_building2.mp4
13354,1062,716,252,diss_building2.mp4
13426,1062,715,252,diss_building2.mp4
13469,1062,714,252,diss_building2.mp4
13483,1062,712,253,diss_building2.mp4
13504,1062,710,253,diss_building2.mp4
13533,1062,706,253,diss_building2.mp4
13569,1062,702,254,diss_building2.mp4
13604,1062,697,254,diss_building2.mp4
13639,1062,691,254,diss_building2.mp4
13660,1062,688,254,diss_building2.mp4
13696,1062,688,255,diss_building2.mp4
13739,1062,688,256,diss_building2.mp4
13753,1062,689,256,diss_building2.mp4
13788,1062,690,256,diss_building2.mp4
13824,1062,692,255,diss_building2.mp4
13853,1062,692,254,diss_building2.mp4
13902,1062,694,252,diss_building2.mp4
13967,1062,695,252,diss_building2.mp4
14002,1062,696,252,diss_building2.mp4
14037,1062,699,252,diss_building2.mp4
14044,1062,700,252,diss_building2.mp4
14066,1062,704,251,diss_building2.mp4
14103,1062,713,249,diss_building2.mp4
14137,1062,723,248,diss_building2.mp4
14166,1062,728,247,diss_building2.mp4
14201,1062,735,244,diss_building2.mp4
14236,1062,746,244,diss_building2.mp4
14272,1062,760,242,diss_building2.mp4
14300,1062,773,241,diss_building2.mp4
14336,1062,787,241,diss_building2.mp4
14372,1062,797,239,diss_building2.mp4
14400,1062,806,237,diss_building2.mp4
14436,1062,820,234,diss_building2.mp4
14471,1062,836,231,diss_building2.mp4
14500,1062,852,232,diss_building2.mp4
14536,1062,881,238,diss_building2.mp4
14571,1062,899,242,diss_building2.mp4
14606,1062,903,243,diss_building2.mp4
14634,1062,906,243,diss_building2.mp4
14670,1062,909,243,diss_building2.mp4
14706,1062,913,243,diss_building2.mp4
14734,1062,921,241,diss_building2.mp4
14769,1062,933,239,diss_building2.mp4
14805,1062,952,236,diss_building2.mp4
14834,1062,968,236,diss_building2.mp4
14869,1062,1000,239,diss_building2.mp4
14905,1062,1032,244,diss_building2.mp4
14926,1062,1041,244,diss_building2.mp4
14947,1062,1044,244,diss_building2.mp4
15282,1062,1058,244,diss_building2.mp4
15304,1062,1084,244,diss_building2.mp4
15338,1062,1116,247,diss_building2.mp4
15367,1062,1132,248,diss_building2.mp4
15395,1062,1140,250,diss_building2.mp4
15438,1062,1141,251,diss_building2.mp4
15481,1062,1142,251,diss_building2.mp4
15502,1062,1142,252,diss_building2.mp4
15523,1062,1143,252,diss_building2.mp4
15545,1062,1144,252,diss_building2.mp4
15602,1062,1145,252,diss_building2.mp4
15637,1062,1142,244,diss_building2.mp4
15673,1062,1125,214,diss_building2.mp4
15701,1062,1113,194,diss_building2.mp4
15737,1062,1104,184,diss_building2.mp4
15772,1062,1096,176,diss_building2.mp4
15801,1062,1083,165,diss_building2.mp4
15836,1062,1059,153,diss_building2.mp4
15872,1062,1043,144,diss_building2.mp4
15900,1062,1034,138,diss_building2.mp4
15936,1062,1020,128,diss_building2.mp4
15971,1062,1011,121,diss_building2.mp4
16007,1062,996,117,diss_building2.mp4
16036,1062,978,116,diss_building2.mp4
16071,1062,961,116,diss_building2.mp4
16106,1062,940,121,diss_building2.mp4
16136,1062,923,128,diss_building2.mp4
16170,1062,908,134,diss_building2.mp4
16185,1062,906,135,diss_building2.mp4
16505,1062,885,135,diss_building2.mp4
16512,1062,879,135,diss_building2.mp4
16533,1062,855,135,diss_building2.mp4
16569,1062,816,136,diss_building2.mp4
16604,1062,792,136,diss_building2.mp4
16640,1062,776,136,diss_building2.mp4
16669,1062,764,136,diss_building2.mp4
16704,1062,748,137,diss_building2.mp4
16732,1062,735,139,diss_building2.mp4
16768,1062,721,143,diss_building2.mp4
16803,1062,706,144,diss_building2.mp4
16839,1062,688,147,diss_building2.mp4
16867,1062,678,148,diss_building2.mp4
16903,1062,667,152,diss_building2.mp4
16938,1062,644,160,diss_building2.mp4
16967,1062,625,164,diss_building2.mp4
17003,1062,604,170,diss_building2.mp4
17038,1062,591,174,diss_building2.mp4
17066,1062,584,177,diss_building2.mp4
17095,1062,580,179,diss_building2.mp4
17123,1062,578,180,diss_building2.mp4
17436,1062,564,176,diss_building2.mp4
17450,1062,551,171,diss_building2.mp4
17464,1062,538,166,diss_building2.mp4
17500,1062,509,148,diss_building2.mp4
17536,1062,490,132,diss_building2.mp4
17571,1062,485,124,diss_building2.mp4
17607,1062,485,123,diss_building2.mp4
17621,1062,488,123,diss_building2.mp4
17671,1062,510,125,diss_building2.mp4
17706,1062,552,130,diss_building2.mp4
17735,1062,589,128,diss_building2.mp4
17770,1062,630,123,diss_building2.mp4
17805,1062,672,119,diss_building2.mp4
17834,1062,714,116,diss_building2.mp4
17870,1062,759,111,diss_building2.mp4
17905,1062,786,111,diss_building2.mp4
17927,1062,793,111,diss_building2.mp4
18204,1062,800,112,diss_building2.mp4
18218,1062,826,114,diss_building2.mp4
18232,1062,851,116,diss_building2.mp4
18267,1062,920,124,diss_building2.mp4
18303,1062,976,134,diss_building2.mp4
18339,1062,1010,140,diss_building2.mp4
18367,1062,1021,141,diss_building2.mp4
18403,1062,1025,141,diss_building2.mp4
18438,1062,1028,142,diss_building2.mp4
18467,1062,1031,143,diss_building2.mp4
18503,1062,1033,144,diss_building2.mp4
18538,1062,1037,145,diss_building2.mp4
18566,1062,1041,150,diss_building2.mp4
18603,1062,1052,158,diss_building2.mp4
18637,1062,1063,168,diss_building2.mp4
18666,1062,1071,175,diss_building2.mp4
18701,1062,1075,181,diss_building2.mp4
18738,1062,1076,184,diss_building2.mp4
18773,1062,1076,185,diss_building2.mp4
0,1061,622,368,diss_truck2.mp4
21,1061,592,369,diss_truck2.mp4
35,1061,576,369,diss_truck2.mp4
56,1061,560,368,diss_truck2.mp4
78,1061,553,366,diss_truck2.mp4
85,1061,552,366,diss_truck2.mp4
113,1061,552,365,diss_truck2.mp4
184,1061,552,364,diss_truck2.mp4
205,1061,551,363,diss_truck2.mp4
241,1061,547,358,diss_truck2.mp4
277,1061,540,350,diss_truck2.mp4
305,1061,534,341,diss_truck2.mp4
341,1061,531,320,diss_truck2.mp4
377,1061,533,292,diss_truck2.mp4
405,1061,542,274,diss_truck2.mp4
441,1061,554,255,diss_truck2.mp4
476,1061,562,244,diss_truck2.mp4
504,1061,568,238,diss_truck2.mp4
541,1061,573,236,diss_truck2.mp4
575,1061,581,233,diss_truck2.mp4
611,1061,595,232,diss_truck2.mp4
639,1061,604,232,diss_truck2.mp4
668,1061,616,232,diss_truck2.mp4
704,1061,620,233,diss_truck2.mp4
725,1061,621,235,diss_truck2.mp4
775,1061,623,235,diss_truck2.mp4
796,1061,624,236,diss_truck2.mp4
838,1061,628,236,diss_truck2.mp4
875,1061,641,239,diss_truck2.mp4
910,1061,656,244,diss_truck2.mp4
938,1061,667,245,diss_truck2.mp4
975,1061,677,246,diss_truck2.mp4
1002,1061,680,246,diss_truck2.mp4
1052,1061,680,247,diss_truck2.mp4
1087,1061,680,248,diss_truck2.mp4
1174,1061,684,248,diss_truck2.mp4
1187,1061,688,248,diss_truck2.mp4
1208,1061,696,247,diss_truck2.mp4
1244,1061,708,245,diss_truck2.mp4
1272,1061,713,245,diss_truck2.mp4
1301,1061,715,245,diss_truck2.mp4
1372,1061,716,245,diss_truck2.mp4
1386,1061,717,245,diss_truck2.mp4
1408,1061,726,246,diss_truck2.mp4
1443,1061,747,249,diss_truck2.mp4
1472,1061,759,252,diss_truck2.mp4
1508,1061,765,254,diss_truck2.mp4
1521,1061,765,255,diss_truck2.mp4
1557,1061,767,255,diss_truck2.mp4
1855,1061,776,255,diss_truck2.mp4
1877,1061,812,257,diss_truck2.mp4
1905,1061,861,261,diss_truck2.mp4
1941,1061,903,268,diss_truck2.mp4
1969,1061,912,269,diss_truck2.mp4
1983,1061,913,270,diss_truck2.mp4
2026,1061,914,271,diss_truck2.mp4
2068,1061,915,272,diss_truck2.mp4
2104,1061,923,272,diss_truck2.mp4
2141,1061,945,271,diss_truck2.mp4
2175,1061,972,269,diss_truck2.mp4
2211,1061,1001,271,diss_truck2.mp4
2218,1061,1005,272,diss_truck2.mp4
2239,1061,1016,272,diss_truck2.mp4
2275,1061,1030,272,diss_truck2.mp4
2311,1061,1042,274,diss_truck2.mp4
2325,1061,1044,274,diss_truck2.mp4
2638,1061,1067,272,diss_truck2.mp4
2652,1061,1087,272,diss_truck2.mp4
2673,1061,1116,273,diss_truck2.mp4
2708,1061,1145,275,diss_truck2.mp4
2723,1061,1148,275,diss_truck2.mp4
2751,1061,1148,276,diss_truck2.mp4
2851,1061,1149,276,diss_truck2.mp4
2873,1061,1150,278,diss_truck2.mp4
2908,1061,1159,280,diss_truck2.mp4
2943,1061,1169,280,diss_truck2.mp4
2964,1061,1174,280,diss_truck2.mp4
2986,1061,1176,280,diss_truck2.mp4
3071,1061,1172,284,diss_truck2.mp4
3085,1061,1168,284,diss_truck2.mp4
3108,1061,1160,289,diss_truck2.mp4
3142,1061,1136,304,diss_truck2.mp4
3171,1061,1111,316,diss_truck2.mp4
3206,1061,1072,327,diss_truck2.mp4
3242,1061,1031,340,diss_truck2.mp4
3270,1061,996,356,diss_truck2.mp4
3306,1061,950,372,diss_truck2.mp4
3342,1061,927,377,diss_truck2.mp4
3377,1061,913,376,diss_truck2.mp4
3406,1061,908,372,diss_truck2.mp4
3442,1061,901,368,diss_truck2.mp4
3477,1061,895,361,diss_truck2.mp4
3505,1061,889,358,diss_truck2.mp4
3541,1061,877,356,diss_truck2.mp4
3576,1061,864,353,diss_truck2.mp4
3605,1061,855,350,diss_truck2.mp4
3641,1061,837,348,diss_truck2.mp4
3676,1061,820,347,diss_truck2.mp4
3705,1061,802,348,diss_truck2.mp4
3740,1061,780,352,diss_truck2.mp4
3775,1061,758,364,diss_truck2.mp4
3804,1061,736,375,diss_truck2.mp4
3840,1061,727,378,diss_truck2.mp4
4174,1061,724,379,diss_truck2.mp4
4188,1061,718,381,diss_truck2.mp4
4210,1061,708,387,diss_truck2.mp4
4238,1061,692,398,diss_truck2.mp4
4273,1061,671,411,diss_truck2.mp4
4309,1061,646,420,diss_truck2.mp4
4344,1061,628,424,diss_truck2.mp4
4373,1061,623,427,diss_truck2.mp4
4387,1061,620,428,diss_truck2.mp4
5375,1061,620,429,diss_truck2.mp4
5389,1061,618,429,diss_truck2.mp4
5404,1061,615,430,diss_truck2.mp4
5439,1061,595,429,diss_truck2.mp4
5475,1061,557,422,diss_truck2.mp4
5510,1061,504,406,diss_truck2.mp4
5539,1061,458,395,diss_truck2.mp4
5574,1061,421,391,diss_truck2.mp4
5602,1061,413,391,diss_truck2.mp4
5658,1061,413,391,diss_truck2.mp4
5909,1061,388,379,diss_truck2.mp4
5923,1061,345,363,diss_truck2.mp4
5944,1061,291,343,diss_truck2.mp4
5972,1061,254,322,diss_truck2.mp4
6008,1061,240,308,diss_truck2.mp4
6015,1061,239,308,diss_truck2.mp4
6342,1061,233,304,diss_truck2.mp4
6356,1061,218,292,diss_truck2.mp4
6370,1061,208,283,diss_truck2.mp4
6406,1061,195,268,diss_truck2.mp4
6441,1061,190,261,diss_truck2.mp4
6463,1061,190,260,diss_truck2.mp4
6569,1061,190,259,diss_truck2.mp4
6605,1061,189,258,diss_truck2.mp4
6620,1061,189,256,diss_truck2.mp4
6641,1061,188,248,diss_truck2.mp4
6677,1061,187,230,diss_truck2.mp4
6705,1061,185,215,diss_truck2.mp4
6726,1061,186,208,diss_truck2.mp4
6776,1061,188,205,diss_truck2.mp4
6805,1061,195,205,diss_truck2.mp4
6840,1061,219,211,diss_truck2.mp4
6876,1061,257,215,diss_truck2.mp4
6905,1061,300,215,diss_truck2.mp4
6941,1061,347,212,diss_truck2.mp4
6975,1061,387,209,diss_truck2.mp4
7011,1061,404,209,diss_truck2.mp4
7039,1061,405,209,diss_truck2.mp4
7375,1061,431,209,diss_truck2.mp4
7388,1061,453,210,diss_truck2.mp4
7409,1061,493,211,diss_truck2.mp4
7445,1061,545,215,diss_truck2.mp4
7473,1061,568,217,diss_truck2.mp4
7509,1061,575,219,diss_truck2.mp4
7885,1061,595,221,diss_truck2.mp4
7908,1061,630,224,diss_truck2.mp4
7943,1061,673,226,diss_truck2.mp4
7971,1061,688,228,diss_truck2.mp4
8006,1061,696,228,diss_truck2.mp4
8028,1061,697,228,diss_truck2.mp4
8383,1061,704,228,diss_truck2.mp4
8405,1061,732,226,diss_truck2.mp4
8440,1061,780,225,diss_truck2.mp4
8476,1061,809,225,diss_truck2.mp4
8504,1061,819,225,diss_truck2.mp4
8540,1061,823,225,diss_truck2.mp4
8853,1061,829,224,diss_truck2.mp4
8875,1061,860,221,diss_truck2.mp4
8910,1061,912,214,diss_truck2.mp4
8938,1061,949,212,diss_truck2.mp4
8975,1061,972,212,diss_truck2.mp4
9009,1061,980,215,diss_truck2.mp4
9308,1061,1013,218,diss_truck2.mp4
9322,1061,1040,221,diss_truck2.mp4
9344,1061,1075,227,diss_truck2.mp4
9372,1061,1112,234,diss_truck2.mp4
9408,1061,1134,240,diss_truck2.mp4
9436,1061,1138,242,diss_truck2.mp4
9451,1061,1139,242,diss_truck2.mp4
9784,1061,1128,251,diss_truck2.mp4
9806,1061,1103,266,diss_truck2.mp4
9841,1061,1049,287,diss_truck2.mp4
9877,1061,1003,304,diss_truck2.mp4
9905,1061,981,312,diss_truck2.mp4
9926,1061,978,313,diss_truck2.mp4
10240,1061,946,299,diss_truck2.mp4
10254,1061,909,284,diss_truck2.mp4
10275,1061,868,268,diss_truck2.mp4
10311,1061,832,259,diss_truck2.mp4
10339,1061,829,258,diss_truck2.mp4
10624,1061,804,256,diss_truck2.mp4
10645,1061,756,252,diss_truck2.mp4
10674,1061,704,247,diss_truck2.mp4
10709,1061,685,246,diss_truck2.mp4
10716,1061,684,246,diss_truck2.mp4
11008,1061,661,248,diss_truck2.mp4
11022,1061,628,251,diss_truck2.mp4
11043,1061,575,261,diss_truck2.mp4
11072,1061,501,281,diss_truck2.mp4
11108,1061,444,298,diss_truck2.mp4
11136,1061,429,301,diss_truck2.mp4
11150,1061,428,301,diss_truck2.mp4
11207,1061,428,300,diss_truck2.mp4
11235,1061,430,300,diss_truck2.mp4
11299,1061,431,300,diss_truck2.mp4
11320,1061,431,301,diss_truck2.mp4
11342,1061,431,307,diss_truck2.mp4
11371,1061,429,316,diss_truck2.mp4
11406,1061,425,338,diss_truck2.mp4
11442,1061,424,356,diss_truck2.mp4
11477,1061,424,364,diss_truck2.mp4
11505,1061,425,366,diss_truck2.mp4
11542,1061,428,370,diss_truck2.mp4
11577,1061,432,375,diss_truck2.mp4
11598,1061,434,380,diss_truck2.mp4
11642,1061,442,392,diss_truck2.mp4
11677,1061,448,405,diss_truck2.mp4
11705,1061,448,414,diss_truck2.mp4
11740,1061,448,419,diss_truck2.mp4
11776,1061,424,427,diss_truck2.mp4
11811,1061,380,428,diss_truck2.mp4
11840,1061,350,428,diss_truck2.mp4
11875,1061,327,427,diss_truck2.mp4
11911,1061,301,422,diss_truck2.mp4
11939,1061,286,417,diss_truck2.mp4
11975,1061,272,412,diss_truck2.mp4
12011,1061,260,400,diss_truck2.mp4
12039,1061,253,387,diss_truck2.mp4
12075,1061,250,377,diss_truck2.mp4
12110,1061,250,368,diss_truck2.mp4
12138,1061,251,360,diss_truck2.mp4
12175,1061,250,346,diss_truck2.mp4
12210,1061,244,334,diss_truck2.mp4
12238,1061,235,329,diss_truck2.mp4
12275,1061,228,331,diss_truck2.mp4
12309,1061,225,340,diss_truck2.mp4
12345,1061,223,347,diss_truck2.mp4
12374,1061,219,352,diss_truck2.mp4
12409,1061,204,368,diss_truck2.mp4
12444,1061,188,388,diss_truck2.mp4
12473,1061,180,399,diss_truck2.mp4
12508,1061,176,411,diss_truck2.mp4
12544,1061,171,424,diss_truck2.mp4
12573,1061,168,435,diss_truck2.mp4
12608,1061,167,460,diss_truck2.mp4
12644,1061,167,489,diss_truck2.mp4
12672,1061,167,504,diss_truck2.mp4
12709,1061,167,510,diss_truck2.mp4
12743,1061,167,512,diss_truck2.mp4
12765,1061,166,512,diss_truck2.mp4
13142,1061,186,512,diss_truck2.mp4
13155,1061,209,512,diss_truck2.mp4
13177,1061,250,510,diss_truck2.mp4
13205,1061,294,506,diss_truck2.mp4
13242,1061,319,498,diss_truck2.mp4
13277,1061,345,484,diss_truck2.mp4
13305,1061,377,471,diss_truck2.mp4
13342,1061,419,460,diss_truck2.mp4
13376,1061,468,449,diss_truck2.mp4
13411,1061,501,444,diss_truck2.mp4
13440,1061,512,444,diss_truck2.mp4
13468,1061,515,444,diss_truck2.mp4
13532,1061,516,444,diss_truck2.mp4
13568,1061,517,444,diss_truck2.mp4
13582,1061,520,443,diss_truck2.mp4
13604,1061,526,440,diss_truck2.mp4
13639,1061,541,439,diss_truck2.mp4
13675,1061,552,437,diss_truck2.mp4
13710,1061,560,436,diss_truck2.mp4
13739,1061,568,434,diss_truck2.mp4
13775,1061,580,432,diss_truck2.mp4
13810,1061,596,428,diss_truck2.mp4
13845,1061,606,426,diss_truck2.mp4
13867,1061,609,425,diss_truck2.mp4
13895,1061,611,425,diss_truck2.mp4
13945,1061,612,428,diss_truck2.mp4
13974,1061,616,431,diss_truck2.mp4
14009,1061,623,439,diss_truck2.mp4
14045,1061,626,444,diss_truck2.mp4
14073,1061,628,447,diss_truck2.mp4
14108,1061,628,451,diss_truck2.mp4
14145,1061,626,455,diss_truck2.mp4
14542,1061,636,454,diss_truck2.mp4
14557,1061,644,453,diss_truck2.mp4
14571,1061,650,452,diss_truck2.mp4
14606,1061,661,448,diss_truck2.mp4
14642,1061,668,444,diss_truck2.mp4
14670,1061,672,444,diss_truck2.mp4
14699,1061,672,443,diss_truck2.mp4
14742,1061,674,441,diss_truck2.mp4
14777,1061,674,427,diss_truck2.mp4
14805,1061,668,408,diss_truck2.mp4
14842,1061,659,376,diss_truck2.mp4
14877,1061,652,356,diss_truck2.mp4
14912,1061,644,346,diss_truck2.mp4
14942,1061,637,340,diss_truck2.mp4
14977,1061,629,336,diss_truck2.mp4
15005,1061,622,332,diss_truck2.mp4
15042,1061,605,325,diss_truck2.mp4
15076,1061,587,318,diss_truck2.mp4
15111,1061,569,315,diss_truck2.mp4
15140,1061,557,314,diss_truck2.mp4
15175,1061,550,314,diss_truck2.mp4
15182,1061,549,314,diss_truck2.mp4
15218,1061,548,314,diss_truck2.mp4
15310,1061,553,312,diss_truck2.mp4
15317,1061,556,311,diss_truck2.mp4
15332,1061,560,310,diss_truck2.mp4
15375,1061,595,306,diss_truck2.mp4
15410,1061,646,303,diss_truck2.mp4
15439,1061,689,303,diss_truck2.mp4
15475,1061,734,306,diss_truck2.mp4
15510,1061,768,310,diss_truck2.mp4
15545,1061,789,314,diss_truck2.mp4
15573,1061,800,316,diss_truck2.mp4
15609,1061,808,317,diss_truck2.mp4
15616,1061,809,317,diss_truck2.mp4
15908,1061,825,314,diss_truck2.mp4
15922,1061,848,309,diss_truck2.mp4
15944,1061,885,302,diss_truck2.mp4
15972,1061,935,291,diss_truck2.mp4
16008,1061,978,280,diss_truck2.mp4
16043,1061,1001,271,diss_truck2.mp4
16072,1061,1015,266,diss_truck2.mp4
16107,1061,1033,260,diss_truck2.mp4
16143,1061,1054,252,diss_truck2.mp4
16178,1061,1080,246,diss_truck2.mp4
16207,1061,1093,244,diss_truck2.mp4
16242,1061,1103,244,diss_truck2.mp4
16270,1061,1110,244,diss_truck2.mp4
16299,1061,1116,244,diss_truck2.mp4
16342,1061,1123,244,diss_truck2.mp4
16370,1061,1128,244,diss_truck2.mp4
16406,1061,1136,244,diss_truck2.mp4
16442,1061,1144,244,diss_truck2.mp4
16477,1061,1151,243,diss_truck2.mp4
16505,1061,1159,244,diss_truck2.mp4
16548,1061,1168,250,diss_truck2.mp4
16577,1061,1173,258,diss_truck2.mp4
16604,1061,1175,270,diss_truck2.mp4
16640,1061,1168,298,diss_truck2.mp4
16676,1061,1160,325,diss_truck2.mp4
16712,1061,1156,341,diss_truck2.mp4
16740,1061,1152,352,diss_truck2.mp4
16776,1061,1143,362,diss_truck2.mp4
16804,1061,1136,366,diss_truck2.mp4
16840,1061,1123,372,diss_truck2.mp4
16875,1061,1098,378,diss_truck2.mp4
16911,1061,1078,383,diss_truck2.mp4
16939,1061,1060,388,diss_truck2.mp4
16975,1061,1040,397,diss_truck2.mp4
17011,1061,1027,404,diss_truck2.mp4
17039,1061,1016,409,diss_truck2.mp4
17075,1061,1009,412,diss_truck2.mp4
17110,1061,1002,415,diss_truck2.mp4
17138,1061,994,418,diss_truck2.mp4
17175,1061,980,419,diss_truck2.mp4
17210,1061,970,420,diss_truck2.mp4
17245,1061,958,423,diss_truck2.mp4
17273,1061,947,427,diss_truck2.mp4
17309,1061,932,431,diss_truck2.mp4
17345,1061,912,438,diss_truck2.mp4
17373,1061,891,447,diss_truck2.mp4
17409,1061,853,464,diss_truck2.mp4
17444,1061,812,480,diss_truck2.mp4
17473,1061,779,494,diss_truck2.mp4
17509,1061,752,502,diss_truck2.mp4
17544,1061,737,504,diss_truck2.mp4
17565,1061,732,504,diss_truck2.mp4
17608,1061,727,505,diss_truck2.mp4
17643,1061,722,505,diss_truck2.mp4
17672,1061,712,505,diss_truck2.mp4
17707,1061,700,505,diss_truck2.mp4
17743,1061,690,506,diss_truck2.mp4
17778,1061,684,507,diss_truck2.mp4
17807,1061,681,508,diss_truck2.mp4
17821,1061,680,508,diss_truck2.mp4
18170,1061,663,506,diss_truck2.mp4
18184,1061,643,504,diss_truck2.mp4
18205,1061,616,502,diss_truck2.mp4
18242,1061,589,497,diss_truck2.mp4
18276,1061,576,496,diss_truck2.mp4
18305,1061,568,495,diss_truck2.mp4
18326,1061,565,494,diss_truck2.mp4
18618,1061,557,492,diss_truck2.mp4
18639,1061,528,486,diss_truck2.mp4
18676,1061,477,476,diss_truck2.mp4
18710,1061,428,468,diss_truck2.mp4
18738,1061,411,464,diss_truck2.mp4
18767,1061,407,463,diss_truck2.mp4
18795,1061,406,462,diss_truck2.mp4
18838,1061,406,461,diss_truck2.mp4
19151,1061,408,460,diss_truck2.mp4
19173,1061,415,449,diss_truck2.mp4
19209,1061,438,421,diss_truck2.mp4
19244,1061,471,390,diss_truck2.mp4
19272,1061,492,374,diss_truck2.mp4
19309,1061,511,365,diss_truck2.mp4
19344,1061,525,361,diss_truck2.mp4
19372,1061,534,360,diss_truck2.mp4
19400,1061,540,360,diss_truck2.mp4
19443,1061,544,360,diss_truck2.mp4
0,1060,630,372,diss_person22.mp4
14,1060,619,370,diss_person22.mp4
28,1060,610,368,diss_person22.mp4
50,1060,599,367,diss_person22.mp4
71,1060,592,367,diss_person22.mp4
87,1060,591,367,diss_person22.mp4
107,1060,591,368,diss_person22.mp4
171,1060,592,372,diss_person22.mp4
207,1060,600,380,diss_person22.mp4
234,1060,605,388,diss_person22.mp4
270,1060,618,398,diss_person22.mp4
306,1060,626,403,diss_person22.mp4
327,1060,629,404,diss_person22.mp4
356,1060,631,404,diss_person22.mp4
434,1060,632,401,diss_person22.mp4
448,1060,632,400,diss_person22.mp4
506,1060,635,398,diss_person22.mp4
512,1060,637,398,diss_person22.mp4
534,1060,652,391,diss_person22.mp4
570,1060,700,367,diss_person22.mp4
605,1060,732,352,diss_person22.mp4
633,1060,741,348,diss_person22.mp4
648,1060,744,348,diss_person22.mp4
754,1060,744,349,diss_person22.mp4
776,1060,744,350,diss_person22.mp4
797,1060,743,350,diss_person22.mp4
833,1060,741,352,diss_person22.mp4
854,1060,740,352,diss_person22.mp4
904,1060,739,352,diss_person22.mp4
939,1060,739,353,diss_person22.mp4
975,1060,739,354,diss_person22.mp4
1330,1060,740,354,diss_person22.mp4
1352,1060,741,353,diss_person22.mp4
1359,1060,743,353,diss_person22.mp4
1402,1060,744,353,diss_person22.mp4
1430,1060,747,353,diss_person22.mp4
1473,1060,756,356,diss_person22.mp4
1502,1060,763,358,diss_person22.mp4
1537,1060,772,360,diss_person22.mp4
1572,1060,778,360,diss_person22.mp4
1579,1060,780,359,diss_person22.mp4
1615,1060,780,358,diss_person22.mp4
2049,1060,784,357,diss_person22.mp4
2070,1060,792,356,diss_person22.mp4
2106,1060,804,354,diss_person22.mp4
2134,1060,811,352,diss_person22.mp4
2170,1060,822,349,diss_person22.mp4
2206,1060,842,349,diss_person22.mp4
2234,1060,860,352,diss_person22.mp4
2270,1060,875,353,diss_person22.mp4
2305,1060,883,355,diss_person22.mp4
2333,1060,888,356,diss_person22.mp4
2369,1060,892,356,diss_person22.mp4
2404,1060,896,357,diss_person22.mp4
2433,1060,897,358,diss_person22.mp4
2781,1060,906,363,diss_person22.mp4
2804,1060,920,369,diss_person22.mp4
2839,1060,932,376,diss_person22.mp4
2867,1060,935,377,diss_person22.mp4
2888,1060,936,379,diss_person22.mp4
2917,1060,936,380,diss_person22.mp4
2974,1060,936,381,diss_person22.mp4
3002,1060,912,380,diss_person22.mp4
3037,1060,834,383,diss_person22.mp4
3074,1060,717,402,diss_person22.mp4
3102,1060,644,413,diss_person22.mp4
3137,1060,596,419,diss_person22.mp4
3173,1060,582,418,diss_person22.mp4
3180,1060,582,417,diss_person22.mp4
3649,1060,583,417,diss_person22.mp4
3671,1060,594,424,diss_person22.mp4
3706,1060,620,432,diss_person22.mp4
3735,1060,640,438,diss_person22.mp4
3770,1060,657,440,diss_person22.mp4
3806,1060,665,440,diss_person22.mp4
3821,1060,668,440,diss_person22.mp4
3856,1060,669,440,diss_person22.mp4
4169,1060,649,442,diss_person22.mp4
4183,1060,618,445,diss_person22.mp4
4204,1060,536,460,diss_person22.mp4
4233,1060,448,476,diss_person22.mp4
4269,1060,400,484,diss_person22.mp4
4304,1060,385,489,diss_person22.mp4
4339,1060,381,492,diss_person22.mp4
4368,1060,377,496,diss_person22.mp4
4404,1060,369,507,diss_person22.mp4
4439,1060,359,520,diss_person22.mp4
4468,1060,347,537,diss_person22.mp4
4504,1060,333,556,diss_person22.mp4
4539,1060,321,572,diss_person22.mp4
4574,1060,311,582,diss_person22.mp4
4602,1060,309,585,diss_person22.mp4
4631,1060,308,586,diss_person22.mp4
4745,1060,309,586,diss_person22.mp4
4866,1060,307,586,diss_person22.mp4
4880,1060,299,579,diss_person22.mp4
4901,1060,276,559,diss_person22.mp4
4937,1060,224,499,diss_person22.mp4
4973,1060,197,455,diss_person22.mp4
5001,1060,193,446,diss_person22.mp4
5470,1060,193,431,diss_person22.mp4
5484,1060,193,412,diss_person22.mp4
5499,1060,192,401,diss_person22.mp4
5534,1060,189,388,diss_person22.mp4
5571,1060,185,385,diss_person22.mp4
5606,1060,182,380,diss_person22.mp4
5634,1060,180,370,diss_person22.mp4
5670,1060,180,352,diss_person22.mp4
5705,1060,194,334,diss_person22.mp4
5734,1060,230,321,diss_person22.mp4
5769,1060,304,313,diss_person22.mp4
5805,1060,375,308,diss_person22.mp4
5833,1060,413,308,diss_person22.mp4
5869,1060,436,312,diss_person22.mp4
5883,1060,440,312,diss_person22.mp4
5919,1060,440,311,diss_person22.mp4
5954,1060,440,310,diss_person22.mp4
6004,1060,440,309,diss_person22.mp4
6039,1060,439,308,diss_person22.mp4
6068,1060,426,305,diss_person22.mp4
6104,1060,383,304,diss_person22.mp4
0,1059,648,380,diss_Soccer1.mp4
15,1059,640,375,diss_Soccer1.mp4
29,1059,634,366,diss_Soccer1.mp4
50,1059,625,358,diss_Soccer1.mp4
71,1059,614,348,diss_Soccer1.mp4
100,1059,594,332,diss_Soccer1.mp4
137,1059,576,316,diss_Soccer1.mp4
172,1059,572,311,diss_Soccer1.mp4
178,1059,572,310,diss_Soccer1.mp4
235,1059,574,310,diss_Soccer1.mp4
257,1059,576,310,diss_Soccer1.mp4
307,1059,580,310,diss_Soccer1.mp4
335,1059,581,310,diss_Soccer1.mp4
370,1059,585,308,diss_Soccer1.mp4
406,1059,592,302,diss_Soccer1.mp4
434,1059,602,291,diss_Soccer1.mp4
470,1059,611,277,diss_Soccer1.mp4
506,1059,618,269,diss_Soccer1.mp4
534,1059,624,264,diss_Soccer1.mp4
570,1059,633,260,diss_Soccer1.mp4
606,1059,644,256,diss_Soccer1.mp4
634,1059,656,256,diss_Soccer1.mp4
670,1059,668,257,diss_Soccer1.mp4
705,1059,676,256,diss_Soccer1.mp4
733,1059,684,255,diss_Soccer1.mp4
770,1059,696,251,diss_Soccer1.mp4
805,1059,713,248,diss_Soccer1.mp4
840,1059,732,249,diss_Soccer1.mp4
869,1059,747,255,diss_Soccer1.mp4
904,1059,760,260,diss_Soccer1.mp4
940,1059,764,262,diss_Soccer1.mp4
968,1059,770,264,diss_Soccer1.mp4
1004,1059,783,267,diss_Soccer1.mp4
1032,1059,797,270,diss_Soccer1.mp4
1067,1059,811,273,diss_Soccer1.mp4
1103,1059,820,275,diss_Soccer1.mp4
1139,1059,822,276,diss_Soccer1.mp4
1516,1059,812,273,diss_Soccer1.mp4
1537,1059,761,256,diss_Soccer1.mp4
1573,1059,698,233,diss_Soccer1.mp4
1601,1059,663,221,diss_Soccer1.mp4
1637,1059,636,212,diss_Soccer1.mp4
1665,1059,629,208,diss_Soccer1.mp4
1694,1059,628,207,diss_Soccer1.mp4
2000,1059,622,204,diss_Soccer1.mp4
2014,1059,601,196,diss_Soccer1.mp4
2035,1059,570,183,diss_Soccer1.mp4
2071,1059,543,172,diss_Soccer1.mp4
2099,1059,525,167,diss_Soccer1.mp4
2135,1059,508,164,diss_Soccer1.mp4
2170,1059,496,166,diss_Soccer1.mp4
2206,1059,487,168,diss_Soccer1.mp4
2235,1059,481,170,diss_Soccer1.mp4
2270,1059,476,176,diss_Soccer1.mp4
2305,1059,464,182,diss_Soccer1.mp4
2335,1059,456,185,diss_Soccer1.mp4
2371,1059,448,188,diss_Soccer1.mp4
2405,1059,440,192,diss_Soccer1.mp4
2433,1059,436,193,diss_Soccer1.mp4
2471,1059,431,197,diss_Soccer1.mp4
2505,1059,425,206,diss_Soccer1.mp4
2533,1059,420,213,diss_Soccer1.mp4
2569,1059,408,230,diss_Soccer1.mp4
2605,1059,395,260,diss_Soccer1.mp4
2640,1059,384,280,diss_Soccer1.mp4
2668,1059,379,289,diss_Soccer1.mp4
2704,1059,376,300,diss_Soccer1.mp4
2739,1059,372,311,diss_Soccer1.mp4
2768,1059,366,328,diss_Soccer1.mp4
2804,1059,357,354,diss_Soccer1.mp4
2839,1059,350,377,diss_Soccer1.mp4
2867,1059,345,390,diss_Soccer1.mp4
2904,1059,343,401,diss_Soccer1.mp4
2917,1059,342,403,diss_Soccer1.mp4
2960,1059,342,404,diss_Soccer1.mp4
3053,1059,343,404,diss_Soccer1.mp4
3074,1059,343,405,diss_Soccer1.mp4
3102,1059,346,408,diss_Soccer1.mp4
3138,1059,366,414,diss_Soccer1.mp4
3166,1059,392,423,diss_Soccer1.mp4
3202,1059,445,442,diss_Soccer1.mp4
3238,1059,486,460,diss_Soccer1.mp4
3273,1059,500,470,diss_Soccer1.mp4
3301,1059,507,474,diss_Soccer1.mp4
3337,1059,516,480,diss_Soccer1.mp4
3373,1059,533,487,diss_Soccer1.mp4
3387,1059,537,488,diss_Soccer1.mp4
3700,1059,566,494,diss_Soccer1.mp4
3714,1059,588,500,diss_Soccer1.mp4
3736,1059,614,504,diss_Soccer1.mp4
3771,1059,629,505,diss_Soccer1.mp4
3799,1059,631,504,diss_Soccer1.mp4
3835,1059,633,492,diss_Soccer1.mp4
3870,1059,640,472,diss_Soccer1.mp4
3906,1059,644,455,diss_Soccer1.mp4
3935,1059,646,446,diss_Soccer1.mp4
3963,1059,648,441,diss_Soccer1.mp4
4006,1059,648,439,diss_Soccer1.mp4
4042,1059,648,438,diss_Soccer1.mp4
4070,1059,647,438,diss_Soccer1.mp4
4106,1059,636,436,diss_Soccer1.mp4
4134,1059,625,434,diss_Soccer1.mp4
4170,1059,608,429,diss_Soccer1.mp4
4205,1059,600,428,diss_Soccer1.mp4
4234,1059,598,428,diss_Soccer1.mp4
4270,1059,593,428,diss_Soccer1.mp4
4298,1059,588,429,diss_Soccer1.mp4
4333,1059,584,432,diss_Soccer1.mp4
4369,1059,579,435,diss_Soccer1.mp4
4397,1059,576,437,diss_Soccer1.mp4
4440,1059,575,437,diss_Soccer1.mp4
4468,1059,575,436,diss_Soccer1.mp4
4504,1059,570,432,diss_Soccer1.mp4
4540,1059,556,424,diss_Soccer1.mp4
4568,1059,549,421,diss_Soccer1.mp4
4575,1059,548,420,diss_Soccer1.mp4
4781,1059,546,421,diss_Soccer1.mp4
4804,1059,540,423,diss_Soccer1.mp4
4839,1059,527,423,diss_Soccer1.mp4
4867,1059,515,422,diss_Soccer1.mp4
4903,1059,492,420,diss_Soccer1.mp4
4938,1059,465,416,diss_Soccer1.mp4
4973,1059,454,412,diss_Soccer1.mp4
5038,1059,456,412,diss_Soccer1.mp4
5052,1059,457,412,diss_Soccer1.mp4
5059,1059,458,412,diss_Soccer1.mp4
5087,1059,460,414,diss_Soccer1.mp4
5138,1059,461,415,diss_Soccer1.mp4
5180,1059,461,416,diss_Soccer1.mp4
5201,1059,460,416,diss_Soccer1.mp4
5237,1059,452,411,diss_Soccer1.mp4
5258,1059,449,411,diss_Soccer1.mp4
5301,1059,448,413,diss_Soccer1.mp4
5329,1059,449,416,diss_Soccer1.mp4
5400,1059,448,416,diss_Soccer1.mp4
5415,1059,444,416,diss_Soccer1.mp4
5437,1059,441,416,diss_Soccer1.mp4
5472,1059,439,415,diss_Soccer1.mp4
5884,1059,423,415,diss_Soccer1.mp4
5905,1059,394,417,diss_Soccer1.mp4
5934,1059,356,424,diss_Soccer1.mp4
5971,1059,322,432,diss_Soccer1.mp4
6005,1059,306,436,diss_Soccer1.mp4
6027,1059,300,440,diss_Soccer1.mp4
6069,1059,294,444,diss_Soccer1.mp4
6098,1059,292,446,diss_Soccer1.mp4
6140,1059,288,453,diss_Soccer1.mp4
6169,1059,283,460,diss_Soccer1.mp4
6204,1059,276,472,diss_Soccer1.mp4
6240,1059,268,492,diss_Soccer1.mp4
6268,1059,263,501,diss_Soccer1.mp4
6297,1059,260,504,diss_Soccer1.mp4
6325,1059,256,504,diss_Soccer1.mp4
6369,1059,253,502,diss_Soccer1.mp4
6389,1059,252,500,diss_Soccer1.mp4
6453,1059,251,500,diss_Soccer1.mp4
6503,1059,250,500,diss_Soccer1.mp4
6581,1059,249,500,diss_Soccer1.mp4
6603,1059,248,501,diss_Soccer1.mp4
6624,1059,246,503,diss_Soccer1.mp4
6653,1059,245,503,diss_Soccer1.mp4
7037,1059,243,503,diss_Soccer1.mp4
7051,1059,240,503,diss_Soccer1.mp4
7065,1059,236,502,diss_Soccer1.mp4
7101,1059,223,501,diss_Soccer1.mp4
7137,1059,212,501,diss_Soccer1.mp4
7172,1059,195,501,diss_Soccer1.mp4
7200,1059,179,501,diss_Soccer1.mp4
7237,1059,168,501,diss_Soccer1.mp4
7272,1059,165,501,diss_Soccer1.mp4
7300,1059,163,501,diss_Soccer1.mp4
7314,1059,162,501,diss_Soccer1.mp4
7364,1059,160,502,diss_Soccer1.mp4
7400,1059,153,501,diss_Soccer1.mp4
7435,1059,146,500,diss_Soccer1.mp4
7471,1059,134,500,diss_Soccer1.mp4
7492,1059,128,500,diss_Soccer1.mp4
8004,1059,130,500,diss_Soccer1.mp4
8019,1059,136,499,diss_Soccer1.mp4
8033,1059,144,498,diss_Soccer1.mp4
8069,1059,165,493,diss_Soccer1.mp4
8104,1059,196,486,diss_Soccer1.mp4
8140,1059,225,480,diss_Soccer1.mp4
8168,1059,246,478,diss_Soccer1.mp4
8204,1059,260,478,diss_Soccer1.mp4
8232,1059,265,477,diss_Soccer1.mp4
8246,1059,266,477,diss_Soccer1.mp4
8317,1059,266,476,diss_Soccer1.mp4
8368,1059,269,472,diss_Soccer1.mp4
8382,1059,278,468,diss_Soccer1.mp4
8404,1059,296,460,diss_Soccer1.mp4
8439,1059,320,448,diss_Soccer1.mp4
8467,1059,325,444,diss_Soccer1.mp4
8488,1059,326,442,diss_Soccer1.mp4
8538,1059,324,440,diss_Soccer1.mp4
8574,1059,321,440,diss_Soccer1.mp4
8602,1059,315,440,diss_Soccer1.mp4
8638,1059,309,440,diss_Soccer1.mp4
8659,1059,307,441,diss_Soccer1.mp4
8701,1059,305,441,diss_Soccer1.mp4
8730,1059,305,437,diss_Soccer1.mp4
8773,1059,307,433,diss_Soccer1.mp4
8801,1059,313,431,diss_Soccer1.mp4
8837,1059,320,427,diss_Soccer1.mp4
8873,1059,333,423,diss_Soccer1.mp4
8901,1059,355,414,diss_Soccer1.mp4
8937,1059,383,401,diss_Soccer1.mp4
8972,1059,397,395,diss_Soccer1.mp4
9001,1059,404,392,diss_Soccer1.mp4
9037,1059,410,392,diss_Soccer1.mp4
9072,1059,419,396,diss_Soccer1.mp4
9100,1059,426,400,diss_Soccer1.mp4
9137,1059,433,402,diss_Soccer1.mp4
9171,1059,435,404,diss_Soccer1.mp4
9207,1059,435,409,diss_Soccer1.mp4
9235,1059,428,418,diss_Soccer1.mp4
9271,1059,418,431,diss_Soccer1.mp4
9299,1059,412,437,diss_Soccer1.mp4
9335,1059,400,446,diss_Soccer1.mp4
9371,1059,389,452,diss_Soccer1.mp4
9406,1059,384,453,diss_Soccer1.mp4
9684,1059,380,453,diss_Soccer1.mp4
9705,1059,376,453,diss_Soccer1.mp4
9733,1059,372,456,diss_Soccer1.mp4
9769,1059,367,458,diss_Soccer1.mp4
9805,1059,359,472,diss_Soccer1.mp4
9833,1059,350,480,diss_Soccer1.mp4
9861,1059,344,484,diss_Soccer1.mp4
9905,1059,344,485,diss_Soccer1.mp4
9919,1059,343,485,diss_Soccer1.mp4
10602,1059,344,485,diss_Soccer1.mp4
10616,1059,347,483,diss_Soccer1.mp4
10637,1059,356,480,diss_Soccer1.mp4
10673,1059,375,475,diss_Soccer1.mp4
10701,1059,400,469,diss_Soccer1.mp4
10738,1059,442,457,diss_Soccer1.mp4
10772,1059,484,447,diss_Soccer1.mp4
10801,1059,519,440,diss_Soccer1.mp4
10837,1059,549,436,diss_Soccer1.mp4
10872,1059,566,434,diss_Soccer1.mp4
10900,1059,570,434,diss_Soccer1.mp4
10922,1059,571,434,diss_Soccer1.mp4
11021,1059,571,435,diss_Soccer1.mp4
11100,1059,571,436,diss_Soccer1.mp4
11114,1059,574,439,diss_Soccer1.mp4
11135,1059,581,440,diss_Soccer1.mp4
11171,1059,602,448,diss_Soccer1.mp4
11199,1059,622,452,diss_Soccer1.mp4
11235,1059,630,455,diss_Soccer1.mp4
11256,1059,631,455,diss_Soccer1.mp4
11783,1059,636,455,diss_Soccer1.mp4
11804,1059,660,449,diss_Soccer1.mp4
11840,1059,694,446,diss_Soccer1.mp4
11868,1059,706,444,diss_Soccer1.mp4
11882,1059,708,444,diss_Soccer1.mp4
11911,1059,709,444,diss_Soccer1.mp4
11981,1059,708,443,diss_Soccer1.mp4
12004,1059,701,433,diss_Soccer1.mp4
12039,1059,675,393,diss_Soccer1.mp4
12067,1059,648,353,diss_Soccer1.mp4
12104,1059,622,304,diss_Soccer1.mp4
12138,1059,608,282,diss_Soccer1.mp4
12145,1059,608,280,diss_Soccer1.mp4
12501,1059,589,280,diss_Soccer1.mp4
12515,1059,574,284,diss_Soccer1.mp4
12537,1059,548,293,diss_Soccer1.mp4
12572,1059,512,312,diss_Soccer1.mp4
12601,1059,490,323,diss_Soccer1.mp4
12637,1059,472,328,diss_Soccer1.mp4
12672,1059,464,327,diss_Soccer1.mp4
12693,1059,462,326,diss_Soccer1.mp4
12729,1059,460,325,diss_Soccer1.mp4
12757,1059,460,324,diss_Soccer1.mp4
12800,1059,460,322,diss_Soccer1.mp4
12836,1059,461,321,diss_Soccer1.mp4
12900,1059,460,321,diss_Soccer1.mp4
12914,1059,459,321,diss_Soccer1.mp4
12935,1059,449,321,diss_Soccer1.mp4
12971,1059,431,317,diss_Soccer1.mp4
13006,1059,415,313,diss_Soccer1.mp4
13035,1059,403,312,diss_Soccer1.mp4
13071,1059,394,308,diss_Soccer1.mp4
13099,1059,392,308,diss_Soccer1.mp4
13739,1059,449,304,diss_Soccer1.mp4
13747,1059,478,301,diss_Soccer1.mp4
13768,1059,556,289,diss_Soccer1.mp4
13804,1059,627,273,diss_Soccer1.mp4
13839,1059,645,268,diss_Soccer1.mp4
13867,1059,650,268,diss_Soccer1.mp4
14166,1059,672,267,diss_Soccer1.mp4
14180,1059,700,264,diss_Soccer1.mp4
14201,1059,745,258,diss_Soccer1.mp4
14237,1059,809,252,diss_Soccer1.mp4
14273,1059,836,249,diss_Soccer1.mp4
14294,1059,839,248,diss_Soccer1.mp4
14372,1059,839,247,diss_Soccer1.mp4
14415,1059,839,246,diss_Soccer1.mp4
14443,1059,838,246,diss_Soccer1.mp4
14500,1059,835,244,diss_Soccer1.mp4
14521,1059,834,242,diss_Soccer1.mp4
14799,1059,852,245,diss_Soccer1.mp4
14813,1059,880,252,diss_Soccer1.mp4
14835,1059,939,261,diss_Soccer1.mp4
14871,1059,1036,280,diss_Soccer1.mp4
14906,1059,1084,293,diss_Soccer1.mp4
14934,1059,1097,299,diss_Soccer1.mp4
14971,1059,1104,304,diss_Soccer1.mp4
15006,1059,1107,307,diss_Soccer1.mp4
15034,1059,1109,311,diss_Soccer1.mp4
15069,1059,1114,320,diss_Soccer1.mp4
15105,1059,1117,324,diss_Soccer1.mp4
15140,1059,1121,328,diss_Soccer1.mp4
15169,1059,1128,336,diss_Soccer1.mp4
15204,1059,1136,344,diss_Soccer1.mp4
15240,1059,1146,351,diss_Soccer1.mp4
15269,1059,1154,356,diss_Soccer1.mp4
15304,1059,1162,363,diss_Soccer1.mp4
15340,1059,1171,370,diss_Soccer1.mp4
15368,1059,1179,379,diss_Soccer1.mp4
15404,1059,1182,382,diss_Soccer1.mp4
15439,1059,1183,384,diss_Soccer1.mp4
15468,1059,1187,384,diss_Soccer1.mp4
15504,1059,1192,384,diss_Soccer1.mp4
15510,1059,1192,385,diss_Soccer1.mp4
16172,1059,1180,385,diss_Soccer1.mp4
16179,1059,1172,386,diss_Soccer1.mp4
16200,1059,1138,388,diss_Soccer1.mp4
16236,1059,1069,404,diss_Soccer1.mp4
16272,1059,975,426,diss_Soccer1.mp4
16307,1059,901,442,diss_Soccer1.mp4
16336,1059,880,448,diss_Soccer1.mp4
16372,1059,873,451,diss_Soccer1.mp4
16393,1059,872,453,diss_Soccer1.mp4
16671,1059,839,468,diss_Soccer1.mp4
16684,1059,817,478,diss_Soccer1.mp4
16706,1059,786,492,diss_Soccer1.mp4
16734,1059,746,516,diss_Soccer1.mp4
16771,1059,716,533,diss_Soccer1.mp4
16798,1059,708,537,diss_Soccer1.mp4
16834,1059,707,539,diss_Soccer1.mp4
16869,1059,706,540,diss_Soccer1.mp4
16906,1059,700,544,diss_Soccer1.mp4
16933,1059,690,551,diss_Soccer1.mp4
16969,1059,678,555,diss_Soccer1.mp4
17005,1059,669,556,diss_Soccer1.mp4
17019,1059,667,556,diss_Soccer1.mp4
17069,1059,666,556,diss_Soccer1.mp4
17581,1059,662,557,diss_Soccer1.mp4
17602,1059,648,560,diss_Soccer1.mp4
17638,1059,629,568,diss_Soccer1.mp4
17673,1059,619,574,diss_Soccer1.mp4
17702,1059,609,578,diss_Soccer1.mp4
17738,1059,596,585,diss_Soccer1.mp4
17773,1059,578,592,diss_Soccer1.mp4
17801,1059,568,596,diss_Soccer1.mp4
17838,1059,558,603,diss_Soccer1.mp4
17872,1059,536,617,diss_Soccer1.mp4
17901,1059,517,626,diss_Soccer1.mp4
17937,1059,502,629,diss_Soccer1.mp4
17965,1059,498,628,diss_Soccer1.mp4
17988,1059,497,628,diss_Soccer1.mp4
18015,1059,497,627,diss_Soccer1.mp4
18057,1059,498,624,diss_Soccer1.mp4
18108,1059,498,621,diss_Soccer1.mp4
18136,1059,498,619,diss_Soccer1.mp4
18172,1059,497,618,diss_Soccer1.mp4
18207,1059,495,616,diss_Soccer1.mp4
18221,1059,492,616,diss_Soccer1.mp4
18278,1059,491,616,diss_Soccer1.mp4
18335,1059,492,614,diss_Soccer1.mp4
18349,1059,494,614,diss_Soccer1.mp4
18363,1059,495,614,diss_Soccer1.mp4
18406,1059,497,616,diss_Soccer1.mp4
18435,1059,500,618,diss_Soccer1.mp4
18471,1059,504,621,diss_Soccer1.mp4
18506,1059,514,624,diss_Soccer1.mp4
18534,1059,521,628,diss_Soccer1.mp4
18556,1059,524,630,diss_Soccer1.mp4
18598,1059,528,632,diss_Soccer1.mp4
18627,1059,529,633,diss_Soccer1.mp4
18655,1059,530,634,diss_Soccer1.mp4
18712,1059,530,632,diss_Soccer1.mp4
18740,1059,526,617,diss_Soccer1.mp4
18769,1059,520,598,diss_Soccer1.mp4
18804,1059,515,574,diss_Soccer1.mp4
18840,1059,511,548,diss_Soccer1.mp4
18868,1059,509,535,diss_Soccer1.mp4
18904,1059,508,525,diss_Soccer1.mp4
18940,1059,506,515,diss_Soccer1.mp4
18968,1059,506,508,diss_Soccer1.mp4
18997,1059,508,504,diss_Soccer1.mp4
19039,1059,510,500,diss_Soccer1.mp4
19068,1059,515,492,diss_Soccer1.mp4
19104,1059,518,479,diss_Soccer1.mp4
19139,1059,524,465,diss_Soccer1.mp4
19167,1059,527,461,diss_Soccer1.mp4
19196,1059,529,459,diss_Soccer1.mp4
19552,1059,539,461,diss_Soccer1.mp4
19573,1059,545,463,diss_Soccer1.mp4
19594,1059,547,464,diss_Soccer1.mp4
19644,1059,548,464,diss_Soccer1.mp4
19673,1059,552,464,diss_Soccer1.mp4
19708,1059,563,465,diss_Soccer1.mp4
19736,1059,576,466,diss_Soccer1.mp4
19773,1059,599,464,diss_Soccer1.mp4
19800,1059,626,463,diss_Soccer1.mp4
19836,1059,657,462,diss_Soccer1.mp4
19871,1059,690,465,diss_Soccer1.mp4
19900,1059,708,468,diss_Soccer1.mp4
19929,1059,714,468,diss_Soccer1.mp4
