verifToken,stimuli_id,source_id,media_a_id,source_a,created_at,source_name_vote,reversed,source_position_vote,bl,bd,nb_replay
f6h3sgzb,1059,4262,14053,diss_Soccer1.mp4,1644424336,1,,1,8,120,0
f6h3sgzb,1060,4265,14056,diss_person22.mp4,1644424352,1,,1,8,120,0
f6h3sgzb,1058,4264,14055,diss_car13.mp4,1644424373,1,,1,8,120,0
f6h3sgzb,1057,4263,14054,diss_building2.mp4,1644424398,1,,1,8,120,0
f6h3sgzb,1062,4263,14054,diss_building2.mp4,1644424424,1,,1,8,120,0
f6h3sgzb,1061,4266,14057,diss_truck2.mp4,1644424449,1,,1,8,120,0
