verifToken,stimuli_id,source_id,media_a_id,source_a,created_at,source_name_vote,reversed,source_position_vote,bl,bd,nb_replay
wecsoaof,1085,5565,44535,diss_building2.mp4,1646234085,1,,1,12,120,1
wecsoaof,1101,5574,44544,diss_truck3.mp4,1646234131,1,,1,12,120,1
wecsoaof,1094,5556,44526,diss_ManRunning1.mp4,1646234152,1,,1,12,120,1
wecsoaof,1098,5559,44529,diss_Soccer2.mp4,1646234178,1,,1,12,120,2
wecsoaof,1086,5566,44536,diss_building3.mp4,1646234202,1,,1,12,120,1
wecsoaof,1091,5571,44541,diss_car15.mp4,1646234215,1,,1,12,120,1
wecsoaof,1099,5560,44530,diss_StreetBasketball1.mp4,1646234226,1,,1,12,120,2
wecsoaof,1081,5553,44523,diss_Basketball.mp4,1646234239,1,,1,12,120,1
wecsoaof,1100,5573,44543,diss_truck2.mp4,1646234273,1,,1,12,120,1
wecsoaof,1088,5568,44538,diss_car11.mp4,1646234304,1,,1,12,120,1
wecsoaof,1092,5554,44524,diss_Girl1.mp4,1646234324,1,,1,12,120,2
wecsoaof,1093,5555,44525,diss_Girl2.mp4,1646234343,1,,1,12,120,1
wecsoaof,1096,5572,44542,diss_person22.mp4,1646234356,1,,1,12,120,2
wecsoaof,1082,5562,44532,diss_bike2.mp4,1646234367,1,,1,12,120,1
wecsoaof,1090,5570,44540,diss_car13.mp4,1646234379,1,,1,12,120,1
wecsoaof,1083,5563,44533,diss_bike3.mp4,1646234398,1,,1,12,120,2
wecsoaof,1089,5569,44539,diss_car12.mp4,1646234416,1,,1,12,120,1
wecsoaof,1087,5567,44537,diss_building4.mp4,1646234440,1,,1,12,120,1
wecsoaof,1084,5564,44534,diss_building1.mp4,1646234463,1,,1,12,120,1
wecsoaof,1095,5557,44527,diss_ManRunning2.mp4,1646234479,1,,1,12,120,2
wecsoaof,1097,5558,44528,diss_Soccer1.mp4,1646234493,1,,1,12,120,1
wecsoaof,1102,5561,44531,diss_Walking.mp4,1646234506,1,,1,12,120,1
