verifToken,stimuli_id,source_id,media_a_id,source_a,created_at,source_name_vote,reversed,source_position_vote,bl,bd,nb_replay
8uocrk9k,1094,5556,44526,diss_ManRunning1.mp4,1646226764,1,,1,12,120,1
8uocrk9k,1086,5566,44536,diss_building3.mp4,1646226849,1,,1,12,120,1
8uocrk9k,1091,5571,44541,diss_car15.mp4,1646226880,1,,1,12,120,1
8uocrk9k,1087,5567,44537,diss_building4.mp4,1646226901,1,,1,12,120,1
8uocrk9k,1090,5570,44540,diss_car13.mp4,1646226920,1,,1,12,120,2
8uocrk9k,1081,5553,44523,diss_Basketball.mp4,1646226953,1,,1,12,120,1
8uocrk9k,1083,5563,44533,diss_bike3.mp4,1646226982,1,,1,12,120,3
8uocrk9k,1095,5557,44527,diss_ManRunning2.mp4,1646227000,1,,1,12,120,1
8uocrk9k,1099,5560,44530,diss_StreetBasketball1.mp4,1646227017,1,,1,12,120,2
8uocrk9k,1084,5564,44534,diss_building1.mp4,1646227036,1,,1,12,120,1
8uocrk9k,1098,5559,44529,diss_Soccer2.mp4,1646227056,1,,1,12,120,1
8uocrk9k,1088,5568,44538,diss_car11.mp4,1646227073,1,,1,12,120,1
8uocrk9k,1101,5574,44544,diss_truck3.mp4,1646227093,1,,1,12,120,1
8uocrk9k,1092,5554,44524,diss_Girl1.mp4,1646227111,1,,1,12,120,2
8uocrk9k,1102,5561,44531,diss_Walking.mp4,1646227131,1,,1,12,120,1
8uocrk9k,1093,5555,44525,diss_Girl2.mp4,1646227151,1,,1,12,120,1
8uocrk9k,1096,5572,44542,diss_person22.mp4,1646227164,1,,1,12,120,5
8uocrk9k,1085,5565,44535,diss_building2.mp4,1646227175,1,,1,12,120,2
8uocrk9k,1089,5569,44539,diss_car12.mp4,1646227188,1,,1,12,120,1
8uocrk9k,1097,5558,44528,diss_Soccer1.mp4,1646227199,1,,1,12,120,1
8uocrk9k,1100,5573,44543,diss_truck2.mp4,1646227212,1,,1,12,120,2
8uocrk9k,1082,5562,44532,diss_bike2.mp4,1646227232,1,,1,12,120,2
