timestamp,stimuli_id,mouseX,mouseY,stimuli
0,1067,630,361,diss_StreetBasketball1.mp4
14,1067,627,363,diss_StreetBasketball1.mp4
25,1067,621,366,diss_StreetBasketball1.mp4
50,1067,607,374,diss_StreetBasketball1.mp4
74,1067,591,382,diss_StreetBasketball1.mp4
97,1067,576,391,diss_StreetBasketball1.mp4
109,1067,569,393,diss_StreetBasketball1.mp4
134,1067,559,397,diss_StreetBasketball1.mp4
147,1067,556,399,diss_StreetBasketball1.mp4
173,1067,551,401,diss_StreetBasketball1.mp4
197,1067,548,403,diss_StreetBasketball1.mp4
209,1067,547,403,diss_StreetBasketball1.mp4
221,1067,546,403,diss_StreetBasketball1.mp4
318,1067,550,403,diss_StreetBasketball1.mp4
330,1067,558,405,diss_StreetBasketball1.mp4
355,1067,590,414,diss_StreetBasketball1.mp4
366,1067,605,420,diss_StreetBasketball1.mp4
391,1067,627,428,diss_StreetBasketball1.mp4
416,1067,638,435,diss_StreetBasketball1.mp4
428,1067,640,435,diss_StreetBasketball1.mp4
440,1067,642,436,diss_StreetBasketball1.mp4
477,1067,643,437,diss_StreetBasketball1.mp4
737,1067,644,437,diss_StreetBasketball1.mp4
748,1067,646,437,diss_StreetBasketball1.mp4
773,1067,659,444,diss_StreetBasketball1.mp4
797,1067,682,461,diss_StreetBasketball1.mp4
809,1067,694,472,diss_StreetBasketball1.mp4
832,1067,707,485,diss_StreetBasketball1.mp4
857,1067,714,492,diss_StreetBasketball1.mp4
869,1067,718,494,diss_StreetBasketball1.mp4
894,1067,723,499,diss_StreetBasketball1.mp4
906,1067,725,500,diss_StreetBasketball1.mp4
931,1067,726,500,diss_StreetBasketball1.mp4
1116,1067,726,499,diss_StreetBasketball1.mp4
1127,1067,725,499,diss_StreetBasketball1.mp4
1140,1067,725,498,diss_StreetBasketball1.mp4
1177,1067,724,497,diss_StreetBasketball1.mp4
1188,1067,724,496,diss_StreetBasketball1.mp4
1213,1067,723,493,diss_StreetBasketball1.mp4
1238,1067,722,488,diss_StreetBasketball1.mp4
1249,1067,722,485,diss_StreetBasketball1.mp4
1274,1067,722,477,diss_StreetBasketball1.mp4
1299,1067,724,469,diss_StreetBasketball1.mp4
1311,1067,725,466,diss_StreetBasketball1.mp4
1335,1067,729,462,diss_StreetBasketball1.mp4
1346,1067,730,461,diss_StreetBasketball1.mp4
1359,1067,731,461,diss_StreetBasketball1.mp4
1383,1067,732,461,diss_StreetBasketball1.mp4
1433,1067,733,461,diss_StreetBasketball1.mp4
1471,1067,733,460,diss_StreetBasketball1.mp4
1483,1067,733,459,diss_StreetBasketball1.mp4
1569,1067,733,458,diss_StreetBasketball1.mp4
1702,1067,733,461,diss_StreetBasketball1.mp4
1715,1067,730,464,diss_StreetBasketball1.mp4
1739,1067,716,480,diss_StreetBasketball1.mp4
1751,1067,706,490,diss_StreetBasketball1.mp4
1776,1067,681,508,diss_StreetBasketball1.mp4
1801,1067,655,519,diss_StreetBasketball1.mp4
1814,1067,642,523,diss_StreetBasketball1.mp4
1837,1067,619,527,diss_StreetBasketball1.mp4
1849,1067,609,527,diss_StreetBasketball1.mp4
1874,1067,591,528,diss_StreetBasketball1.mp4
1898,1067,577,528,diss_StreetBasketball1.mp4
1911,1067,570,528,diss_StreetBasketball1.mp4
1935,1067,554,528,diss_StreetBasketball1.mp4
1960,1067,538,529,diss_StreetBasketball1.mp4
1973,1067,530,529,diss_StreetBasketball1.mp4
1997,1067,518,531,diss_StreetBasketball1.mp4
2023,1067,512,532,diss_StreetBasketball1.mp4
2034,1067,511,532,diss_StreetBasketball1.mp4
2058,1067,510,533,diss_StreetBasketball1.mp4
2329,1067,509,534,diss_StreetBasketball1.mp4
2341,1067,508,535,diss_StreetBasketball1.mp4
2354,1067,506,538,diss_StreetBasketball1.mp4
2378,1067,495,542,diss_StreetBasketball1.mp4
2403,1067,480,545,diss_StreetBasketball1.mp4
2414,1067,473,545,diss_StreetBasketball1.mp4
2438,1067,461,545,diss_StreetBasketball1.mp4
2462,1067,448,539,diss_StreetBasketball1.mp4
2474,1067,443,533,diss_StreetBasketball1.mp4
2499,1067,435,521,diss_StreetBasketball1.mp4
2523,1067,431,506,diss_StreetBasketball1.mp4
2535,1067,430,498,diss_StreetBasketball1.mp4
2560,1067,429,484,diss_StreetBasketball1.mp4
2572,1067,429,477,diss_StreetBasketball1.mp4
2597,1067,428,465,diss_StreetBasketball1.mp4
2621,1067,425,457,diss_StreetBasketball1.mp4
2633,1067,424,455,diss_StreetBasketball1.mp4
2658,1067,422,452,diss_StreetBasketball1.mp4
2683,1067,419,447,diss_StreetBasketball1.mp4
2695,1067,419,445,diss_StreetBasketball1.mp4
2719,1067,416,441,diss_StreetBasketball1.mp4
2732,1067,414,439,diss_StreetBasketball1.mp4
2758,1067,413,437,diss_StreetBasketball1.mp4
2769,1067,412,436,diss_StreetBasketball1.mp4
2817,1067,412,437,diss_StreetBasketball1.mp4
3271,1067,411,434,diss_StreetBasketball1.mp4
3283,1067,408,430,diss_StreetBasketball1.mp4
3296,1067,405,424,diss_StreetBasketball1.mp4
3320,1067,394,404,diss_StreetBasketball1.mp4
3343,1067,382,381,diss_StreetBasketball1.mp4
3356,1067,377,372,diss_StreetBasketball1.mp4
3380,1067,372,363,diss_StreetBasketball1.mp4
3405,1067,370,360,diss_StreetBasketball1.mp4
3466,1067,369,360,diss_StreetBasketball1.mp4
3505,1067,368,358,diss_StreetBasketball1.mp4
3517,1067,367,355,diss_StreetBasketball1.mp4
3541,1067,364,349,diss_StreetBasketball1.mp4
3564,1067,362,343,diss_StreetBasketball1.mp4
3576,1067,361,340,diss_StreetBasketball1.mp4
3601,1067,361,336,diss_StreetBasketball1.mp4
3626,1067,361,335,diss_StreetBasketball1.mp4
3638,1067,361,334,diss_StreetBasketball1.mp4
3699,1067,364,332,diss_StreetBasketball1.mp4
3723,1067,368,331,diss_StreetBasketball1.mp4
3736,1067,372,330,diss_StreetBasketball1.mp4
3761,1067,381,330,diss_StreetBasketball1.mp4
3772,1067,386,331,diss_StreetBasketball1.mp4
3798,1067,402,336,diss_StreetBasketball1.mp4
3821,1067,418,348,diss_StreetBasketball1.mp4
3833,1067,427,357,diss_StreetBasketball1.mp4
3858,1067,442,371,diss_StreetBasketball1.mp4
3883,1067,450,380,diss_StreetBasketball1.mp4
3895,1067,453,384,diss_StreetBasketball1.mp4
3920,1067,454,387,diss_StreetBasketball1.mp4
4215,1067,455,387,diss_StreetBasketball1.mp4
4226,1067,456,389,diss_StreetBasketball1.mp4
4239,1067,458,390,diss_StreetBasketball1.mp4
4264,1067,461,395,diss_StreetBasketball1.mp4
4288,1067,464,400,diss_StreetBasketball1.mp4
4300,1067,465,402,diss_StreetBasketball1.mp4
4323,1067,465,405,diss_StreetBasketball1.mp4
4336,1067,466,406,diss_StreetBasketball1.mp4
4496,1067,466,407,diss_StreetBasketball1.mp4
4509,1067,466,411,diss_StreetBasketball1.mp4
4521,1067,465,414,diss_StreetBasketball1.mp4
4545,1067,460,421,diss_StreetBasketball1.mp4
4570,1067,457,425,diss_StreetBasketball1.mp4
4594,1067,457,426,diss_StreetBasketball1.mp4
4815,1067,460,426,diss_StreetBasketball1.mp4
4827,1067,468,426,diss_StreetBasketball1.mp4
4839,1067,480,426,diss_StreetBasketball1.mp4
4864,1067,525,426,diss_StreetBasketball1.mp4
4888,1067,577,427,diss_StreetBasketball1.mp4
4902,1067,592,428,diss_StreetBasketball1.mp4
4925,1067,612,433,diss_StreetBasketball1.mp4
4937,1067,619,436,diss_StreetBasketball1.mp4
5366,1067,619,438,diss_StreetBasketball1.mp4
5378,1067,616,441,diss_StreetBasketball1.mp4
5403,1067,607,453,diss_StreetBasketball1.mp4
5428,1067,594,466,diss_StreetBasketball1.mp4
5439,1067,586,472,diss_StreetBasketball1.mp4
5464,1067,574,480,diss_StreetBasketball1.mp4
5487,1067,567,483,diss_StreetBasketball1.mp4
5500,1067,564,484,diss_StreetBasketball1.mp4
5512,1067,562,484,diss_StreetBasketball1.mp4
5537,1067,561,484,diss_StreetBasketball1.mp4
5722,1067,561,483,diss_StreetBasketball1.mp4
5880,1067,562,483,diss_StreetBasketball1.mp4
5892,1067,563,483,diss_StreetBasketball1.mp4
5905,1067,565,484,diss_StreetBasketball1.mp4
5931,1067,571,486,diss_StreetBasketball1.mp4
5942,1067,575,489,diss_StreetBasketball1.mp4
5966,1067,584,492,diss_StreetBasketball1.mp4
5978,1067,588,493,diss_StreetBasketball1.mp4
6002,1067,592,495,diss_StreetBasketball1.mp4
6027,1067,595,495,diss_StreetBasketball1.mp4
6051,1067,596,495,diss_StreetBasketball1.mp4
6076,1067,597,495,diss_StreetBasketball1.mp4
6100,1067,599,495,diss_StreetBasketball1.mp4
6113,1067,600,495,diss_StreetBasketball1.mp4
6125,1067,602,495,diss_StreetBasketball1.mp4
6149,1067,606,495,diss_StreetBasketball1.mp4
6162,1067,608,495,diss_StreetBasketball1.mp4
6186,1067,614,495,diss_StreetBasketball1.mp4
6210,1067,620,495,diss_StreetBasketball1.mp4
6223,1067,624,495,diss_StreetBasketball1.mp4
6248,1067,631,497,diss_StreetBasketball1.mp4
6271,1067,638,499,diss_StreetBasketball1.mp4
6284,1067,641,499,diss_StreetBasketball1.mp4
6308,1067,646,502,diss_StreetBasketball1.mp4
6320,1067,649,502,diss_StreetBasketball1.mp4
6345,1067,651,502,diss_StreetBasketball1.mp4
6835,1067,652,502,diss_StreetBasketball1.mp4
6872,1067,653,502,diss_StreetBasketball1.mp4
6922,1067,654,502,diss_StreetBasketball1.mp4
6947,1067,655,502,diss_StreetBasketball1.mp4
7057,1067,656,502,diss_StreetBasketball1.mp4
7068,1067,658,501,diss_StreetBasketball1.mp4
7093,1067,661,498,diss_StreetBasketball1.mp4
7105,1067,664,497,diss_StreetBasketball1.mp4
7130,1067,667,494,diss_StreetBasketball1.mp4
7142,1067,668,492,diss_StreetBasketball1.mp4
7156,1067,669,492,diss_StreetBasketball1.mp4
7180,1067,669,491,diss_StreetBasketball1.mp4
7202,1067,672,488,diss_StreetBasketball1.mp4
7228,1067,675,482,diss_StreetBasketball1.mp4
7252,1067,682,474,diss_StreetBasketball1.mp4
7264,1067,687,468,diss_StreetBasketball1.mp4
7288,1067,702,452,diss_StreetBasketball1.mp4
7301,1067,711,444,diss_StreetBasketball1.mp4
7325,1067,730,431,diss_StreetBasketball1.mp4
7349,1067,750,422,diss_StreetBasketball1.mp4
7362,1067,758,419,diss_StreetBasketball1.mp4
7386,1067,772,416,diss_StreetBasketball1.mp4
0,1064,648,367,diss_building3.mp4
12,1064,647,367,diss_building3.mp4
24,1064,645,366,diss_building3.mp4
49,1064,641,366,diss_building3.mp4
60,1064,638,366,diss_building3.mp4
86,1064,632,367,diss_building3.mp4
111,1064,628,370,diss_building3.mp4
134,1064,623,374,diss_building3.mp4
147,1064,621,376,diss_building3.mp4
172,1064,616,381,diss_building3.mp4
184,1064,614,383,diss_building3.mp4
209,1064,608,388,diss_building3.mp4
234,1064,604,392,diss_building3.mp4
246,1064,602,394,diss_building3.mp4
270,1064,598,397,diss_building3.mp4
293,1064,593,400,diss_building3.mp4
306,1064,591,403,diss_building3.mp4
331,1064,588,406,diss_building3.mp4
355,1064,585,407,diss_building3.mp4
380,1064,584,408,diss_building3.mp4
417,1064,583,408,diss_building3.mp4
687,1064,581,408,diss_building3.mp4
698,1064,577,410,diss_building3.mp4
712,1064,571,411,diss_building3.mp4
736,1064,556,416,diss_building3.mp4
761,1064,535,424,diss_building3.mp4
774,1064,524,428,diss_building3.mp4
795,1064,502,438,diss_building3.mp4
808,1064,492,442,diss_building3.mp4
833,1064,477,448,diss_building3.mp4
857,1064,464,452,diss_building3.mp4
870,1064,458,453,diss_building3.mp4
895,1064,446,456,diss_building3.mp4
920,1064,433,458,diss_building3.mp4
933,1064,426,460,diss_building3.mp4
955,1064,408,464,diss_building3.mp4
967,1064,400,466,diss_building3.mp4
992,1064,382,472,diss_building3.mp4
1016,1064,368,476,diss_building3.mp4
1029,1064,361,479,diss_building3.mp4
1054,1064,352,483,diss_building3.mp4
1078,1064,346,488,diss_building3.mp4
1091,1064,344,490,diss_building3.mp4
1102,1064,342,491,diss_building3.mp4
1496,1064,341,491,diss_building3.mp4
1507,1064,339,491,diss_building3.mp4
1532,1064,333,494,diss_building3.mp4
1558,1064,326,498,diss_building3.mp4
1567,1064,321,500,diss_building3.mp4
1593,1064,316,503,diss_building3.mp4
1617,1064,311,505,diss_building3.mp4
1630,1064,309,506,diss_building3.mp4
1654,1064,305,509,diss_building3.mp4
1667,1064,304,510,diss_building3.mp4
1691,1064,301,512,diss_building3.mp4
1716,1064,298,515,diss_building3.mp4
1727,1064,296,517,diss_building3.mp4
1751,1064,292,521,diss_building3.mp4
1789,1064,286,525,diss_building3.mp4
1813,1064,284,527,diss_building3.mp4
1838,1064,280,528,diss_building3.mp4
1850,1064,278,530,diss_building3.mp4
1875,1064,274,531,diss_building3.mp4
1900,1064,271,532,diss_building3.mp4
1911,1064,268,533,diss_building3.mp4
1936,1064,263,534,diss_building3.mp4
1960,1064,254,536,diss_building3.mp4
1972,1064,248,538,diss_building3.mp4
1997,1064,238,540,diss_building3.mp4
2009,1064,233,541,diss_building3.mp4
2033,1064,224,541,diss_building3.mp4
2058,1064,218,542,diss_building3.mp4
2070,1064,215,543,diss_building3.mp4
2095,1064,209,545,diss_building3.mp4
2119,1064,203,548,diss_building3.mp4
2132,1064,200,549,diss_building3.mp4
2156,1064,195,552,diss_building3.mp4
2168,1064,193,553,diss_building3.mp4
2192,1064,189,555,diss_building3.mp4
2217,1064,184,558,diss_building3.mp4
2230,1064,182,558,diss_building3.mp4
2254,1064,179,559,diss_building3.mp4
2266,1064,179,560,diss_building3.mp4
2402,1064,183,560,diss_building3.mp4
2416,1064,194,558,diss_building3.mp4
2437,1064,231,552,diss_building3.mp4
2450,1064,265,547,diss_building3.mp4
2474,1064,335,540,diss_building3.mp4
2498,1064,403,537,diss_building3.mp4
2511,1064,433,537,diss_building3.mp4
2536,1064,480,537,diss_building3.mp4
2559,1064,504,537,diss_building3.mp4
2573,1064,513,537,diss_building3.mp4
2597,1064,522,538,diss_building3.mp4
2610,1064,524,538,diss_building3.mp4
2634,1064,527,538,diss_building3.mp4
2646,1064,528,538,diss_building3.mp4
2929,1064,529,538,diss_building3.mp4
2941,1064,530,539,diss_building3.mp4
2953,1064,530,540,diss_building3.mp4
2978,1064,531,542,diss_building3.mp4
3002,1064,532,545,diss_building3.mp4
3013,1064,533,547,diss_building3.mp4
3038,1064,534,553,diss_building3.mp4
3062,1064,535,560,diss_building3.mp4
3075,1064,536,564,diss_building3.mp4
3099,1064,537,570,diss_building3.mp4
3111,1064,537,571,diss_building3.mp4
3136,1064,539,575,diss_building3.mp4
3161,1064,540,578,diss_building3.mp4
3172,1064,541,579,diss_building3.mp4
3197,1064,542,581,diss_building3.mp4
3258,1064,543,581,diss_building3.mp4
3369,1064,544,581,diss_building3.mp4
3393,1064,545,581,diss_building3.mp4
3405,1064,546,581,diss_building3.mp4
3417,1064,547,581,diss_building3.mp4
3442,1064,551,581,diss_building3.mp4
3454,1064,554,581,diss_building3.mp4
3478,1064,563,581,diss_building3.mp4
3502,1064,571,581,diss_building3.mp4
3515,1064,574,581,diss_building3.mp4
3540,1064,578,581,diss_building3.mp4
3552,1064,579,581,diss_building3.mp4
3576,1064,580,581,diss_building3.mp4
4409,1064,581,581,diss_building3.mp4
4422,1064,582,581,diss_building3.mp4
4434,1064,583,581,diss_building3.mp4
4459,1064,584,581,diss_building3.mp4
4483,1064,586,580,diss_building3.mp4
4507,1064,587,580,diss_building3.mp4
4520,1064,589,580,diss_building3.mp4
4544,1064,591,580,diss_building3.mp4
4556,1064,593,580,diss_building3.mp4
4582,1064,600,580,diss_building3.mp4
4605,1064,609,580,diss_building3.mp4
4617,1064,616,581,diss_building3.mp4
4643,1064,632,581,diss_building3.mp4
4655,1064,639,581,diss_building3.mp4
4679,1064,649,582,diss_building3.mp4
4704,1064,654,582,diss_building3.mp4
4716,1064,656,582,diss_building3.mp4
4728,1064,657,582,diss_building3.mp4
5206,1064,659,580,diss_building3.mp4
5221,1064,661,574,diss_building3.mp4
5244,1064,668,558,diss_building3.mp4
5255,1064,672,550,diss_building3.mp4
5279,1064,680,533,diss_building3.mp4
5304,1064,685,523,diss_building3.mp4
5316,1064,688,520,diss_building3.mp4
5341,1064,693,515,diss_building3.mp4
5365,1064,696,512,diss_building3.mp4
5378,1064,697,511,diss_building3.mp4
5403,1064,698,509,diss_building3.mp4
5427,1064,700,505,diss_building3.mp4
5439,1064,700,502,diss_building3.mp4
5464,1064,701,495,diss_building3.mp4
5476,1064,701,489,diss_building3.mp4
5501,1064,702,480,diss_building3.mp4
5524,1064,702,473,diss_building3.mp4
5537,1064,702,470,diss_building3.mp4
5562,1064,702,464,diss_building3.mp4
5585,1064,702,461,diss_building3.mp4
5598,1064,702,460,diss_building3.mp4
5623,1064,701,455,diss_building3.mp4
5647,1064,698,451,diss_building3.mp4
5660,1064,696,448,diss_building3.mp4
5683,1064,694,443,diss_building3.mp4
5696,1064,693,440,diss_building3.mp4
5721,1064,691,436,diss_building3.mp4
5746,1064,691,433,diss_building3.mp4
6173,1064,691,432,diss_building3.mp4
6187,1064,689,431,diss_building3.mp4
6199,1064,686,428,diss_building3.mp4
6222,1064,678,418,diss_building3.mp4
6247,1064,669,401,diss_building3.mp4
6259,1064,665,393,diss_building3.mp4
6284,1064,660,382,diss_building3.mp4
6308,1064,658,380,diss_building3.mp4
6467,1064,660,379,diss_building3.mp4
6480,1064,661,378,diss_building3.mp4
6505,1064,665,377,diss_building3.mp4
6528,1064,669,375,diss_building3.mp4
6541,1064,671,374,diss_building3.mp4
6566,1064,673,372,diss_building3.mp4
6578,1064,675,371,diss_building3.mp4
6603,1064,676,371,diss_building3.mp4
6627,1064,678,369,diss_building3.mp4
6651,1064,678,368,diss_building3.mp4
6663,1064,679,368,diss_building3.mp4
6676,1064,679,366,diss_building3.mp4
6700,1064,680,365,diss_building3.mp4
6713,1064,680,363,diss_building3.mp4
6737,1064,681,362,diss_building3.mp4
6761,1064,681,360,diss_building3.mp4
6786,1064,681,359,diss_building3.mp4
6799,1064,681,357,diss_building3.mp4
6824,1064,682,354,diss_building3.mp4
6848,1064,683,351,diss_building3.mp4
6860,1064,683,350,diss_building3.mp4
6884,1064,683,347,diss_building3.mp4
6908,1064,684,346,diss_building3.mp4
7068,1064,684,345,diss_building3.mp4
7423,1064,684,344,diss_building3.mp4
7448,1064,685,343,diss_building3.mp4
7460,1064,686,340,diss_building3.mp4
7473,1064,688,337,diss_building3.mp4
7484,1064,692,332,diss_building3.mp4
7509,1064,702,322,diss_building3.mp4
7521,1064,708,317,diss_building3.mp4
7546,1064,720,308,diss_building3.mp4
7570,1064,730,303,diss_building3.mp4
7583,1064,734,302,diss_building3.mp4
7607,1064,742,300,diss_building3.mp4
7632,1064,749,300,diss_building3.mp4
7643,1064,753,300,diss_building3.mp4
7668,1064,760,301,diss_building3.mp4
7692,1064,767,302,diss_building3.mp4
7704,1064,770,302,diss_building3.mp4
7729,1064,779,303,diss_building3.mp4
7741,1064,783,303,diss_building3.mp4
7766,1064,791,303,diss_building3.mp4
7790,1064,797,303,diss_building3.mp4
7803,1064,800,303,diss_building3.mp4
7828,1064,804,303,diss_building3.mp4
7840,1064,805,303,diss_building3.mp4
8183,1064,806,303,diss_building3.mp4
8207,1064,807,303,diss_building3.mp4
8220,1064,809,303,diss_building3.mp4
8231,1064,813,303,diss_building3.mp4
8256,1064,828,304,diss_building3.mp4
8280,1064,859,317,diss_building3.mp4
8293,1064,876,322,diss_building3.mp4
8317,1064,902,332,diss_building3.mp4
8330,1064,912,335,diss_building3.mp4
8355,1064,926,342,diss_building3.mp4
8367,1064,933,345,diss_building3.mp4
8391,1064,949,350,diss_building3.mp4
8415,1064,962,355,diss_building3.mp4
8427,1064,966,357,diss_building3.mp4
8452,1064,973,360,diss_building3.mp4
8464,1064,975,361,diss_building3.mp4
8477,1064,977,362,diss_building3.mp4
8502,1064,978,363,diss_building3.mp4
8942,1064,979,363,diss_building3.mp4
8954,1064,980,363,diss_building3.mp4
8967,1064,983,363,diss_building3.mp4
8992,1064,991,363,diss_building3.mp4
9003,1064,1000,364,diss_building3.mp4
9028,1064,1018,372,diss_building3.mp4
9053,1064,1034,384,diss_building3.mp4
9065,1064,1041,390,diss_building3.mp4
9089,1064,1055,398,diss_building3.mp4
9113,1064,1061,404,diss_building3.mp4
9126,1064,1064,405,diss_building3.mp4
9151,1064,1067,408,diss_building3.mp4
9175,1064,1069,412,diss_building3.mp4
9188,1064,1071,413,diss_building3.mp4
9212,1064,1075,418,diss_building3.mp4
9237,1064,1079,425,diss_building3.mp4
9248,1064,1081,428,diss_building3.mp4
9273,1064,1085,431,diss_building3.mp4
9286,1064,1087,433,diss_building3.mp4
9298,1064,1088,433,diss_building3.mp4
9705,1064,1088,434,diss_building3.mp4
9728,1064,1088,436,diss_building3.mp4
9740,1064,1084,438,diss_building3.mp4
9753,1064,1078,443,diss_building3.mp4
9778,1064,1054,454,diss_building3.mp4
9802,1064,1009,470,diss_building3.mp4
9814,1064,982,478,diss_building3.mp4
9837,1064,919,499,diss_building3.mp4
9849,1064,889,509,diss_building3.mp4
9875,1064,846,525,diss_building3.mp4
9898,1064,824,535,diss_building3.mp4
9911,1064,818,539,diss_building3.mp4
9934,1064,810,544,diss_building3.mp4
9947,1064,809,546,diss_building3.mp4
9972,1064,808,549,diss_building3.mp4
9996,1064,807,553,diss_building3.mp4
10009,1064,807,554,diss_building3.mp4
10353,1064,805,555,diss_building3.mp4
10377,1064,801,557,diss_building3.mp4
10387,1064,798,559,diss_building3.mp4
10413,1064,789,564,diss_building3.mp4
10437,1064,778,571,diss_building3.mp4
10449,1064,771,574,diss_building3.mp4
10474,1064,755,581,diss_building3.mp4
10486,1064,746,584,diss_building3.mp4
10511,1064,721,590,diss_building3.mp4
10535,1064,692,590,diss_building3.mp4
10548,1064,669,588,diss_building3.mp4
10572,1064,624,578,diss_building3.mp4
10597,1064,588,574,diss_building3.mp4
10609,1064,576,573,diss_building3.mp4
10634,1064,559,572,diss_building3.mp4
10657,1064,551,572,diss_building3.mp4
10670,1064,548,572,diss_building3.mp4
10695,1064,543,572,diss_building3.mp4
10720,1064,542,572,diss_building3.mp4
10743,1064,542,573,diss_building3.mp4
10755,1064,541,574,diss_building3.mp4
11075,1064,540,574,diss_building3.mp4
11086,1064,537,575,diss_building3.mp4
11098,1064,534,575,diss_building3.mp4
11111,1064,528,575,diss_building3.mp4
11135,1064,511,578,diss_building3.mp4
11161,1064,489,582,diss_building3.mp4
11172,1064,478,584,diss_building3.mp4
11197,1064,456,590,diss_building3.mp4
11222,1064,436,596,diss_building3.mp4
11234,1064,427,599,diss_building3.mp4
11259,1064,413,605,diss_building3.mp4
11271,1064,407,607,diss_building3.mp4
11296,1064,396,613,diss_building3.mp4
11319,1064,384,617,diss_building3.mp4
11331,1064,379,619,diss_building3.mp4
11356,1064,366,625,diss_building3.mp4
11381,1064,355,629,diss_building3.mp4
11393,1064,348,631,diss_building3.mp4
11417,1064,335,635,diss_building3.mp4
11442,1064,322,639,diss_building3.mp4
11455,1064,317,640,diss_building3.mp4
11479,1064,305,643,diss_building3.mp4
11491,1064,299,645,diss_building3.mp4
11517,1064,289,647,diss_building3.mp4
11539,1064,282,648,diss_building3.mp4
11552,1064,280,648,diss_building3.mp4
11577,1064,277,648,diss_building3.mp4
11910,1064,275,648,diss_building3.mp4
11921,1064,273,649,diss_building3.mp4
11944,1064,265,649,diss_building3.mp4
11957,1064,258,649,diss_building3.mp4
11984,1064,244,649,diss_building3.mp4
12007,1064,233,649,diss_building3.mp4
12017,1064,228,649,diss_building3.mp4
12042,1064,221,649,diss_building3.mp4
12054,1064,218,649,diss_building3.mp4
12080,1064,213,649,diss_building3.mp4
12092,1064,209,649,diss_building3.mp4
12115,1064,202,649,diss_building3.mp4
12140,1064,196,649,diss_building3.mp4
12152,1064,193,649,diss_building3.mp4
12177,1064,185,649,diss_building3.mp4
12201,1064,176,649,diss_building3.mp4
12214,1064,172,649,diss_building3.mp4
12238,1064,166,649,diss_building3.mp4
12251,1064,163,649,diss_building3.mp4
12275,1064,158,649,diss_building3.mp4
12299,1064,151,649,diss_building3.mp4
12312,1064,148,649,diss_building3.mp4
12337,1064,144,649,diss_building3.mp4
12361,1064,142,649,diss_building3.mp4
12398,1064,142,648,diss_building3.mp4
12595,1064,142,646,diss_building3.mp4
12605,1064,143,642,diss_building3.mp4
12619,1064,145,635,diss_building3.mp4
12643,1064,158,607,diss_building3.mp4
12656,1064,172,586,diss_building3.mp4
12680,1064,206,541,diss_building3.mp4
12705,1064,237,510,diss_building3.mp4
12716,1064,254,497,diss_building3.mp4
12741,1064,281,481,diss_building3.mp4
12765,1064,303,472,diss_building3.mp4
12778,1064,311,469,diss_building3.mp4
13477,1064,311,468,diss_building3.mp4
13488,1064,311,467,diss_building3.mp4
13503,1064,312,466,diss_building3.mp4
13527,1064,313,462,diss_building3.mp4
13537,1064,314,460,diss_building3.mp4
13561,1064,316,457,diss_building3.mp4
13586,1064,318,455,diss_building3.mp4
13610,1064,319,454,diss_building3.mp4
13635,1064,320,453,diss_building3.mp4
13660,1064,321,452,diss_building3.mp4
13671,1064,321,451,diss_building3.mp4
13683,1064,322,451,diss_building3.mp4
13696,1064,323,450,diss_building3.mp4
13721,1064,324,449,diss_building3.mp4
13745,1064,326,448,diss_building3.mp4
13758,1064,326,447,diss_building3.mp4
13782,1064,328,446,diss_building3.mp4
13794,1064,329,446,diss_building3.mp4
13820,1064,330,444,diss_building3.mp4
13843,1064,332,443,diss_building3.mp4
13868,1064,333,442,diss_building3.mp4
13892,1064,334,441,diss_building3.mp4
13905,1064,335,440,diss_building3.mp4
13917,1064,336,440,diss_building3.mp4
13942,1064,340,437,diss_building3.mp4
13954,1064,342,435,diss_building3.mp4
14811,1064,342,432,diss_building3.mp4
14824,1064,342,430,diss_building3.mp4
14836,1064,342,426,diss_building3.mp4
14860,1064,344,415,diss_building3.mp4
14884,1064,348,401,diss_building3.mp4
14896,1064,352,395,diss_building3.mp4
14921,1064,360,382,diss_building3.mp4
14946,1064,367,372,diss_building3.mp4
14958,1064,371,370,diss_building3.mp4
14983,1064,380,364,diss_building3.mp4
15007,1064,391,360,diss_building3.mp4
15020,1064,394,359,diss_building3.mp4
15045,1064,400,356,diss_building3.mp4
15068,1064,405,354,diss_building3.mp4
15081,1064,406,354,diss_building3.mp4
15105,1064,410,353,diss_building3.mp4
15117,1064,411,353,diss_building3.mp4
15141,1064,413,352,diss_building3.mp4
15167,1064,416,352,diss_building3.mp4
15179,1064,417,352,diss_building3.mp4
15203,1064,421,352,diss_building3.mp4
15228,1064,426,352,diss_building3.mp4
15240,1064,428,352,diss_building3.mp4
15265,1064,432,352,diss_building3.mp4
15289,1064,435,353,diss_building3.mp4
15816,1064,436,353,diss_building3.mp4
15829,1064,438,353,diss_building3.mp4
15840,1064,441,353,diss_building3.mp4
15866,1064,448,351,diss_building3.mp4
15889,1064,454,349,diss_building3.mp4
15901,1064,456,349,diss_building3.mp4
15926,1064,461,348,diss_building3.mp4
15950,1064,464,348,diss_building3.mp4
15963,1064,465,348,diss_building3.mp4
15987,1064,467,348,diss_building3.mp4
16000,1064,468,348,diss_building3.mp4
16024,1064,470,348,diss_building3.mp4
16061,1064,471,348,diss_building3.mp4
16085,1064,472,348,diss_building3.mp4
16109,1064,473,348,diss_building3.mp4
16122,1064,474,348,diss_building3.mp4
16147,1064,475,348,diss_building3.mp4
16159,1064,476,348,diss_building3.mp4
16183,1064,477,348,diss_building3.mp4
16195,1064,478,348,diss_building3.mp4
16221,1064,479,348,diss_building3.mp4
16246,1064,480,348,diss_building3.mp4
16270,1064,481,348,diss_building3.mp4
16281,1064,482,348,diss_building3.mp4
16305,1064,483,348,diss_building3.mp4
16330,1064,484,348,diss_building3.mp4
16354,1064,485,348,diss_building3.mp4
16367,1064,486,348,diss_building3.mp4
16391,1064,488,348,diss_building3.mp4
16403,1064,489,348,diss_building3.mp4
16428,1064,492,348,diss_building3.mp4
16441,1064,494,348,diss_building3.mp4
16465,1064,498,348,diss_building3.mp4
16489,1064,502,349,diss_building3.mp4
16502,1064,504,349,diss_building3.mp4
16526,1064,507,350,diss_building3.mp4
16550,1064,509,350,diss_building3.mp4
16562,1064,510,350,diss_building3.mp4
17433,1064,511,350,diss_building3.mp4
17484,1064,513,350,diss_building3.mp4
17507,1064,516,350,diss_building3.mp4
17532,1064,518,350,diss_building3.mp4
17543,1064,519,350,diss_building3.mp4
17567,1064,521,350,diss_building3.mp4
17592,1064,523,350,diss_building3.mp4
17604,1064,524,350,diss_building3.mp4
17629,1064,525,350,diss_building3.mp4
17653,1064,527,350,diss_building3.mp4
17666,1064,529,350,diss_building3.mp4
17691,1064,530,350,diss_building3.mp4
17702,1064,531,350,diss_building3.mp4
17726,1064,533,350,diss_building3.mp4
17751,1064,537,350,diss_building3.mp4
17764,1064,539,350,diss_building3.mp4
17788,1064,542,350,diss_building3.mp4
17812,1064,545,350,diss_building3.mp4
17837,1064,547,350,diss_building3.mp4
17861,1064,548,350,diss_building3.mp4
17886,1064,549,350,diss_building3.mp4
17911,1064,550,350,diss_building3.mp4
18572,1064,552,350,diss_building3.mp4
18584,1064,555,350,diss_building3.mp4
18610,1064,564,350,diss_building3.mp4
18634,1064,582,350,diss_building3.mp4
18645,1064,591,350,diss_building3.mp4
18670,1064,612,352,diss_building3.mp4
18695,1064,630,356,diss_building3.mp4
18707,1064,637,358,diss_building3.mp4
18731,1064,653,363,diss_building3.mp4
18755,1064,665,367,diss_building3.mp4
18768,1064,671,368,diss_building3.mp4
18793,1064,679,370,diss_building3.mp4
18816,1064,683,373,diss_building3.mp4
20299,1064,685,373,diss_building3.mp4
20313,1064,685,375,diss_building3.mp4
20337,1064,689,378,diss_building3.mp4
20347,1064,691,383,diss_building3.mp4
20372,1064,693,392,diss_building3.mp4
20396,1064,695,403,diss_building3.mp4
20409,1064,695,408,diss_building3.mp4
20434,1064,696,419,diss_building3.mp4
20459,1064,697,427,diss_building3.mp4
20471,1064,697,429,diss_building3.mp4
20495,1064,698,433,diss_building3.mp4
20507,1064,698,435,diss_building3.mp4
20531,1064,698,440,diss_building3.mp4
20556,1064,698,445,diss_building3.mp4
20580,1064,698,454,diss_building3.mp4
20593,1064,699,458,diss_building3.mp4
20618,1064,699,466,diss_building3.mp4
20630,1064,699,469,diss_building3.mp4
20654,1064,699,476,diss_building3.mp4
20679,1064,699,482,diss_building3.mp4
20691,1064,699,484,diss_building3.mp4
20715,1064,699,488,diss_building3.mp4
20739,1064,701,491,diss_building3.mp4
20752,1064,702,493,diss_building3.mp4
20776,1064,704,496,diss_building3.mp4
20789,1064,704,498,diss_building3.mp4
20814,1064,705,500,diss_building3.mp4
20826,1064,706,501,diss_building3.mp4
20850,1064,707,502,diss_building3.mp4
20863,1064,707,503,diss_building3.mp4
21047,1064,708,503,diss_building3.mp4
21120,1064,710,503,diss_building3.mp4
21782,1064,708,503,diss_building3.mp4
21793,1064,704,503,diss_building3.mp4
21818,1064,693,505,diss_building3.mp4
21842,1064,677,513,diss_building3.mp4
21855,1064,669,516,diss_building3.mp4
21880,1064,655,522,diss_building3.mp4
21892,1064,651,524,diss_building3.mp4
21917,1064,643,526,diss_building3.mp4
21941,1064,638,529,diss_building3.mp4
21953,1064,636,529,diss_building3.mp4
21978,1064,632,529,diss_building3.mp4
22002,1064,630,530,diss_building3.mp4
22014,1064,629,530,diss_building3.mp4
22039,1064,626,531,diss_building3.mp4
22063,1064,623,531,diss_building3.mp4
22076,1064,622,532,diss_building3.mp4
22101,1064,620,533,diss_building3.mp4
22113,1064,619,533,diss_building3.mp4
22137,1064,618,533,diss_building3.mp4
22162,1064,617,533,diss_building3.mp4
22185,1064,616,533,diss_building3.mp4
22223,1064,615,533,diss_building3.mp4
22259,1064,614,533,diss_building3.mp4
22296,1064,611,533,diss_building3.mp4
22322,1064,609,533,diss_building3.mp4
22334,1064,607,533,diss_building3.mp4
22358,1064,604,532,diss_building3.mp4
22370,1064,603,532,diss_building3.mp4
22394,1064,601,532,diss_building3.mp4
22408,1064,600,531,diss_building3.mp4
22443,1064,597,531,diss_building3.mp4
22455,1064,596,530,diss_building3.mp4
22479,1064,590,529,diss_building3.mp4
22491,1064,587,528,diss_building3.mp4
22517,1064,580,527,diss_building3.mp4
22541,1064,569,524,diss_building3.mp4
22565,1064,559,522,diss_building3.mp4
22578,1064,553,522,diss_building3.mp4
22603,1064,547,521,diss_building3.mp4
22614,1064,544,521,diss_building3.mp4
22639,1064,541,521,diss_building3.mp4
22664,1064,538,521,diss_building3.mp4
22688,1064,537,521,diss_building3.mp4
22713,1064,536,521,diss_building3.mp4
22738,1064,535,521,diss_building3.mp4
22774,1064,534,521,diss_building3.mp4
22799,1064,533,521,diss_building3.mp4
23387,1064,532,521,diss_building3.mp4
23399,1064,530,522,diss_building3.mp4
23424,1064,526,522,diss_building3.mp4
23436,1064,523,522,diss_building3.mp4
23459,1064,515,523,diss_building3.mp4
23485,1064,507,523,diss_building3.mp4
23496,1064,504,523,diss_building3.mp4
23521,1064,498,523,diss_building3.mp4
23546,1064,495,523,diss_building3.mp4
23558,1064,494,523,diss_building3.mp4
23583,1064,491,521,diss_building3.mp4
23606,1064,487,521,diss_building3.mp4
23619,1064,484,520,diss_building3.mp4
23644,1064,480,518,diss_building3.mp4
23656,1064,477,518,diss_building3.mp4
23681,1064,472,516,diss_building3.mp4
23706,1064,466,515,diss_building3.mp4
23717,1064,464,515,diss_building3.mp4
23741,1064,461,513,diss_building3.mp4
23766,1064,457,512,diss_building3.mp4
23778,1064,456,510,diss_building3.mp4
23803,1064,452,509,diss_building3.mp4
23827,1064,448,507,diss_building3.mp4
23840,1064,447,507,diss_building3.mp4
23865,1064,445,506,diss_building3.mp4
23888,1064,444,505,diss_building3.mp4
24245,1064,443,505,diss_building3.mp4
24256,1064,441,504,diss_building3.mp4
24281,1064,433,501,diss_building3.mp4
24307,1064,423,496,diss_building3.mp4
24318,1064,419,494,diss_building3.mp4
24342,1064,416,492,diss_building3.mp4
24367,1064,413,491,diss_building3.mp4
24379,1064,412,490,diss_building3.mp4
24404,1064,408,489,diss_building3.mp4
24416,1064,407,489,diss_building3.mp4
24440,1064,403,488,diss_building3.mp4
24465,1064,399,488,diss_building3.mp4
24477,1064,397,488,diss_building3.mp4
24501,1064,392,488,diss_building3.mp4
24526,1064,387,488,diss_building3.mp4
24538,1064,384,488,diss_building3.mp4
24563,1064,377,488,diss_building3.mp4
24587,1064,373,489,diss_building3.mp4
24600,1064,370,490,diss_building3.mp4
24624,1064,366,491,diss_building3.mp4
24648,1064,364,492,diss_building3.mp4
24660,1064,362,492,diss_building3.mp4
24687,1064,361,493,diss_building3.mp4
24698,1064,360,494,diss_building3.mp4
24711,1064,359,494,diss_building3.mp4
24748,1064,358,494,diss_building3.mp4
24759,1064,358,495,diss_building3.mp4
24894,1064,357,496,diss_building3.mp4
24907,1064,357,497,diss_building3.mp4
24930,1064,357,498,diss_building3.mp4
24944,1064,356,498,diss_building3.mp4
24968,1064,355,501,diss_building3.mp4
24980,1064,354,502,diss_building3.mp4
25004,1064,353,504,diss_building3.mp4
25016,1064,353,505,diss_building3.mp4
25053,1064,352,505,diss_building3.mp4
25078,1064,352,506,diss_building3.mp4
25114,1064,351,506,diss_building3.mp4
25151,1064,350,507,diss_building3.mp4
25175,1064,349,508,diss_building3.mp4
25202,1064,348,508,diss_building3.mp4
25225,1064,347,509,diss_building3.mp4
25249,1064,345,511,diss_building3.mp4
25273,1064,344,512,diss_building3.mp4
25286,1064,343,512,diss_building3.mp4
25310,1064,341,515,diss_building3.mp4
25323,1064,339,516,diss_building3.mp4
25348,1064,338,519,diss_building3.mp4
25360,1064,338,520,diss_building3.mp4
25384,1064,336,521,diss_building3.mp4
25519,1064,335,521,diss_building3.mp4
26180,1064,334,522,diss_building3.mp4
26192,1064,333,522,diss_building3.mp4
26204,1064,331,523,diss_building3.mp4
26229,1064,330,523,diss_building3.mp4
26241,1064,329,523,diss_building3.mp4
26291,1064,328,523,diss_building3.mp4
26327,1064,327,523,diss_building3.mp4
26389,1064,326,523,diss_building3.mp4
26426,1064,324,524,diss_building3.mp4
26451,1064,323,524,diss_building3.mp4
26720,1064,323,525,diss_building3.mp4
26976,1064,324,525,diss_building3.mp4
26989,1064,325,525,diss_building3.mp4
27002,1064,326,525,diss_building3.mp4
27025,1064,331,525,diss_building3.mp4
27051,1064,338,525,diss_building3.mp4
27074,1064,345,524,diss_building3.mp4
27086,1064,350,524,diss_building3.mp4
27112,1064,358,523,diss_building3.mp4
27123,1064,361,522,diss_building3.mp4
27148,1064,366,522,diss_building3.mp4
27174,1064,369,522,diss_building3.mp4
27185,1064,371,522,diss_building3.mp4
27210,1064,372,522,diss_building3.mp4
0,1065,634,359,diss_car15.mp4
12,1065,633,362,diss_car15.mp4
37,1065,630,367,diss_car15.mp4
61,1065,626,376,diss_car15.mp4
74,1065,623,382,diss_car15.mp4
98,1065,617,396,diss_car15.mp4
110,1065,613,405,diss_car15.mp4
135,1065,605,423,diss_car15.mp4
160,1065,598,440,diss_car15.mp4
171,1065,596,446,diss_car15.mp4
196,1065,589,461,diss_car15.mp4
221,1065,582,477,diss_car15.mp4
233,1065,578,485,diss_car15.mp4
257,1065,572,500,diss_car15.mp4
281,1065,567,510,diss_car15.mp4
294,1065,566,513,diss_car15.mp4
319,1065,563,519,diss_car15.mp4
343,1065,560,523,diss_car15.mp4
356,1065,558,526,diss_car15.mp4
381,1065,556,530,diss_car15.mp4
393,1065,555,531,diss_car15.mp4
416,1065,554,533,diss_car15.mp4
516,1065,553,533,diss_car15.mp4
760,1065,553,532,diss_car15.mp4
772,1065,553,530,diss_car15.mp4
798,1065,554,527,diss_car15.mp4
823,1065,556,523,diss_car15.mp4
835,1065,557,522,diss_car15.mp4
858,1065,558,520,diss_car15.mp4
870,1065,558,519,diss_car15.mp4
1042,1065,559,519,diss_car15.mp4
1066,1065,559,518,diss_car15.mp4
1276,1065,559,516,diss_car15.mp4
1286,1065,559,513,diss_car15.mp4
1298,1065,559,508,diss_car15.mp4
1324,1065,559,492,diss_car15.mp4
1336,1065,557,480,diss_car15.mp4
1361,1065,549,451,diss_car15.mp4
1396,1065,538,396,diss_car15.mp4
1409,1065,537,381,diss_car15.mp4
1421,1065,537,368,diss_car15.mp4
1433,1065,537,356,diss_car15.mp4
1458,1065,537,339,diss_car15.mp4
1481,1065,539,327,diss_car15.mp4
1494,1065,542,323,diss_car15.mp4
1519,1065,546,316,diss_car15.mp4
1543,1065,549,314,diss_car15.mp4
1556,1065,551,314,diss_car15.mp4
1863,1065,550,313,diss_car15.mp4
1876,1065,549,312,diss_car15.mp4
1899,1065,542,307,diss_car15.mp4
1925,1065,530,298,diss_car15.mp4
1936,1065,524,293,diss_car15.mp4
1961,1065,513,285,diss_car15.mp4
1986,1065,505,282,diss_car15.mp4
1998,1065,503,280,diss_car15.mp4
2023,1065,499,280,diss_car15.mp4
2035,1065,497,280,diss_car15.mp4
2059,1065,492,280,diss_car15.mp4
2084,1065,485,280,diss_car15.mp4
2108,1065,474,282,diss_car15.mp4
2120,1065,467,285,diss_car15.mp4
2144,1065,451,291,diss_car15.mp4
2156,1065,444,294,diss_car15.mp4
2181,1065,427,298,diss_car15.mp4
2206,1065,413,302,diss_car15.mp4
2216,1065,406,304,diss_car15.mp4
2242,1065,396,306,diss_car15.mp4
2266,1065,391,306,diss_car15.mp4
2278,1065,390,306,diss_car15.mp4
2291,1065,389,306,diss_car15.mp4
2315,1065,388,306,diss_car15.mp4
2488,1065,389,306,diss_car15.mp4
2500,1065,390,305,diss_car15.mp4
2524,1065,398,301,diss_car15.mp4
2549,1065,414,294,diss_car15.mp4
2561,1065,423,290,diss_car15.mp4
2586,1065,442,280,diss_car15.mp4
2598,1065,449,277,diss_car15.mp4
2622,1065,461,272,diss_car15.mp4
2647,1065,468,268,diss_car15.mp4
2659,1065,472,267,diss_car15.mp4
2684,1065,480,262,diss_car15.mp4
2707,1065,489,255,diss_car15.mp4
2732,1065,503,244,diss_car15.mp4
2744,1065,509,239,diss_car15.mp4
2769,1065,524,229,diss_car15.mp4
2782,1065,532,223,diss_car15.mp4
2806,1065,546,214,diss_car15.mp4
2830,1065,558,206,diss_car15.mp4
2843,1065,562,203,diss_car15.mp4
2868,1065,570,201,diss_car15.mp4
2880,1065,573,200,diss_car15.mp4
3211,1065,576,199,diss_car15.mp4
3223,1065,580,198,diss_car15.mp4
3247,1065,603,189,diss_car15.mp4
3259,1065,633,181,diss_car15.mp4
3283,1065,700,165,diss_car15.mp4
3307,1065,750,156,diss_car15.mp4
3320,1065,763,155,diss_car15.mp4
3345,1065,782,152,diss_car15.mp4
3369,1065,793,151,diss_car15.mp4
3382,1065,796,151,diss_car15.mp4
3406,1065,804,150,diss_car15.mp4
3430,1065,810,150,diss_car15.mp4
3442,1065,811,150,diss_car15.mp4
3468,1065,813,150,diss_car15.mp4
3834,1065,814,150,diss_car15.mp4
3859,1065,816,150,diss_car15.mp4
3884,1065,817,150,diss_car15.mp4
3896,1065,819,150,diss_car15.mp4
3921,1065,821,150,diss_car15.mp4
3933,1065,822,150,diss_car15.mp4
3946,1065,823,151,diss_car15.mp4
3969,1065,825,153,diss_car15.mp4
3982,1065,827,155,diss_car15.mp4
4007,1065,828,158,diss_car15.mp4
4032,1065,830,161,diss_car15.mp4
4043,1065,831,163,diss_car15.mp4
4068,1065,832,165,diss_car15.mp4
4093,1065,834,167,diss_car15.mp4
4105,1065,835,169,diss_car15.mp4
4130,1065,837,173,diss_car15.mp4
4142,1065,839,175,diss_car15.mp4
4166,1065,843,184,diss_car15.mp4
4190,1065,851,196,diss_car15.mp4
4203,1065,856,203,diss_car15.mp4
4228,1065,866,216,diss_car15.mp4
4251,1065,874,229,diss_car15.mp4
4265,1065,878,234,diss_car15.mp4
4289,1065,882,243,diss_car15.mp4
4312,1065,884,247,diss_car15.mp4
4325,1065,884,249,diss_car15.mp4
4337,1065,885,249,diss_car15.mp4
4657,1065,886,250,diss_car15.mp4
4669,1065,887,250,diss_car15.mp4
4680,1065,888,252,diss_car15.mp4
4705,1065,893,255,diss_car15.mp4
4730,1065,896,259,diss_car15.mp4
4743,1065,899,260,diss_car15.mp4
4767,1065,903,264,diss_car15.mp4
4792,1065,907,268,diss_car15.mp4
4803,1065,909,270,diss_car15.mp4
4829,1065,914,274,diss_car15.mp4
4853,1065,917,276,diss_car15.mp4
4876,1065,918,277,diss_car15.mp4
4950,1065,919,277,diss_car15.mp4
4974,1065,919,278,diss_car15.mp4
5086,1065,919,279,diss_car15.mp4
5098,1065,920,279,diss_car15.mp4
5122,1065,920,280,diss_car15.mp4
5147,1065,921,280,diss_car15.mp4
5269,1065,920,280,diss_car15.mp4
5282,1065,916,279,diss_car15.mp4
5294,1065,912,276,diss_car15.mp4
5306,1065,908,274,diss_car15.mp4
5330,1065,900,269,diss_car15.mp4
5354,1065,894,266,diss_car15.mp4
5368,1065,892,265,diss_car15.mp4
5391,1065,886,262,diss_car15.mp4
5416,1065,883,261,diss_car15.mp4
5440,1065,882,261,diss_car15.mp4
5514,1065,880,260,diss_car15.mp4
5526,1065,879,260,diss_car15.mp4
5538,1065,878,260,diss_car15.mp4
5563,1065,877,260,diss_car15.mp4
6310,1065,874,261,diss_car15.mp4
6336,1065,870,263,diss_car15.mp4
6348,1065,867,264,diss_car15.mp4
6372,1065,860,266,diss_car15.mp4
6396,1065,857,267,diss_car15.mp4
6421,1065,852,269,diss_car15.mp4
6432,1065,851,270,diss_car15.mp4
6457,1065,848,270,diss_car15.mp4
6469,1065,847,270,diss_car15.mp4
6494,1065,845,270,diss_car15.mp4
6519,1065,842,272,diss_car15.mp4
6531,1065,840,272,diss_car15.mp4
6554,1065,835,272,diss_car15.mp4
6566,1065,834,273,diss_car15.mp4
6592,1065,830,274,diss_car15.mp4
6616,1065,827,275,diss_car15.mp4
6628,1065,825,275,diss_car15.mp4
6653,1065,821,276,diss_car15.mp4
6677,1065,819,277,diss_car15.mp4
6689,1065,817,277,diss_car15.mp4
6715,1065,814,280,diss_car15.mp4
6738,1065,809,286,diss_car15.mp4
6751,1065,806,291,diss_car15.mp4
6775,1065,796,305,diss_car15.mp4
6787,1065,791,313,diss_car15.mp4
6813,1065,779,334,diss_car15.mp4
6837,1065,768,352,diss_car15.mp4
6848,1065,763,358,diss_car15.mp4
6873,1065,756,368,diss_car15.mp4
6898,1065,752,376,diss_car15.mp4
6910,1065,750,379,diss_car15.mp4
6934,1065,747,385,diss_car15.mp4
6959,1065,745,388,diss_car15.mp4
6972,1065,743,390,diss_car15.mp4
6995,1065,742,392,diss_car15.mp4
7008,1065,741,394,diss_car15.mp4
7021,1065,741,395,diss_car15.mp4
7045,1065,741,396,diss_car15.mp4
7659,1065,739,396,diss_car15.mp4
7669,1065,734,398,diss_car15.mp4
7696,1065,724,403,diss_car15.mp4
7719,1065,711,409,diss_car15.mp4
7731,1065,705,411,diss_car15.mp4
7756,1065,697,415,diss_car15.mp4
7768,1065,694,417,diss_car15.mp4
7793,1065,688,418,diss_car15.mp4
7817,1065,683,420,diss_car15.mp4
7830,1065,681,421,diss_car15.mp4
7853,1065,676,421,diss_car15.mp4
7878,1065,668,424,diss_car15.mp4
7891,1065,663,425,diss_car15.mp4
7915,1065,653,428,diss_car15.mp4
7939,1065,641,431,diss_car15.mp4
7952,1065,635,433,diss_car15.mp4
7976,1065,623,437,diss_car15.mp4
7989,1065,618,440,diss_car15.mp4
8013,1065,609,445,diss_car15.mp4
8038,1065,600,451,diss_car15.mp4
8050,1065,597,455,diss_car15.mp4
8074,1065,590,461,diss_car15.mp4
8099,1065,583,467,diss_car15.mp4
8111,1065,580,471,diss_car15.mp4
8135,1065,573,481,diss_car15.mp4
8159,1065,564,495,diss_car15.mp4
8172,1065,561,499,diss_car15.mp4
8196,1065,554,508,diss_car15.mp4
8208,1065,551,511,diss_car15.mp4
8234,1065,545,520,diss_car15.mp4
8258,1065,537,528,diss_car15.mp4
8270,1065,534,533,diss_car15.mp4
8295,1065,530,537,diss_car15.mp4
8319,1065,528,540,diss_car15.mp4
8332,1065,527,541,diss_car15.mp4
8344,1065,526,541,diss_car15.mp4
8712,1065,525,542,diss_car15.mp4
8724,1065,522,542,diss_car15.mp4
8736,1065,519,542,diss_car15.mp4
8760,1065,508,544,diss_car15.mp4
8773,1065,501,545,diss_car15.mp4
8798,1065,484,549,diss_car15.mp4
8821,1065,472,552,diss_car15.mp4
8833,1065,467,553,diss_car15.mp4
8857,1065,461,555,diss_car15.mp4
8882,1065,455,557,diss_car15.mp4
8895,1065,451,557,diss_car15.mp4
8920,1065,448,559,diss_car15.mp4
8931,1065,447,560,diss_car15.mp4
8956,1065,443,560,diss_car15.mp4
8981,1065,438,562,diss_car15.mp4
8994,1065,436,562,diss_car15.mp4
9017,1065,430,564,diss_car15.mp4
9042,1065,423,566,diss_car15.mp4
9055,1065,419,566,diss_car15.mp4
9079,1065,405,569,diss_car15.mp4
9103,1065,388,574,diss_car15.mp4
9116,1065,380,576,diss_car15.mp4
9140,1065,363,581,diss_car15.mp4
9151,1065,356,584,diss_car15.mp4
9728,1065,356,583,diss_car15.mp4
9742,1065,358,581,diss_car15.mp4
9765,1065,365,576,diss_car15.mp4
9778,1065,369,573,diss_car15.mp4
9802,1065,380,568,diss_car15.mp4
9826,1065,390,564,diss_car15.mp4
9839,1065,392,562,diss_car15.mp4
9863,1065,397,561,diss_car15.mp4
9875,1065,398,561,diss_car15.mp4
9900,1065,402,560,diss_car15.mp4
9925,1065,403,560,diss_car15.mp4
9937,1065,405,559,diss_car15.mp4
9961,1065,407,558,diss_car15.mp4
9974,1065,409,558,diss_car15.mp4
9998,1065,412,556,diss_car15.mp4
10023,1065,417,553,diss_car15.mp4
10047,1065,423,551,diss_car15.mp4
10059,1065,424,549,diss_car15.mp4
10071,1065,426,549,diss_car15.mp4
10108,1065,427,549,diss_car15.mp4
10477,1065,426,549,diss_car15.mp4
10503,1065,425,549,diss_car15.mp4
10514,1065,425,548,diss_car15.mp4
10526,1065,424,548,diss_car15.mp4
11346,1065,423,548,diss_car15.mp4
11358,1065,421,547,diss_car15.mp4
11382,1065,416,547,diss_car15.mp4
11407,1065,412,547,diss_car15.mp4
11420,1065,411,546,diss_car15.mp4
11444,1065,406,545,diss_car15.mp4
11467,1065,402,544,diss_car15.mp4
11481,1065,400,544,diss_car15.mp4
11493,1065,398,543,diss_car15.mp4
11518,1065,397,543,diss_car15.mp4
11542,1065,394,542,diss_car15.mp4
11554,1065,392,542,diss_car15.mp4
11578,1065,389,542,diss_car15.mp4
11603,1065,385,541,diss_car15.mp4
11627,1065,380,540,diss_car15.mp4
11640,1065,378,539,diss_car15.mp4
11664,1065,373,538,diss_car15.mp4
11676,1065,371,537,diss_car15.mp4
11701,1065,366,536,diss_car15.mp4
11726,1065,358,534,diss_car15.mp4
11738,1065,355,533,diss_car15.mp4
11762,1065,346,532,diss_car15.mp4
11787,1065,338,530,diss_car15.mp4
11799,1065,335,529,diss_car15.mp4
11824,1065,329,529,diss_car15.mp4
11847,1065,324,528,diss_car15.mp4
11860,1065,323,528,diss_car15.mp4
11885,1065,321,528,diss_car15.mp4
12241,1065,319,528,diss_car15.mp4
12253,1065,318,528,diss_car15.mp4
12266,1065,315,528,diss_car15.mp4
12290,1065,306,527,diss_car15.mp4
12314,1065,298,525,diss_car15.mp4
12327,1065,293,523,diss_car15.mp4
12351,1065,285,521,diss_car15.mp4
12363,1065,281,520,diss_car15.mp4
12387,1065,277,519,diss_car15.mp4
12412,1065,274,518,diss_car15.mp4
12436,1065,272,518,diss_car15.mp4
12461,1065,271,518,diss_car15.mp4
12473,1065,270,518,diss_car15.mp4
12485,1065,269,518,diss_car15.mp4
12510,1065,265,518,diss_car15.mp4
12522,1065,262,519,diss_car15.mp4
12547,1065,260,520,diss_car15.mp4
12571,1065,256,520,diss_car15.mp4
12583,1065,255,520,diss_car15.mp4
12608,1065,252,520,diss_car15.mp4
12632,1065,250,520,diss_car15.mp4
12644,1065,249,520,diss_car15.mp4
12669,1065,247,520,diss_car15.mp4
12681,1065,246,519,diss_car15.mp4
12706,1065,244,516,diss_car15.mp4
12730,1065,244,513,diss_car15.mp4
12742,1065,244,512,diss_car15.mp4
12767,1065,243,508,diss_car15.mp4
12791,1065,243,507,diss_car15.mp4
12803,1065,243,506,diss_car15.mp4
12828,1065,243,503,diss_car15.mp4
12851,1065,243,500,diss_car15.mp4
12864,1065,244,499,diss_car15.mp4
12889,1065,246,494,diss_car15.mp4
12913,1065,247,491,diss_car15.mp4
12926,1065,247,489,diss_car15.mp4
12950,1065,248,487,diss_car15.mp4
12963,1065,249,486,diss_car15.mp4
12988,1065,250,484,diss_car15.mp4
13012,1065,251,483,diss_car15.mp4
13024,1065,251,482,diss_car15.mp4
13049,1065,252,481,diss_car15.mp4
13355,1065,251,479,diss_car15.mp4
13368,1065,248,476,diss_car15.mp4
13392,1065,235,463,diss_car15.mp4
13404,1065,227,454,diss_car15.mp4
13430,1065,207,434,diss_car15.mp4
13453,1065,190,415,diss_car15.mp4
13466,1065,182,408,diss_car15.mp4
13490,1065,171,393,diss_car15.mp4
13502,1065,165,386,diss_car15.mp4
13526,1065,156,372,diss_car15.mp4
13551,1065,149,363,diss_car15.mp4
13563,1065,148,359,diss_car15.mp4
13587,1065,143,351,diss_car15.mp4
13612,1065,141,346,diss_car15.mp4
13624,1065,140,344,diss_car15.mp4
13649,1065,139,341,diss_car15.mp4
13661,1065,139,340,diss_car15.mp4
13955,1065,138,339,diss_car15.mp4
13969,1065,136,338,diss_car15.mp4
13993,1065,130,332,diss_car15.mp4
14004,1065,128,329,diss_car15.mp4
14030,1065,124,325,diss_car15.mp4
14053,1065,121,322,diss_car15.mp4
14065,1065,121,321,diss_car15.mp4
14090,1065,119,319,diss_car15.mp4
14102,1065,119,318,diss_car15.mp4
14126,1065,118,318,diss_car15.mp4
14152,1065,118,316,diss_car15.mp4
14164,1065,118,315,diss_car15.mp4
14189,1065,116,314,diss_car15.mp4
14213,1065,116,311,diss_car15.mp4
14226,1065,116,309,diss_car15.mp4
14251,1065,116,307,diss_car15.mp4
14275,1065,115,305,diss_car15.mp4
14299,1065,115,304,diss_car15.mp4
14312,1065,115,303,diss_car15.mp4
14324,1065,115,302,diss_car15.mp4
14348,1065,115,301,diss_car15.mp4
14372,1065,115,300,diss_car15.mp4
14386,1065,115,299,diss_car15.mp4
14410,1065,115,298,diss_car15.mp4
14421,1065,115,297,diss_car15.mp4
14447,1065,115,296,diss_car15.mp4
14458,1065,115,295,diss_car15.mp4
14495,1065,115,294,diss_car15.mp4
14533,1065,115,293,diss_car15.mp4
14555,1065,115,292,diss_car15.mp4
14568,1065,115,291,diss_car15.mp4
14593,1065,115,289,diss_car15.mp4
14605,1065,115,287,diss_car15.mp4
14629,1065,115,283,diss_car15.mp4
14653,1065,117,280,diss_car15.mp4
14665,1065,118,278,diss_car15.mp4
14678,1065,119,277,diss_car15.mp4
14985,1065,119,273,diss_car15.mp4
0,1068,630,362,diss_bike3.mp4
14,1068,629,362,diss_bike3.mp4
39,1068,625,360,diss_bike3.mp4
62,1068,619,360,diss_bike3.mp4
73,1068,617,358,diss_bike3.mp4
98,1068,612,355,diss_bike3.mp4
123,1068,607,352,diss_bike3.mp4
135,1068,606,351,diss_bike3.mp4
160,1068,604,347,diss_bike3.mp4
171,1068,604,346,diss_bike3.mp4
195,1068,604,341,diss_bike3.mp4
221,1068,604,336,diss_bike3.mp4
233,1068,605,333,diss_bike3.mp4
258,1068,608,327,diss_bike3.mp4
283,1068,613,319,diss_bike3.mp4
295,1068,615,314,diss_bike3.mp4
318,1068,618,304,diss_bike3.mp4
342,1068,621,295,diss_bike3.mp4
354,1068,622,289,diss_bike3.mp4
379,1068,625,279,diss_bike3.mp4
404,1068,626,269,diss_bike3.mp4
416,1068,626,265,diss_bike3.mp4
442,1068,626,254,diss_bike3.mp4
464,1068,626,240,diss_bike3.mp4
477,1068,626,233,diss_bike3.mp4
502,1068,625,222,diss_bike3.mp4
515,1068,624,219,diss_bike3.mp4
540,1068,623,214,diss_bike3.mp4
564,1068,623,212,diss_bike3.mp4
576,1068,623,211,diss_bike3.mp4
601,1068,623,209,diss_bike3.mp4
612,1068,623,208,diss_bike3.mp4
637,1068,623,207,diss_bike3.mp4
662,1068,623,206,diss_bike3.mp4
956,1068,623,204,diss_bike3.mp4
968,1068,623,202,diss_bike3.mp4
980,1068,622,200,diss_bike3.mp4
1004,1068,622,194,diss_bike3.mp4
1017,1068,622,189,diss_bike3.mp4
1041,1068,622,176,diss_bike3.mp4
1065,1068,624,163,diss_bike3.mp4
1078,1068,626,156,diss_bike3.mp4
1103,1068,628,148,diss_bike3.mp4
1115,1068,629,145,diss_bike3.mp4
1140,1068,631,140,diss_bike3.mp4
1163,1068,633,135,diss_bike3.mp4
1176,1068,634,133,diss_bike3.mp4
1201,1068,635,129,diss_bike3.mp4
1225,1068,636,126,diss_bike3.mp4
1237,1068,636,125,diss_bike3.mp4
1262,1068,638,123,diss_bike3.mp4
1286,1068,639,121,diss_bike3.mp4
1299,1068,639,120,diss_bike3.mp4
1323,1068,640,119,diss_bike3.mp4
1335,1068,640,118,diss_bike3.mp4
1396,1068,641,117,diss_bike3.mp4
1422,1068,642,115,diss_bike3.mp4
1433,1068,642,114,diss_bike3.mp4
1459,1068,644,112,diss_bike3.mp4
1482,1068,646,109,diss_bike3.mp4
1507,1068,652,105,diss_bike3.mp4
1519,1068,656,103,diss_bike3.mp4
1544,1068,661,100,diss_bike3.mp4
1556,1068,663,100,diss_bike3.mp4
1581,1068,666,100,diss_bike3.mp4
1605,1068,668,100,diss_bike3.mp4
2010,1068,668,99,diss_bike3.mp4
2024,1068,668,97,diss_bike3.mp4
2047,1068,671,93,diss_bike3.mp4
2071,1068,676,86,diss_bike3.mp4
2084,1068,678,82,diss_bike3.mp4
2108,1068,685,77,diss_bike3.mp4
2133,1068,691,74,diss_bike3.mp4
2145,1068,693,73,diss_bike3.mp4
2169,1068,697,71,diss_bike3.mp4
2181,1068,699,71,diss_bike3.mp4
2205,1068,702,70,diss_bike3.mp4
2230,1068,705,68,diss_bike3.mp4
2242,1068,706,68,diss_bike3.mp4
2267,1068,709,66,diss_bike3.mp4
2279,1068,710,66,diss_bike3.mp4
2304,1068,712,65,diss_bike3.mp4
2317,1068,713,65,diss_bike3.mp4
2341,1068,714,65,diss_bike3.mp4
2353,1068,715,65,diss_bike3.mp4
2389,1068,717,64,diss_bike3.mp4
2413,1068,719,64,diss_bike3.mp4
2474,1068,720,64,diss_bike3.mp4
2586,1068,720,65,diss_bike3.mp4
2598,1068,720,66,diss_bike3.mp4
2623,1068,720,68,diss_bike3.mp4
2647,1068,720,74,diss_bike3.mp4
2672,1068,720,82,diss_bike3.mp4
2684,1068,720,87,diss_bike3.mp4
2709,1068,718,101,diss_bike3.mp4
2720,1068,716,111,diss_bike3.mp4
2746,1068,711,132,diss_bike3.mp4
2768,1068,705,157,diss_bike3.mp4
2781,1068,702,170,diss_bike3.mp4
2805,1068,698,192,diss_bike3.mp4
2830,1068,695,210,diss_bike3.mp4
2843,1068,695,215,diss_bike3.mp4
2867,1068,694,222,diss_bike3.mp4
2878,1068,693,225,diss_bike3.mp4
2890,1068,693,226,diss_bike3.mp4
2915,1068,693,227,diss_bike3.mp4
3357,1068,693,228,diss_bike3.mp4
3371,1068,695,228,diss_bike3.mp4
3383,1068,697,229,diss_bike3.mp4
3408,1068,705,234,diss_bike3.mp4
3432,1068,716,242,diss_bike3.mp4
3457,1068,728,251,diss_bike3.mp4
3467,1068,734,255,diss_bike3.mp4
3491,1068,743,261,diss_bike3.mp4
3504,1068,748,263,diss_bike3.mp4
3529,1068,754,264,diss_bike3.mp4
3553,1068,763,265,diss_bike3.mp4
3566,1068,768,265,diss_bike3.mp4
3590,1068,778,265,diss_bike3.mp4
3603,1068,787,265,diss_bike3.mp4
3626,1068,802,263,diss_bike3.mp4
3651,1068,814,263,diss_bike3.mp4
3663,1068,818,263,diss_bike3.mp4
3687,1068,824,266,diss_bike3.mp4
3711,1068,826,269,diss_bike3.mp4
3724,1068,826,270,diss_bike3.mp4
4069,1068,828,270,diss_bike3.mp4
4093,1068,831,270,diss_bike3.mp4
4105,1068,834,271,diss_bike3.mp4
4128,1068,844,274,diss_bike3.mp4
4140,1068,850,275,diss_bike3.mp4
4165,1068,864,277,diss_bike3.mp4
4189,1068,877,279,diss_bike3.mp4
4201,1068,884,280,diss_bike3.mp4
4227,1068,896,281,diss_bike3.mp4
4251,1068,907,283,diss_bike3.mp4
4264,1068,911,283,diss_bike3.mp4
4289,1068,920,285,diss_bike3.mp4
4312,1068,927,288,diss_bike3.mp4
4326,1068,932,289,diss_bike3.mp4
4349,1068,940,291,diss_bike3.mp4
4374,1068,950,297,diss_bike3.mp4
4386,1068,955,301,diss_bike3.mp4
4410,1068,966,312,diss_bike3.mp4
4434,1068,980,326,diss_bike3.mp4
4447,1068,990,334,diss_bike3.mp4
4472,1068,1006,352,diss_bike3.mp4
4484,1068,1012,359,diss_bike3.mp4
4509,1068,1021,367,diss_bike3.mp4
4925,1068,1024,367,diss_bike3.mp4
4937,1068,1028,368,diss_bike3.mp4
4950,1068,1034,371,diss_bike3.mp4
4975,1068,1049,378,diss_bike3.mp4
4999,1068,1063,388,diss_bike3.mp4
5011,1068,1069,393,diss_bike3.mp4
5036,1068,1079,403,diss_bike3.mp4
5048,1068,1083,407,diss_bike3.mp4
5072,1068,1086,411,diss_bike3.mp4
5085,1068,1089,414,diss_bike3.mp4
5110,1068,1092,418,diss_bike3.mp4
5133,1068,1096,424,diss_bike3.mp4
5146,1068,1096,425,diss_bike3.mp4
5171,1068,1098,428,diss_bike3.mp4
5182,1068,1098,429,diss_bike3.mp4
5305,1068,1096,429,diss_bike3.mp4
5319,1068,1090,429,diss_bike3.mp4
5331,1068,1085,429,diss_bike3.mp4
5354,1068,1072,436,diss_bike3.mp4
5366,1068,1061,444,diss_bike3.mp4
5390,1068,1032,476,diss_bike3.mp4
5415,1068,1004,508,diss_bike3.mp4
5427,1068,990,523,diss_bike3.mp4
5453,1068,967,546,diss_bike3.mp4
5477,1068,951,561,diss_bike3.mp4
5488,1068,943,567,diss_bike3.mp4
5514,1068,935,575,diss_bike3.mp4
5537,1068,926,581,diss_bike3.mp4
5550,1068,923,585,diss_bike3.mp4
5574,1068,914,595,diss_bike3.mp4
5587,1068,911,597,diss_bike3.mp4
5599,1068,906,599,diss_bike3.mp4
5954,1068,905,599,diss_bike3.mp4
5968,1068,903,599,diss_bike3.mp4
5993,1068,897,598,diss_bike3.mp4
6017,1068,892,594,diss_bike3.mp4
6029,1068,890,592,diss_bike3.mp4
6053,1068,888,588,diss_bike3.mp4
6064,1068,888,586,diss_bike3.mp4
6089,1068,888,581,diss_bike3.mp4
6114,1068,888,576,diss_bike3.mp4
6128,1068,888,574,diss_bike3.mp4
6150,1068,888,571,diss_bike3.mp4
6174,1068,888,567,diss_bike3.mp4
6187,1068,888,565,diss_bike3.mp4
6211,1068,887,562,diss_bike3.mp4
6236,1068,886,557,diss_bike3.mp4
6249,1068,885,556,diss_bike3.mp4
6261,1068,884,554,diss_bike3.mp4
6297,1068,882,550,diss_bike3.mp4
6310,1068,882,549,diss_bike3.mp4
6334,1068,881,547,diss_bike3.mp4
6360,1068,881,546,diss_bike3.mp4
6383,1068,881,544,diss_bike3.mp4
6396,1068,882,542,diss_bike3.mp4
6420,1068,888,537,diss_bike3.mp4
6433,1068,892,535,diss_bike3.mp4
6458,1068,900,530,diss_bike3.mp4
6470,1068,902,529,diss_bike3.mp4
6493,1068,907,527,diss_bike3.mp4
6518,1068,910,527,diss_bike3.mp4
6530,1068,910,526,diss_bike3.mp4
6641,1068,907,526,diss_bike3.mp4
6654,1068,905,526,diss_bike3.mp4
6678,1068,898,526,diss_bike3.mp4
6689,1068,893,526,diss_bike3.mp4
6714,1068,888,526,diss_bike3.mp4
6726,1068,886,526,diss_bike3.mp4
6751,1068,885,526,diss_bike3.mp4
6775,1068,885,525,diss_bike3.mp4
6799,1068,884,525,diss_bike3.mp4
6812,1068,884,524,diss_bike3.mp4
6837,1068,884,522,diss_bike3.mp4
6849,1068,884,521,diss_bike3.mp4
6874,1068,884,519,diss_bike3.mp4
6897,1068,884,518,diss_bike3.mp4
7169,1068,883,518,diss_bike3.mp4
7180,1068,879,517,diss_bike3.mp4
7192,1068,872,515,diss_bike3.mp4
7217,1068,837,495,diss_bike3.mp4
7241,1068,758,437,diss_bike3.mp4
7252,1068,715,410,diss_bike3.mp4
7278,1068,659,375,diss_bike3.mp4
7302,1068,634,364,diss_bike3.mp4
7314,1068,628,362,diss_bike3.mp4
7339,1068,623,362,diss_bike3.mp4
7351,1068,622,362,diss_bike3.mp4
7363,1068,621,362,diss_bike3.mp4
7646,1068,621,361,diss_bike3.mp4
7658,1068,620,360,diss_bike3.mp4
7682,1068,619,355,diss_bike3.mp4
7694,1068,618,352,diss_bike3.mp4
7719,1068,618,349,diss_bike3.mp4
7731,1068,618,347,diss_bike3.mp4
7756,1068,618,342,diss_bike3.mp4
7768,1068,619,338,diss_bike3.mp4
7792,1068,622,331,diss_bike3.mp4
7817,1068,624,323,diss_bike3.mp4
7830,1068,626,321,diss_bike3.mp4
7853,1068,626,316,diss_bike3.mp4
7866,1068,627,314,diss_bike3.mp4
7890,1068,628,313,diss_bike3.mp4
8553,1068,628,312,diss_bike3.mp4
8565,1068,628,311,diss_bike3.mp4
8578,1068,628,310,diss_bike3.mp4
8590,1068,628,308,diss_bike3.mp4
8613,1068,628,307,diss_bike3.mp4
8638,1068,628,306,diss_bike3.mp4
8662,1068,627,304,diss_bike3.mp4
8674,1068,626,303,diss_bike3.mp4
8700,1068,623,299,diss_bike3.mp4
8723,1068,622,297,diss_bike3.mp4
8736,1068,622,296,diss_bike3.mp4
8761,1068,621,294,diss_bike3.mp4
8785,1068,620,292,diss_bike3.mp4
8798,1068,620,290,diss_bike3.mp4
8821,1068,620,287,diss_bike3.mp4
8835,1068,620,285,diss_bike3.mp4
8858,1068,621,281,diss_bike3.mp4
8882,1068,623,277,diss_bike3.mp4
8895,1068,624,275,diss_bike3.mp4
8920,1068,627,270,diss_bike3.mp4
8944,1068,630,266,diss_bike3.mp4
8957,1068,632,264,diss_bike3.mp4
8981,1068,635,261,diss_bike3.mp4
9006,1068,637,259,diss_bike3.mp4
9018,1068,637,258,diss_bike3.mp4
9055,1068,637,257,diss_bike3.mp4
9116,1068,638,257,diss_bike3.mp4
9140,1068,639,256,diss_bike3.mp4
11004,1068,639,255,diss_bike3.mp4
11029,1068,639,251,diss_bike3.mp4
11040,1068,639,249,diss_bike3.mp4
11063,1068,639,245,diss_bike3.mp4
11088,1068,638,239,diss_bike3.mp4
11100,1068,637,235,diss_bike3.mp4
11125,1068,637,226,diss_bike3.mp4
11138,1068,636,221,diss_bike3.mp4
11162,1068,635,211,diss_bike3.mp4
11187,1068,632,204,diss_bike3.mp4
11199,1068,631,202,diss_bike3.mp4
11223,1068,629,198,diss_bike3.mp4
11247,1068,627,196,diss_bike3.mp4
11259,1068,627,195,diss_bike3.mp4
11284,1068,625,192,diss_bike3.mp4
11308,1068,624,189,diss_bike3.mp4
11332,1068,624,188,diss_bike3.mp4
11345,1068,624,187,diss_bike3.mp4
11369,1068,624,186,diss_bike3.mp4
11406,1068,624,185,diss_bike3.mp4
11443,1068,624,183,diss_bike3.mp4
11456,1068,624,181,diss_bike3.mp4
11480,1068,624,180,diss_bike3.mp4
11492,1068,624,179,diss_bike3.mp4
11517,1068,624,178,diss_bike3.mp4
11591,1068,625,177,diss_bike3.mp4
11603,1068,627,177,diss_bike3.mp4
11628,1068,632,175,diss_bike3.mp4
11872,1068,636,173,diss_bike3.mp4
11885,1068,642,171,diss_bike3.mp4
11909,1068,656,164,diss_bike3.mp4
11922,1068,663,161,diss_bike3.mp4
11947,1068,676,156,diss_bike3.mp4
11972,1068,689,153,diss_bike3.mp4
11995,1068,697,153,diss_bike3.mp4
12007,1068,700,153,diss_bike3.mp4
12032,1068,703,153,diss_bike3.mp4
12044,1068,704,154,diss_bike3.mp4
12070,1068,707,155,diss_bike3.mp4
12094,1068,709,156,diss_bike3.mp4
12107,1068,709,157,diss_bike3.mp4
12130,1068,710,157,diss_bike3.mp4
12142,1068,710,158,diss_bike3.mp4
12155,1068,710,159,diss_bike3.mp4
12192,1068,710,160,diss_bike3.mp4
12215,1068,710,161,diss_bike3.mp4
12228,1068,711,161,diss_bike3.mp4
12251,1068,712,161,diss_bike3.mp4
12265,1068,712,162,diss_bike3.mp4
12289,1068,712,163,diss_bike3.mp4
12302,1068,713,163,diss_bike3.mp4
12326,1068,714,164,diss_bike3.mp4
12350,1068,715,164,diss_bike3.mp4
12363,1068,716,164,diss_bike3.mp4
12424,1068,716,165,diss_bike3.mp4
12449,1068,716,167,diss_bike3.mp4
12461,1068,716,168,diss_bike3.mp4
12486,1068,716,170,diss_bike3.mp4
12510,1068,716,175,diss_bike3.mp4
12522,1068,716,179,diss_bike3.mp4
12547,1068,710,189,diss_bike3.mp4
12571,1068,699,204,diss_bike3.mp4
12584,1068,692,213,diss_bike3.mp4
12607,1068,678,227,diss_bike3.mp4
12631,1068,668,234,diss_bike3.mp4
12645,1068,665,236,diss_bike3.mp4
12670,1068,661,239,diss_bike3.mp4
12692,1068,659,241,diss_bike3.mp4
12706,1068,658,242,diss_bike3.mp4
12730,1068,656,243,diss_bike3.mp4
12742,1068,656,245,diss_bike3.mp4
12766,1068,654,246,diss_bike3.mp4
13048,1068,653,246,diss_bike3.mp4
13060,1068,651,247,diss_bike3.mp4
13072,1068,649,249,diss_bike3.mp4
13085,1068,646,250,diss_bike3.mp4
13109,1068,635,257,diss_bike3.mp4
13134,1068,615,273,diss_bike3.mp4
13147,1068,602,286,diss_bike3.mp4
13171,1068,578,308,diss_bike3.mp4
13184,1068,569,317,diss_bike3.mp4
13208,1068,556,330,diss_bike3.mp4
13233,1068,546,339,diss_bike3.mp4
13244,1068,542,342,diss_bike3.mp4
13269,1068,535,346,diss_bike3.mp4
13294,1068,532,347,diss_bike3.mp4
13331,1068,531,347,diss_bike3.mp4
13453,1068,532,345,diss_bike3.mp4
13466,1068,535,340,diss_bike3.mp4
13491,1068,550,326,diss_bike3.mp4
13502,1068,566,315,diss_bike3.mp4
13528,1068,623,286,diss_bike3.mp4
13551,1068,691,265,diss_bike3.mp4
13562,1068,720,260,diss_bike3.mp4
13587,1068,759,256,diss_bike3.mp4
13611,1068,780,257,diss_bike3.mp4
0,1063,651,372,diss_bike3.mp4
13,1063,650,372,diss_bike3.mp4
38,1063,648,370,diss_bike3.mp4
63,1063,645,369,diss_bike3.mp4
87,1063,643,367,diss_bike3.mp4
99,1063,643,365,diss_bike3.mp4
124,1063,640,363,diss_bike3.mp4
136,1063,638,362,diss_bike3.mp4
160,1063,632,355,diss_bike3.mp4
185,1063,624,345,diss_bike3.mp4
197,1063,620,340,diss_bike3.mp4
221,1063,611,332,diss_bike3.mp4
245,1063,602,321,diss_bike3.mp4
258,1063,599,315,diss_bike3.mp4
282,1063,596,306,diss_bike3.mp4
306,1063,595,300,diss_bike3.mp4
319,1063,595,298,diss_bike3.mp4
331,1063,595,296,diss_bike3.mp4
356,1063,596,296,diss_bike3.mp4
386,1063,596,296,diss_bike3.mp4
614,1063,597,291,diss_bike3.mp4
627,1063,598,284,diss_bike3.mp4
638,1063,600,275,diss_bike3.mp4
662,1063,606,252,diss_bike3.mp4
688,1063,614,227,diss_bike3.mp4
700,1063,620,215,diss_bike3.mp4
725,1063,627,195,diss_bike3.mp4
749,1063,636,180,diss_bike3.mp4
761,1063,639,174,diss_bike3.mp4
785,1063,646,162,diss_bike3.mp4
797,1063,650,157,diss_bike3.mp4
822,1063,658,147,diss_bike3.mp4
846,1063,669,139,diss_bike3.mp4
859,1063,672,138,diss_bike3.mp4
884,1063,679,134,diss_bike3.mp4
908,1063,684,134,diss_bike3.mp4
921,1063,686,134,diss_bike3.mp4
946,1063,689,134,diss_bike3.mp4
970,1063,692,134,diss_bike3.mp4
982,1063,693,134,diss_bike3.mp4
1265,1063,693,135,diss_bike3.mp4
1288,1063,693,142,diss_bike3.mp4
1300,1063,693,147,diss_bike3.mp4
1325,1063,690,161,diss_bike3.mp4
1337,1063,687,169,diss_bike3.mp4
1362,1063,676,194,diss_bike3.mp4
1386,1063,662,225,diss_bike3.mp4
1399,1063,657,237,diss_bike3.mp4
1423,1063,648,255,diss_bike3.mp4
1448,1063,644,263,diss_bike3.mp4
1459,1063,644,264,diss_bike3.mp4
1484,1063,644,265,diss_bike3.mp4
1704,1063,645,265,diss_bike3.mp4
1717,1063,649,265,diss_bike3.mp4
1729,1063,653,265,diss_bike3.mp4
1741,1063,664,265,diss_bike3.mp4
1765,1063,718,278,diss_bike3.mp4
1790,1063,815,315,diss_bike3.mp4
1802,1063,860,341,diss_bike3.mp4
1827,1063,923,388,diss_bike3.mp4
1851,1063,949,416,diss_bike3.mp4
1864,1063,955,426,diss_bike3.mp4
1888,1063,957,434,diss_bike3.mp4
2147,1063,960,435,diss_bike3.mp4
2170,1063,971,437,diss_bike3.mp4
2184,1063,982,438,diss_bike3.mp4
2207,1063,1005,442,diss_bike3.mp4
2219,1063,1015,443,diss_bike3.mp4
2243,1063,1023,445,diss_bike3.mp4
2268,1063,1024,446,diss_bike3.mp4
2428,1063,1026,445,diss_bike3.mp4
2441,1063,1028,442,diss_bike3.mp4
2465,1063,1032,434,diss_bike3.mp4
2489,1063,1035,427,diss_bike3.mp4
2501,1063,1037,425,diss_bike3.mp4
2526,1063,1039,421,diss_bike3.mp4
2551,1063,1041,417,diss_bike3.mp4
2562,1063,1042,416,diss_bike3.mp4
2587,1063,1043,409,diss_bike3.mp4
2612,1063,1046,403,diss_bike3.mp4
2624,1063,1046,401,diss_bike3.mp4
2649,1063,1047,399,diss_bike3.mp4
2673,1063,1047,397,diss_bike3.mp4
2686,1063,1047,396,diss_bike3.mp4
2709,1063,1049,393,diss_bike3.mp4
2721,1063,1050,392,diss_bike3.mp4
2735,1063,1050,390,diss_bike3.mp4
2771,1063,1051,390,diss_bike3.mp4
3040,1063,1049,389,diss_bike3.mp4
3053,1063,1045,387,diss_bike3.mp4
3065,1063,1040,385,diss_bike3.mp4
3090,1063,1024,375,diss_bike3.mp4
3115,1063,1007,365,diss_bike3.mp4
3126,1063,1000,362,diss_bike3.mp4
3152,1063,994,360,diss_bike3.mp4
3163,1063,993,359,diss_bike3.mp4
4118,1063,993,357,diss_bike3.mp4
4132,1063,992,356,diss_bike3.mp4
4156,1063,991,352,diss_bike3.mp4
4169,1063,990,349,diss_bike3.mp4
4192,1063,988,346,diss_bike3.mp4
4216,1063,986,341,diss_bike3.mp4
4227,1063,986,340,diss_bike3.mp4
4252,1063,985,338,diss_bike3.mp4
4264,1063,984,337,diss_bike3.mp4
4289,1063,984,336,diss_bike3.mp4
4375,1063,983,332,diss_bike3.mp4
4389,1063,982,331,diss_bike3.mp4
4400,1063,982,330,diss_bike3.mp4
4425,1063,982,329,diss_bike3.mp4
4498,1063,982,328,diss_bike3.mp4
4915,1063,981,327,diss_bike3.mp4
4927,1063,980,326,diss_bike3.mp4
4952,1063,979,323,diss_bike3.mp4
4964,1063,978,321,diss_bike3.mp4
4989,1063,974,317,diss_bike3.mp4
5012,1063,967,309,diss_bike3.mp4
5024,1063,963,303,diss_bike3.mp4
5049,1063,955,293,diss_bike3.mp4
5074,1063,948,284,diss_bike3.mp4
5086,1063,946,281,diss_bike3.mp4
5112,1063,942,276,diss_bike3.mp4
5135,1063,939,270,diss_bike3.mp4
5148,1063,936,266,diss_bike3.mp4
5173,1063,932,258,diss_bike3.mp4
5196,1063,928,254,diss_bike3.mp4
5209,1063,926,252,diss_bike3.mp4
5233,1063,923,248,diss_bike3.mp4
5257,1063,921,246,diss_bike3.mp4
5269,1063,920,245,diss_bike3.mp4
5294,1063,917,245,diss_bike3.mp4
5306,1063,916,244,diss_bike3.mp4
5331,1063,913,243,diss_bike3.mp4
5356,1063,909,243,diss_bike3.mp4
5835,1063,908,243,diss_bike3.mp4
5858,1063,907,243,diss_bike3.mp4
5872,1063,906,243,diss_bike3.mp4
5895,1063,904,243,diss_bike3.mp4
5919,1063,902,244,diss_bike3.mp4
5932,1063,902,245,diss_bike3.mp4
5956,1063,900,245,diss_bike3.mp4
5980,1063,899,246,diss_bike3.mp4
6005,1063,899,247,diss_bike3.mp4
6017,1063,898,247,diss_bike3.mp4
6532,1063,898,248,diss_bike3.mp4
6544,1063,898,249,diss_bike3.mp4
6556,1063,897,249,diss_bike3.mp4
6581,1063,896,250,diss_bike3.mp4
6593,1063,896,251,diss_bike3.mp4
6618,1063,895,254,diss_bike3.mp4
6630,1063,894,255,diss_bike3.mp4
6654,1063,891,259,diss_bike3.mp4
6678,1063,889,264,diss_bike3.mp4
6691,1063,887,266,diss_bike3.mp4
6718,1063,886,269,diss_bike3.mp4
6740,1063,885,270,diss_bike3.mp4
6764,1063,885,271,diss_bike3.mp4
6801,1063,885,272,diss_bike3.mp4
6825,1063,884,273,diss_bike3.mp4
7745,1063,883,273,diss_bike3.mp4
7756,1063,882,273,diss_bike3.mp4
7781,1063,878,273,diss_bike3.mp4
7793,1063,877,273,diss_bike3.mp4
7817,1063,872,274,diss_bike3.mp4
7843,1063,869,274,diss_bike3.mp4
7855,1063,867,275,diss_bike3.mp4
7879,1063,864,276,diss_bike3.mp4
7892,1063,863,276,diss_bike3.mp4
7916,1063,859,276,diss_bike3.mp4
7941,1063,856,276,diss_bike3.mp4
7953,1063,854,276,diss_bike3.mp4
7978,1063,850,276,diss_bike3.mp4
8002,1063,845,274,diss_bike3.mp4
8015,1063,842,273,diss_bike3.mp4
8040,1063,834,270,diss_bike3.mp4
8051,1063,830,269,diss_bike3.mp4
8077,1063,821,266,diss_bike3.mp4
8102,1063,815,265,diss_bike3.mp4
8113,1063,812,265,diss_bike3.mp4
8137,1063,808,265,diss_bike3.mp4
8163,1063,805,265,diss_bike3.mp4
8186,1063,804,265,diss_bike3.mp4
8443,1063,803,265,diss_bike3.mp4
8456,1063,801,263,diss_bike3.mp4
8481,1063,795,262,diss_bike3.mp4
8504,1063,788,259,diss_bike3.mp4
8516,1063,784,257,diss_bike3.mp4
8541,1063,775,255,diss_bike3.mp4
8553,1063,771,255,diss_bike3.mp4
8578,1063,763,253,diss_bike3.mp4
8603,1063,757,252,diss_bike3.mp4
8614,1063,752,252,diss_bike3.mp4
8639,1063,745,251,diss_bike3.mp4
8663,1063,736,251,diss_bike3.mp4
8676,1063,730,250,diss_bike3.mp4
8701,1063,719,249,diss_bike3.mp4
8725,1063,708,247,diss_bike3.mp4
8738,1063,702,246,diss_bike3.mp4
8762,1063,692,243,diss_bike3.mp4
8786,1063,682,240,diss_bike3.mp4
8799,1063,676,238,diss_bike3.mp4
8823,1063,667,237,diss_bike3.mp4
8836,1063,663,236,diss_bike3.mp4
8860,1063,654,234,diss_bike3.mp4
8884,1063,650,233,diss_bike3.mp4
8897,1063,649,233,diss_bike3.mp4
8908,1063,648,233,diss_bike3.mp4
9204,1063,647,233,diss_bike3.mp4
9216,1063,646,232,diss_bike3.mp4
9239,1063,638,226,diss_bike3.mp4
9265,1063,628,215,diss_bike3.mp4
9277,1063,622,208,diss_bike3.mp4
9300,1063,612,192,diss_bike3.mp4
9324,1063,601,175,diss_bike3.mp4
9337,1063,597,168,diss_bike3.mp4
9362,1063,589,156,diss_bike3.mp4
9375,1063,585,151,diss_bike3.mp4
9399,1063,580,144,diss_bike3.mp4
9424,1063,576,137,diss_bike3.mp4
9436,1063,574,135,diss_bike3.mp4
9460,1063,571,133,diss_bike3.mp4
9472,1063,570,132,diss_bike3.mp4
9509,1063,569,132,diss_bike3.mp4
9718,1063,568,131,diss_bike3.mp4
9743,1063,567,130,diss_bike3.mp4
9768,1063,565,128,diss_bike3.mp4
9779,1063,564,127,diss_bike3.mp4
9803,1063,559,124,diss_bike3.mp4
9816,1063,557,122,diss_bike3.mp4
9839,1063,552,118,diss_bike3.mp4
9864,1063,549,115,diss_bike3.mp4
9876,1063,548,114,diss_bike3.mp4
9889,1063,547,114,diss_bike3.mp4
10269,1063,547,115,diss_bike3.mp4
10283,1063,547,117,diss_bike3.mp4
10306,1063,549,120,diss_bike3.mp4
10318,1063,550,123,diss_bike3.mp4
10343,1063,553,133,diss_bike3.mp4
10367,1063,554,150,diss_bike3.mp4
10379,1063,555,160,diss_bike3.mp4
10403,1063,555,178,diss_bike3.mp4
10428,1063,555,194,diss_bike3.mp4
10440,1063,555,202,diss_bike3.mp4
10465,1063,555,219,diss_bike3.mp4
10489,1063,553,241,diss_bike3.mp4
10502,1063,553,251,diss_bike3.mp4
10527,1063,553,271,diss_bike3.mp4
10540,1063,553,282,diss_bike3.mp4
10563,1063,550,301,diss_bike3.mp4
10587,1063,545,321,diss_bike3.mp4
10600,1063,543,330,diss_bike3.mp4
10625,1063,539,345,diss_bike3.mp4
10649,1063,535,357,diss_bike3.mp4
10661,1063,534,360,diss_bike3.mp4
10685,1063,529,365,diss_bike3.mp4
10709,1063,525,369,diss_bike3.mp4
10722,1063,523,371,diss_bike3.mp4
10747,1063,519,375,diss_bike3.mp4
10759,1063,517,379,diss_bike3.mp4
10784,1063,513,382,diss_bike3.mp4
10808,1063,508,387,diss_bike3.mp4
10821,1063,506,388,diss_bike3.mp4
10845,1063,501,390,diss_bike3.mp4
10870,1063,495,392,diss_bike3.mp4
10881,1063,492,392,diss_bike3.mp4
10906,1063,489,391,diss_bike3.mp4
10931,1063,486,389,diss_bike3.mp4
10943,1063,485,388,diss_bike3.mp4
10968,1063,485,385,diss_bike3.mp4
10979,1063,485,384,diss_bike3.mp4
11483,1063,485,385,diss_bike3.mp4
11495,1063,484,388,diss_bike3.mp4
11508,1063,483,391,diss_bike3.mp4
11531,1063,480,400,diss_bike3.mp4
11544,1063,479,404,diss_bike3.mp4
11568,1063,473,415,diss_bike3.mp4
11591,1063,467,427,diss_bike3.mp4
11605,1063,465,432,diss_bike3.mp4
11629,1063,462,439,diss_bike3.mp4
11641,1063,461,440,diss_bike3.mp4
11654,1063,460,442,diss_bike3.mp4
11802,1063,459,443,diss_bike3.mp4
11851,1063,459,445,diss_bike3.mp4
11874,1063,458,445,diss_bike3.mp4
11887,1063,458,446,diss_bike3.mp4
11911,1063,457,447,diss_bike3.mp4
11936,1063,456,447,diss_bike3.mp4
11948,1063,456,448,diss_bike3.mp4
11960,1063,456,449,diss_bike3.mp4
11984,1063,455,449,diss_bike3.mp4
12010,1063,454,449,diss_bike3.mp4
12034,1063,453,450,diss_bike3.mp4
12045,1063,452,450,diss_bike3.mp4
12071,1063,449,450,diss_bike3.mp4
12095,1063,446,451,diss_bike3.mp4
12107,1063,444,452,diss_bike3.mp4
12131,1063,438,453,diss_bike3.mp4
12143,1063,436,453,diss_bike3.mp4
12168,1063,433,453,diss_bike3.mp4
12180,1063,432,454,diss_bike3.mp4
12205,1063,431,454,diss_bike3.mp4
12255,1063,430,454,diss_bike3.mp4
12475,1063,428,452,diss_bike3.mp4
12489,1063,427,449,diss_bike3.mp4
12513,1063,419,438,diss_bike3.mp4
12525,1063,414,431,diss_bike3.mp4
12548,1063,400,413,diss_bike3.mp4
12573,1063,385,395,diss_bike3.mp4
12584,1063,380,386,diss_bike3.mp4
12609,1063,368,373,diss_bike3.mp4
12633,1063,361,363,diss_bike3.mp4
12646,1063,358,357,diss_bike3.mp4
12670,1063,352,347,diss_bike3.mp4
12695,1063,348,334,diss_bike3.mp4
12709,1063,348,328,diss_bike3.mp4
12720,1063,348,323,diss_bike3.mp4
13026,1063,347,322,diss_bike3.mp4
13038,1063,347,319,diss_bike3.mp4
13075,1063,344,306,diss_bike3.mp4
13099,1063,347,278,diss_bike3.mp4
13112,1063,361,250,diss_bike3.mp4
13138,1063,401,190,diss_bike3.mp4
13152,1063,430,163,diss_bike3.mp4
13172,1063,510,117,diss_bike3.mp4
13185,1063,547,109,diss_bike3.mp4
13210,1063,608,105,diss_bike3.mp4
13233,1063,637,111,diss_bike3.mp4
13246,1063,644,115,diss_bike3.mp4
13493,1063,651,115,diss_bike3.mp4
13504,1063,662,114,diss_bike3.mp4
13529,1063,691,113,diss_bike3.mp4
13555,1063,744,131,diss_bike3.mp4
13566,1063,768,146,diss_bike3.mp4
13589,1063,794,167,diss_bike3.mp4
13614,1063,801,179,diss_bike3.mp4
13626,1063,802,181,diss_bike3.mp4
13651,1063,802,185,diss_bike3.mp4
13676,1063,802,187,diss_bike3.mp4
13689,1063,800,187,diss_bike3.mp4
13700,1063,799,189,diss_bike3.mp4
13811,1063,799,194,diss_bike3.mp4
13823,1063,798,198,diss_bike3.mp4
13835,1063,797,204,diss_bike3.mp4
13848,1063,795,209,diss_bike3.mp4
13873,1063,791,220,diss_bike3.mp4
13896,1063,788,227,diss_bike3.mp4
13908,1063,786,231,diss_bike3.mp4
13934,1063,786,233,diss_bike3.mp4
13946,1063,785,233,diss_bike3.mp4
14031,1063,789,233,diss_bike3.mp4
14043,1063,792,233,diss_bike3.mp4
14068,1063,798,233,diss_bike3.mp4
14093,1063,803,234,diss_bike3.mp4
14118,1063,808,237,diss_bike3.mp4
14128,1063,809,238,diss_bike3.mp4
14142,1063,809,240,diss_bike3.mp4
0,1066,646,360,diss_Girl2.mp4
13,1066,652,353,diss_Girl2.mp4
25,1066,664,343,diss_Girl2.mp4
49,1066,700,333,diss_Girl2.mp4
73,1066,738,338,diss_Girl2.mp4
86,1066,753,344,diss_Girl2.mp4
110,1066,773,355,diss_Girl2.mp4
135,1066,778,360,diss_Girl2.mp4
147,1066,780,361,diss_Girl2.mp4
369,1066,782,360,diss_Girl2.mp4
379,1066,788,355,diss_Girl2.mp4
392,1066,797,349,diss_Girl2.mp4
417,1066,815,339,diss_Girl2.mp4
430,1066,822,335,diss_Girl2.mp4
454,1066,828,332,diss_Girl2.mp4
478,1066,829,331,diss_Girl2.mp4
490,1066,829,330,diss_Girl2.mp4
516,1066,824,329,diss_Girl2.mp4
540,1066,809,328,diss_Girl2.mp4
551,1066,801,328,diss_Girl2.mp4
576,1066,782,328,diss_Girl2.mp4
587,1066,774,328,diss_Girl2.mp4
613,1066,758,327,diss_Girl2.mp4
637,1066,745,324,diss_Girl2.mp4
650,1066,741,322,diss_Girl2.mp4
675,1066,734,319,diss_Girl2.mp4
698,1066,730,316,diss_Girl2.mp4
710,1066,729,315,diss_Girl2.mp4
734,1066,728,312,diss_Girl2.mp4
760,1066,727,310,diss_Girl2.mp4
784,1066,727,309,diss_Girl2.mp4
810,1066,726,308,diss_Girl2.mp4
821,1066,726,306,diss_Girl2.mp4
833,1066,725,305,diss_Girl2.mp4
858,1066,724,302,diss_Girl2.mp4
870,1066,723,302,diss_Girl2.mp4
882,1066,722,301,diss_Girl2.mp4
918,1066,722,300,diss_Girl2.mp4
956,1066,722,299,diss_Girl2.mp4
1041,1066,721,298,diss_Girl2.mp4
1054,1066,720,297,diss_Girl2.mp4
1067,1066,718,296,diss_Girl2.mp4
1091,1066,713,293,diss_Girl2.mp4
1115,1066,702,290,diss_Girl2.mp4
1127,1066,693,289,diss_Girl2.mp4
1152,1066,672,289,diss_Girl2.mp4
1177,1066,647,293,diss_Girl2.mp4
1188,1066,636,296,diss_Girl2.mp4
1213,1066,615,304,diss_Girl2.mp4
1237,1066,598,312,diss_Girl2.mp4
1250,1066,591,316,diss_Girl2.mp4
1275,1066,584,319,diss_Girl2.mp4
1288,1066,582,321,diss_Girl2.mp4
1605,1066,580,322,diss_Girl2.mp4
1617,1066,576,323,diss_Girl2.mp4
1631,1066,563,327,diss_Girl2.mp4
1654,1066,497,342,diss_Girl2.mp4
1679,1066,398,365,diss_Girl2.mp4
1691,1066,357,376,diss_Girl2.mp4
1715,1066,309,383,diss_Girl2.mp4
1727,1066,294,383,diss_Girl2.mp4
1752,1066,275,378,diss_Girl2.mp4
1777,1066,264,371,diss_Girl2.mp4
1789,1066,263,369,diss_Girl2.mp4
1814,1066,261,367,diss_Girl2.mp4
1838,1066,261,365,diss_Girl2.mp4
1875,1066,261,364,diss_Girl2.mp4
1912,1066,261,363,diss_Girl2.mp4
1961,1066,261,362,diss_Girl2.mp4
2035,1066,263,359,diss_Girl2.mp4
2046,1066,263,357,diss_Girl2.mp4
2072,1066,267,353,diss_Girl2.mp4
2097,1066,277,343,diss_Girl2.mp4
2119,1066,294,333,diss_Girl2.mp4
2131,1066,303,330,diss_Girl2.mp4
2156,1066,312,326,diss_Girl2.mp4
2168,1066,314,326,diss_Girl2.mp4
2194,1066,315,326,diss_Girl2.mp4
2293,1066,315,325,diss_Girl2.mp4
2304,1066,314,324,diss_Girl2.mp4
2316,1066,314,323,diss_Girl2.mp4
2340,1066,313,322,diss_Girl2.mp4
2365,1066,312,321,diss_Girl2.mp4
2403,1066,312,320,diss_Girl2.mp4
2439,1066,312,317,diss_Girl2.mp4
2451,1066,312,315,diss_Girl2.mp4
2475,1066,312,313,diss_Girl2.mp4
2487,1066,313,312,diss_Girl2.mp4
2574,1066,313,310,diss_Girl2.mp4
2598,1066,314,309,diss_Girl2.mp4
2635,1066,314,308,diss_Girl2.mp4
2659,1066,315,308,diss_Girl2.mp4
2684,1066,315,307,diss_Girl2.mp4
2744,1066,315,306,diss_Girl2.mp4
2819,1066,316,305,diss_Girl2.mp4
2843,1066,316,303,diss_Girl2.mp4
2856,1066,317,303,diss_Girl2.mp4
2880,1066,319,299,diss_Girl2.mp4
2892,1066,320,299,diss_Girl2.mp4
2916,1066,321,296,diss_Girl2.mp4
2942,1066,322,295,diss_Girl2.mp4
2953,1066,323,294,diss_Girl2.mp4
2966,1066,323,293,diss_Girl2.mp4
3027,1066,323,292,diss_Girl2.mp4
3076,1066,324,292,diss_Girl2.mp4
3113,1066,325,292,diss_Girl2.mp4
3138,1066,328,294,diss_Girl2.mp4
3148,1066,329,295,diss_Girl2.mp4
3174,1066,336,299,diss_Girl2.mp4
3198,1066,345,307,diss_Girl2.mp4
3210,1066,351,311,diss_Girl2.mp4
3235,1066,363,320,diss_Girl2.mp4
3260,1066,371,327,diss_Girl2.mp4
3272,1066,373,330,diss_Girl2.mp4
3296,1066,376,336,diss_Girl2.mp4
3320,1066,379,342,diss_Girl2.mp4
3333,1066,381,344,diss_Girl2.mp4
3359,1066,384,349,diss_Girl2.mp4
3382,1066,387,351,diss_Girl2.mp4
3394,1066,387,352,diss_Girl2.mp4
3419,1066,390,354,diss_Girl2.mp4
3443,1066,395,355,diss_Girl2.mp4
3455,1066,401,356,diss_Girl2.mp4
3480,1066,416,359,diss_Girl2.mp4
3492,1066,421,359,diss_Girl2.mp4
3517,1066,430,361,diss_Girl2.mp4
3541,1066,436,362,diss_Girl2.mp4
3553,1066,438,363,diss_Girl2.mp4
3578,1066,442,363,diss_Girl2.mp4
3602,1066,443,363,diss_Girl2.mp4
3982,1066,445,363,diss_Girl2.mp4
3995,1066,449,359,diss_Girl2.mp4
4020,1066,478,341,diss_Girl2.mp4
4032,1066,513,321,diss_Girl2.mp4
4055,1066,617,283,diss_Girl2.mp4
4080,1066,729,261,diss_Girl2.mp4
4093,1066,779,255,diss_Girl2.mp4
4117,1066,848,251,diss_Girl2.mp4
4141,1066,881,251,diss_Girl2.mp4
4154,1066,892,251,diss_Girl2.mp4
4178,1066,907,253,diss_Girl2.mp4
4202,1066,914,254,diss_Girl2.mp4
4215,1066,915,254,diss_Girl2.mp4
4472,1066,916,254,diss_Girl2.mp4
4485,1066,917,254,diss_Girl2.mp4
4497,1066,918,254,diss_Girl2.mp4
4523,1066,921,254,diss_Girl2.mp4
4546,1066,923,254,diss_Girl2.mp4
4559,1066,924,255,diss_Girl2.mp4
4584,1066,926,255,diss_Girl2.mp4
4607,1066,929,255,diss_Girl2.mp4
4619,1066,930,255,diss_Girl2.mp4
4644,1066,932,256,diss_Girl2.mp4
4656,1066,933,256,diss_Girl2.mp4
4681,1066,934,257,diss_Girl2.mp4
4705,1066,935,257,diss_Girl2.mp4
4717,1066,936,257,diss_Girl2.mp4
4742,1066,938,258,diss_Girl2.mp4
4766,1066,940,260,diss_Girl2.mp4
4778,1066,941,260,diss_Girl2.mp4
4803,1066,944,261,diss_Girl2.mp4
4816,1066,944,262,diss_Girl2.mp4
4828,1066,945,262,diss_Girl2.mp4
4852,1066,946,262,diss_Girl2.mp4
4913,1066,947,262,diss_Girl2.mp4
4939,1066,948,262,diss_Girl2.mp4
4964,1066,951,262,diss_Girl2.mp4
4975,1066,952,262,diss_Girl2.mp4
5001,1066,959,260,diss_Girl2.mp4
5024,1066,972,258,diss_Girl2.mp4
5036,1066,981,256,diss_Girl2.mp4
5062,1066,998,255,diss_Girl2.mp4
5085,1066,1005,254,diss_Girl2.mp4
5097,1066,1006,254,diss_Girl2.mp4
5404,1066,1008,254,diss_Girl2.mp4
5416,1066,1010,254,diss_Girl2.mp4
5441,1066,1013,254,diss_Girl2.mp4
5466,1066,1019,256,diss_Girl2.mp4
5478,1066,1022,258,diss_Girl2.mp4
5500,1066,1028,261,diss_Girl2.mp4
5526,1066,1033,265,diss_Girl2.mp4
5538,1066,1034,266,diss_Girl2.mp4
5551,1066,1035,268,diss_Girl2.mp4
5588,1066,1036,269,diss_Girl2.mp4
5624,1066,1037,269,diss_Girl2.mp4
5638,1066,1037,270,diss_Girl2.mp4
5661,1066,1041,272,diss_Girl2.mp4
5684,1066,1044,275,diss_Girl2.mp4
5697,1066,1046,276,diss_Girl2.mp4
5722,1066,1050,279,diss_Girl2.mp4
5747,1066,1053,281,diss_Girl2.mp4
5758,1066,1055,281,diss_Girl2.mp4
5783,1066,1058,284,diss_Girl2.mp4
5795,1066,1060,284,diss_Girl2.mp4
5821,1066,1063,286,diss_Girl2.mp4
5832,1066,1064,286,diss_Girl2.mp4
5856,1066,1065,286,diss_Girl2.mp4
5881,1066,1066,286,diss_Girl2.mp4
5893,1066,1067,286,diss_Girl2.mp4
5918,1066,1068,286,diss_Girl2.mp4
5943,1066,1073,286,diss_Girl2.mp4
5954,1066,1075,286,diss_Girl2.mp4
5979,1066,1085,283,diss_Girl2.mp4
6004,1066,1094,278,diss_Girl2.mp4
6016,1066,1097,276,diss_Girl2.mp4
6041,1066,1101,274,diss_Girl2.mp4
6065,1066,1103,271,diss_Girl2.mp4
6077,1066,1104,270,diss_Girl2.mp4
6102,1066,1105,269,diss_Girl2.mp4
6138,1066,1105,268,diss_Girl2.mp4
6212,1066,1105,267,diss_Girl2.mp4
6224,1066,1105,265,diss_Girl2.mp4
6236,1066,1105,264,diss_Girl2.mp4
6261,1066,1105,263,diss_Girl2.mp4
6273,1066,1105,262,diss_Girl2.mp4
6347,1066,1103,261,diss_Girl2.mp4
6359,1066,1100,260,diss_Girl2.mp4
6384,1066,1090,259,diss_Girl2.mp4
6408,1066,1076,256,diss_Girl2.mp4
6420,1066,1069,253,diss_Girl2.mp4
6445,1066,1055,246,diss_Girl2.mp4
6469,1066,1043,239,diss_Girl2.mp4
6481,1066,1037,236,diss_Girl2.mp4
6506,1066,1031,232,diss_Girl2.mp4
6518,1066,1029,230,diss_Girl2.mp4
6543,1066,1027,229,diss_Girl2.mp4
6555,1066,1026,229,diss_Girl2.mp4
6575,1066,1026,228,diss_Girl2.mp4
6628,1066,1025,228,diss_Girl2.mp4
6886,1066,1023,228,diss_Girl2.mp4
6899,1066,1021,227,diss_Girl2.mp4
6923,1066,1014,223,diss_Girl2.mp4
6947,1066,1000,215,diss_Girl2.mp4
6971,1066,983,207,diss_Girl2.mp4
6983,1066,976,203,diss_Girl2.mp4
7008,1066,962,196,diss_Girl2.mp4
7021,1066,956,195,diss_Girl2.mp4
7045,1066,947,190,diss_Girl2.mp4
7057,1066,943,188,diss_Girl2.mp4
7083,1066,937,185,diss_Girl2.mp4
7107,1066,931,181,diss_Girl2.mp4
7130,1066,924,177,diss_Girl2.mp4
7143,1066,920,175,diss_Girl2.mp4
7168,1066,910,168,diss_Girl2.mp4
7179,1066,906,166,diss_Girl2.mp4
7205,1066,895,160,diss_Girl2.mp4
7229,1066,884,155,diss_Girl2.mp4
7242,1066,878,153,diss_Girl2.mp4
7266,1066,865,148,diss_Girl2.mp4
7290,1066,855,145,diss_Girl2.mp4
7302,1066,849,144,diss_Girl2.mp4
7327,1066,839,142,diss_Girl2.mp4
7351,1066,831,141,diss_Girl2.mp4
7364,1066,827,141,diss_Girl2.mp4
7683,1066,825,141,diss_Girl2.mp4
7695,1066,823,141,diss_Girl2.mp4
7708,1066,820,141,diss_Girl2.mp4
7732,1066,812,142,diss_Girl2.mp4
7744,1066,805,143,diss_Girl2.mp4
7769,1066,792,144,diss_Girl2.mp4
7793,1066,784,144,diss_Girl2.mp4
7806,1066,782,145,diss_Girl2.mp4
7830,1066,776,145,diss_Girl2.mp4
7854,1066,772,145,diss_Girl2.mp4
7867,1066,769,145,diss_Girl2.mp4
7892,1066,763,145,diss_Girl2.mp4
7915,1066,757,145,diss_Girl2.mp4
7928,1066,753,145,diss_Girl2.mp4
7952,1066,745,144,diss_Girl2.mp4
7965,1066,742,143,diss_Girl2.mp4
7988,1066,734,142,diss_Girl2.mp4
8013,1066,726,140,diss_Girl2.mp4
8026,1066,723,140,diss_Girl2.mp4
8049,1066,718,138,diss_Girl2.mp4
8074,1066,712,138,diss_Girl2.mp4
8087,1066,710,137,diss_Girl2.mp4
8111,1066,706,137,diss_Girl2.mp4
8135,1066,705,137,diss_Girl2.mp4
8480,1066,702,137,diss_Girl2.mp4
8492,1066,697,136,diss_Girl2.mp4
8504,1066,691,136,diss_Girl2.mp4
8530,1066,667,134,diss_Girl2.mp4
8553,1066,632,133,diss_Girl2.mp4
8577,1066,591,133,diss_Girl2.mp4
8589,1066,568,130,diss_Girl2.mp4
8614,1066,519,122,diss_Girl2.mp4
8639,1066,476,112,diss_Girl2.mp4
8651,1066,463,110,diss_Girl2.mp4
8675,1066,445,109,diss_Girl2.mp4
8699,1066,439,109,diss_Girl2.mp4
8712,1066,437,109,diss_Girl2.mp4
8724,1066,435,109,diss_Girl2.mp4
8970,1066,434,109,diss_Girl2.mp4
8982,1066,432,111,diss_Girl2.mp4
8994,1066,425,113,diss_Girl2.mp4
9006,1066,416,116,diss_Girl2.mp4
9029,1066,388,124,diss_Girl2.mp4
9054,1066,354,134,diss_Girl2.mp4
9067,1066,342,139,diss_Girl2.mp4
9091,1066,323,145,diss_Girl2.mp4
9116,1066,309,151,diss_Girl2.mp4
9128,1066,303,153,diss_Girl2.mp4
9153,1066,297,156,diss_Girl2.mp4
9165,1066,295,157,diss_Girl2.mp4
9434,1066,294,158,diss_Girl2.mp4
9447,1066,291,162,diss_Girl2.mp4
9473,1066,277,176,diss_Girl2.mp4
9484,1066,266,187,diss_Girl2.mp4
9509,1066,235,218,diss_Girl2.mp4
9533,1066,211,246,diss_Girl2.mp4
9544,1066,204,256,diss_Girl2.mp4
9576,1066,191,271,diss_Girl2.mp4
9593,1066,185,279,diss_Girl2.mp4
9606,1066,183,282,diss_Girl2.mp4
9631,1066,181,285,diss_Girl2.mp4
9642,1066,181,286,diss_Girl2.mp4
9667,1066,180,286,diss_Girl2.mp4
9862,1066,179,287,diss_Girl2.mp4
9875,1066,178,290,diss_Girl2.mp4
9887,1066,177,292,diss_Girl2.mp4
9912,1066,174,296,diss_Girl2.mp4
9925,1066,173,300,diss_Girl2.mp4
9949,1066,167,308,diss_Girl2.mp4
9974,1066,164,314,diss_Girl2.mp4
9986,1066,162,317,diss_Girl2.mp4
10012,1066,161,319,diss_Girl2.mp4
10023,1066,160,320,diss_Girl2.mp4
10281,1066,160,318,diss_Girl2.mp4
10305,1066,161,312,diss_Girl2.mp4
10316,1066,163,309,diss_Girl2.mp4
10328,1066,164,304,diss_Girl2.mp4
10352,1066,166,299,diss_Girl2.mp4
10377,1066,168,293,diss_Girl2.mp4
10389,1066,169,291,diss_Girl2.mp4
10415,1066,170,285,diss_Girl2.mp4
10427,1066,172,283,diss_Girl2.mp4
10452,1066,173,282,diss_Girl2.mp4
10464,1066,173,281,diss_Girl2.mp4
11017,1066,172,282,diss_Girl2.mp4
11028,1066,170,284,diss_Girl2.mp4
11052,1066,164,292,diss_Girl2.mp4
11076,1066,153,308,diss_Girl2.mp4
11089,1066,147,317,diss_Girl2.mp4
11113,1066,136,335,diss_Girl2.mp4
11137,1066,127,346,diss_Girl2.mp4
11150,1066,124,351,diss_Girl2.mp4
11174,1066,120,356,diss_Girl2.mp4
11199,1066,115,360,diss_Girl2.mp4
11212,1066,112,362,diss_Girl2.mp4
11235,1066,105,365,diss_Girl2.mp4
11259,1066,96,369,diss_Girl2.mp4
11272,1066,91,371,diss_Girl2.mp4
11297,1066,84,372,diss_Girl2.mp4
11309,1066,82,373,diss_Girl2.mp4
11334,1066,77,374,diss_Girl2.mp4
11358,1066,73,374,diss_Girl2.mp4
11370,1066,71,374,diss_Girl2.mp4
11395,1066,68,374,diss_Girl2.mp4
11419,1066,67,373,diss_Girl2.mp4
11444,1066,66,372,diss_Girl2.mp4
11470,1066,65,370,diss_Girl2.mp4
11493,1066,64,369,diss_Girl2.mp4
11505,1066,64,367,diss_Girl2.mp4
11531,1066,64,366,diss_Girl2.mp4
11567,1066,63,365,diss_Girl2.mp4
11627,1066,63,364,diss_Girl2.mp4
11726,1066,63,362,diss_Girl2.mp4
11737,1066,63,359,diss_Girl2.mp4
11750,1066,63,354,diss_Girl2.mp4
11774,1066,65,340,diss_Girl2.mp4
11799,1066,76,318,diss_Girl2.mp4
11811,1066,85,303,diss_Girl2.mp4
11836,1066,108,272,diss_Girl2.mp4
11860,1066,128,256,diss_Girl2.mp4
11873,1066,137,251,diss_Girl2.mp4
11897,1066,156,248,diss_Girl2.mp4
11921,1066,171,248,diss_Girl2.mp4
12315,1066,171,249,diss_Girl2.mp4
12326,1066,171,251,diss_Girl2.mp4
12338,1066,170,255,diss_Girl2.mp4
12362,1066,169,260,diss_Girl2.mp4
12375,1066,169,264,diss_Girl2.mp4
12400,1066,168,270,diss_Girl2.mp4
12412,1066,168,271,diss_Girl2.mp4
12437,1066,168,274,diss_Girl2.mp4
12460,1066,168,276,diss_Girl2.mp4
12485,1066,168,278,diss_Girl2.mp4
12510,1066,168,279,diss_Girl2.mp4
12535,1066,168,280,diss_Girl2.mp4
12559,1066,168,281,diss_Girl2.mp4
12903,1066,172,280,diss_Girl2.mp4
12916,1066,180,276,diss_Girl2.mp4
12940,1066,229,270,diss_Girl2.mp4
12963,1066,326,276,diss_Girl2.mp4
12976,1066,374,290,diss_Girl2.mp4
13000,1066,444,318,diss_Girl2.mp4
13024,1066,477,340,diss_Girl2.mp4
13037,1066,483,346,diss_Girl2.mp4
13061,1066,488,352,diss_Girl2.mp4
13073,1066,488,354,diss_Girl2.mp4
13098,1066,482,355,diss_Girl2.mp4
13367,1066,483,369,diss_Girl2.mp4
13380,1066,487,386,diss_Girl2.mp4
13404,1066,495,435,diss_Girl2.mp4
13417,1066,496,460,diss_Girl2.mp4
13441,1066,496,501,diss_Girl2.mp4
13466,1066,496,529,diss_Girl2.mp4
13478,1066,496,540,diss_Girl2.mp4
13503,1066,496,555,diss_Girl2.mp4
13514,1066,496,558,diss_Girl2.mp4
13538,1066,496,564,diss_Girl2.mp4
13563,1066,500,576,diss_Girl2.mp4
13577,1066,504,587,diss_Girl2.mp4
13600,1066,516,614,diss_Girl2.mp4
13624,1066,526,640,diss_Girl2.mp4
13636,1066,528,650,diss_Girl2.mp4
13968,1066,528,651,diss_Girl2.mp4
13981,1066,528,652,diss_Girl2.mp4
14005,1066,528,657,diss_Girl2.mp4
14017,1066,528,660,diss_Girl2.mp4
14042,1066,528,667,diss_Girl2.mp4
14065,1066,528,671,diss_Girl2.mp4
14078,1066,528,672,diss_Girl2.mp4
14090,1066,528,673,diss_Girl2.mp4
14446,1066,528,672,diss_Girl2.mp4
14459,1066,528,671,diss_Girl2.mp4
14484,1066,528,668,diss_Girl2.mp4
14495,1066,528,666,diss_Girl2.mp4
14520,1066,528,655,diss_Girl2.mp4
14544,1066,527,593,diss_Girl2.mp4
14556,1066,525,530,diss_Girl2.mp4
14580,1066,532,389,diss_Girl2.mp4
14605,1066,557,263,diss_Girl2.mp4
14618,1066,567,230,diss_Girl2.mp4
14643,1066,580,202,diss_Girl2.mp4
14666,1066,583,195,diss_Girl2.mp4
15023,1066,583,193,diss_Girl2.mp4
15035,1066,583,191,diss_Girl2.mp4
15046,1066,583,189,diss_Girl2.mp4
15058,1066,583,187,diss_Girl2.mp4
15084,1066,583,182,diss_Girl2.mp4
15108,1066,585,176,diss_Girl2.mp4
15120,1066,590,172,diss_Girl2.mp4
15145,1066,603,163,diss_Girl2.mp4
15169,1066,624,152,diss_Girl2.mp4
15181,1066,636,147,diss_Girl2.mp4
15206,1066,657,142,diss_Girl2.mp4
15230,1066,672,142,diss_Girl2.mp4
15242,1066,677,142,diss_Girl2.mp4
15266,1066,682,142,diss_Girl2.mp4
15278,1066,684,142,diss_Girl2.mp4
16261,1066,686,142,diss_Girl2.mp4
16272,1066,691,139,diss_Girl2.mp4
16286,1066,700,135,diss_Girl2.mp4
16310,1066,743,121,diss_Girl2.mp4
16334,1066,802,107,diss_Girl2.mp4
16345,1066,823,103,diss_Girl2.mp4
16369,1066,847,101,diss_Girl2.mp4
16394,1066,858,101,diss_Girl2.mp4
16406,1066,860,101,diss_Girl2.mp4
16431,1066,862,103,diss_Girl2.mp4
16444,1066,862,104,diss_Girl2.mp4
17338,1066,863,104,diss_Girl2.mp4
17349,1066,866,104,diss_Girl2.mp4
17373,1066,886,99,diss_Girl2.mp4
17387,1066,904,97,diss_Girl2.mp4
17412,1066,955,99,diss_Girl2.mp4
17435,1066,994,111,diss_Girl2.mp4
17447,1066,1005,117,diss_Girl2.mp4
17471,1066,1019,126,diss_Girl2.mp4
17484,1066,1022,130,diss_Girl2.mp4
17497,1066,1023,132,diss_Girl2.mp4
17864,1066,1027,132,diss_Girl2.mp4
17878,1066,1031,132,diss_Girl2.mp4
17890,1066,1036,132,diss_Girl2.mp4
17914,1066,1052,133,diss_Girl2.mp4
17939,1066,1069,138,diss_Girl2.mp4
17949,1066,1078,141,diss_Girl2.mp4
17974,1066,1092,150,diss_Girl2.mp4
17986,1066,1097,152,diss_Girl2.mp4
18011,1066,1107,158,diss_Girl2.mp4
18035,1066,1114,162,diss_Girl2.mp4
18049,1066,1116,163,diss_Girl2.mp4
18060,1066,1118,164,diss_Girl2.mp4
18807,1066,1119,164,diss_Girl2.mp4
18821,1066,1120,163,diss_Girl2.mp4
18833,1066,1121,163,diss_Girl2.mp4
18857,1066,1126,163,diss_Girl2.mp4
18869,1066,1127,163,diss_Girl2.mp4
18894,1066,1131,163,diss_Girl2.mp4
18917,1066,1135,163,diss_Girl2.mp4
18930,1066,1136,163,diss_Girl2.mp4
18955,1066,1140,163,diss_Girl2.mp4
18967,1066,1142,164,diss_Girl2.mp4
18991,1066,1145,166,diss_Girl2.mp4
19015,1066,1147,168,diss_Girl2.mp4
19028,1066,1149,170,diss_Girl2.mp4
19053,1066,1152,173,diss_Girl2.mp4
19077,1066,1155,176,diss_Girl2.mp4
19090,1066,1156,178,diss_Girl2.mp4
19114,1066,1159,183,diss_Girl2.mp4
19139,1066,1164,187,diss_Girl2.mp4
19152,1066,1165,190,diss_Girl2.mp4
19175,1066,1168,193,diss_Girl2.mp4
19199,1066,1170,195,diss_Girl2.mp4
19212,1066,1171,197,diss_Girl2.mp4
19224,1066,1171,198,diss_Girl2.mp4
19249,1066,1171,200,diss_Girl2.mp4
19506,1066,1170,200,diss_Girl2.mp4
19519,1066,1168,200,diss_Girl2.mp4
19532,1066,1165,200,diss_Girl2.mp4
19556,1066,1157,201,diss_Girl2.mp4
19581,1066,1137,207,diss_Girl2.mp4
19592,1066,1124,210,diss_Girl2.mp4
19616,1066,1093,222,diss_Girl2.mp4
19629,1066,1081,228,diss_Girl2.mp4
19653,1066,1065,235,diss_Girl2.mp4
19677,1066,1060,238,diss_Girl2.mp4
19715,1066,1059,239,diss_Girl2.mp4
19775,1066,1058,240,diss_Girl2.mp4
19788,1066,1056,241,diss_Girl2.mp4
19813,1066,1052,243,diss_Girl2.mp4
19838,1066,1043,246,diss_Girl2.mp4
19850,1066,1037,247,diss_Girl2.mp4
19873,1066,1020,250,diss_Girl2.mp4
19898,1066,998,257,diss_Girl2.mp4
19910,1066,988,260,diss_Girl2.mp4
19935,1066,973,265,diss_Girl2.mp4
19959,1066,963,268,diss_Girl2.mp4
19972,1066,959,268,diss_Girl2.mp4
19996,1066,955,269,diss_Girl2.mp4
20021,1066,954,270,diss_Girl2.mp4
