verifToken,stimuli_id,source_id,media_a_id,source_a,created_at,source_name_vote,reversed,source_position_vote,bl,bd,nb_replay
5q1vkq2a,1094,5556,44526,diss_ManRunning1.mp4,1644248114,1,,1,8,120,1
5q1vkq2a,1089,5569,44539,diss_car12.mp4,1644248164,1,,1,8,120,1
5q1vkq2a,1098,5559,44529,diss_Soccer2.mp4,1644248184,1,,1,8,120,1
5q1vkq2a,1085,5565,44535,diss_building2.mp4,1644248196,1,,1,8,120,1
5q1vkq2a,1093,5555,44525,diss_Girl2.mp4,1644248207,1,,1,8,120,1
5q1vkq2a,1083,5563,44533,diss_bike3.mp4,1644248229,1,,1,8,120,1
5q1vkq2a,1087,5567,44537,diss_building4.mp4,1644248252,1,,1,8,120,1
5q1vkq2a,1090,5570,44540,diss_car13.mp4,1644248286,1,,1,8,120,1
5q1vkq2a,1092,5554,44524,diss_Girl1.mp4,1644248310,1,,1,8,120,1
5q1vkq2a,1096,5572,44542,diss_person22.mp4,1644248328,1,,1,8,120,1
5q1vkq2a,1084,5564,44534,diss_building1.mp4,1644248346,1,,1,8,120,1
5q1vkq2a,1095,5557,44527,diss_ManRunning2.mp4,1644248377,1,,1,8,120,1
5q1vkq2a,1101,5574,44544,diss_truck3.mp4,1644248406,1,,1,8,120,1
5q1vkq2a,1081,5553,44523,diss_Basketball.mp4,1644248424,1,,1,8,120,1
5q1vkq2a,1100,5573,44543,diss_truck2.mp4,1644248440,1,,1,8,120,1
5q1vkq2a,1102,5561,44531,diss_Walking.mp4,1644248452,1,,1,8,120,1
5q1vkq2a,1097,5558,44528,diss_Soccer1.mp4,1644248461,1,,1,8,120,1
5q1vkq2a,1099,5560,44530,diss_StreetBasketball1.mp4,1644248471,1,,1,8,120,1
5q1vkq2a,1082,5562,44532,diss_bike2.mp4,1644248481,1,,1,8,120,1
5q1vkq2a,1091,5571,44541,diss_car15.mp4,1644248500,1,,1,8,120,1
5q1vkq2a,1088,5568,44538,diss_car11.mp4,1644248519,1,,1,8,120,1
5q1vkq2a,1086,5566,44536,diss_building3.mp4,1644248531,1,,1,8,120,1
