timestamp,stimuli_id,mouseX,mouseY,stimuli
0,1060,637,374,diss_person22.mp4
1349,1060,638,374,diss_person22.mp4
1501,1060,650,376,diss_person22.mp4
1596,1060,653,376,diss_person22.mp4
2206,1060,661,378,diss_person22.mp4
2219,1060,662,378,diss_person22.mp4
2356,1060,678,383,diss_person22.mp4
2371,1060,679,383,diss_person22.mp4
2644,1060,749,398,diss_person22.mp4
2788,1060,767,403,diss_person22.mp4
3001,1060,783,407,diss_person22.mp4
3145,1060,792,410,diss_person22.mp4
3199,1060,792,411,diss_person22.mp4
3425,1060,817,418,diss_person22.mp4
3528,1060,821,418,diss_person22.mp4
3651,1060,826,417,diss_person22.mp4
3789,1060,832,410,diss_person22.mp4
3919,1060,834,406,diss_person22.mp4
4063,1060,846,385,diss_person22.mp4
4207,1060,854,378,diss_person22.mp4
4337,1060,861,376,diss_person22.mp4
4768,1060,927,385,diss_person22.mp4
4850,1060,934,387,diss_person22.mp4
5008,1060,946,393,diss_person22.mp4
5104,1060,951,397,diss_person22.mp4
5241,1060,959,403,diss_person22.mp4
5366,1060,964,405,diss_person22.mp4
5529,1060,971,410,diss_person22.mp4
5674,1060,975,414,diss_person22.mp4
5953,1060,940,420,diss_person22.mp4
6083,1060,874,406,diss_person22.mp4
6214,1060,825,399,diss_person22.mp4
6221,1060,823,399,diss_person22.mp4
6357,1060,805,396,diss_person22.mp4
6489,1060,792,395,diss_person22.mp4
6632,1060,774,394,diss_person22.mp4
6769,1060,756,390,diss_person22.mp4
6927,1060,736,389,diss_person22.mp4
7063,1060,708,385,diss_person22.mp4
7194,1060,690,382,diss_person22.mp4
7310,1060,685,382,diss_person22.mp4
0,1060,628,375,diss_person22.mp4
89,1060,614,371,diss_person22.mp4
192,1060,608,371,diss_person22.mp4
342,1060,630,385,diss_person22.mp4
466,1060,645,395,diss_person22.mp4
624,1060,562,343,diss_person22.mp4
767,1060,528,319,diss_person22.mp4
912,1060,505,308,diss_person22.mp4
1062,1060,474,302,diss_person22.mp4
1213,1060,448,301,diss_person22.mp4
1342,1060,420,301,diss_person22.mp4
1466,1060,403,301,diss_person22.mp4
1610,1060,384,305,diss_person22.mp4
1754,1060,373,309,diss_person22.mp4
1884,1060,364,315,diss_person22.mp4
2165,1060,324,359,diss_person22.mp4
2282,1060,309,379,diss_person22.mp4
2426,1060,304,388,diss_person22.mp4
2563,1060,298,398,diss_person22.mp4
2706,1060,293,412,diss_person22.mp4
2734,1060,292,416,diss_person22.mp4
3173,1060,275,443,diss_person22.mp4
3261,1060,268,455,diss_person22.mp4
3406,1060,262,464,diss_person22.mp4
3530,1060,249,476,diss_person22.mp4
3679,1060,222,494,diss_person22.mp4
3824,1060,191,505,diss_person22.mp4
3954,1060,165,511,diss_person22.mp4
4084,1060,147,516,diss_person22.mp4
4201,1060,141,520,diss_person22.mp4
4359,1060,146,522,diss_person22.mp4
4495,1060,197,529,diss_person22.mp4
4632,1060,264,529,diss_person22.mp4
4763,1060,313,525,diss_person22.mp4
4906,1060,376,524,diss_person22.mp4
5044,1060,421,536,diss_person22.mp4
5180,1060,455,546,diss_person22.mp4
5283,1060,510,556,diss_person22.mp4
5592,1060,525,556,diss_person22.mp4
5687,1060,667,556,diss_person22.mp4
5832,1060,767,538,diss_person22.mp4
5962,1060,798,523,diss_person22.mp4
6064,1060,815,500,diss_person22.mp4
6202,1060,836,478,diss_person22.mp4
6318,1060,857,463,diss_person22.mp4
0,1062,620,382,diss_building2.mp4
110,1062,570,360,diss_building2.mp4
246,1062,526,357,diss_building2.mp4
390,1062,502,367,diss_building2.mp4
521,1062,470,378,diss_building2.mp4
658,1062,410,381,diss_building2.mp4
801,1062,375,366,diss_building2.mp4
904,1062,354,353,diss_building2.mp4
1055,1062,316,331,diss_building2.mp4
1090,1062,313,329,diss_building2.mp4
1446,1062,290,313,diss_building2.mp4
1583,1062,280,282,diss_building2.mp4
1733,1062,275,241,diss_building2.mp4
1829,1062,298,199,diss_building2.mp4
1973,1062,407,164,diss_building2.mp4
2117,1062,525,156,diss_building2.mp4
2247,1062,581,164,diss_building2.mp4
2392,1062,624,177,diss_building2.mp4
2543,1062,651,185,diss_building2.mp4
2680,1062,675,186,diss_building2.mp4
2754,1062,691,184,diss_building2.mp4
3186,1062,773,184,diss_building2.mp4
3275,1062,809,181,diss_building2.mp4
3413,1062,859,183,diss_building2.mp4
3549,1062,909,187,diss_building2.mp4
3680,1062,947,186,diss_building2.mp4
3843,1062,1004,190,diss_building2.mp4
3974,1062,1019,198,diss_building2.mp4
4029,1062,1021,204,diss_building2.mp4
4413,1062,1104,217,diss_building2.mp4
4646,1062,1134,272,diss_building2.mp4
4783,1062,1133,295,diss_building2.mp4
4920,1062,1128,318,diss_building2.mp4
5085,1062,1113,342,diss_building2.mp4
5091,1062,1113,343,diss_building2.mp4
5366,1062,1012,389,diss_building2.mp4
5524,1062,957,384,diss_building2.mp4
5653,1062,913,374,diss_building2.mp4
5811,1062,870,361,diss_building2.mp4
5962,1062,816,348,diss_building2.mp4
6126,1062,738,321,diss_building2.mp4
6222,1062,721,310,diss_building2.mp4
6647,1062,528,332,diss_building2.mp4
6757,1062,476,332,diss_building2.mp4
6880,1062,433,335,diss_building2.mp4
7024,1062,398,346,diss_building2.mp4
7154,1062,365,360,diss_building2.mp4
7292,1062,320,385,diss_building2.mp4
7421,1062,281,409,diss_building2.mp4
7559,1062,283,409,diss_building2.mp4
7839,1062,375,405,diss_building2.mp4
7983,1062,388,435,diss_building2.mp4
7990,1062,390,437,diss_building2.mp4
8141,1062,463,457,diss_building2.mp4
8271,1062,530,437,diss_building2.mp4
8402,1062,597,388,diss_building2.mp4
8545,1062,623,366,diss_building2.mp4
8812,1062,685,330,diss_building2.mp4
8929,1062,709,304,diss_building2.mp4
9073,1062,735,273,diss_building2.mp4
9203,1062,758,236,diss_building2.mp4
9347,1062,765,173,diss_building2.mp4
9484,1062,763,147,diss_building2.mp4
9738,1062,765,130,diss_building2.mp4
9957,1062,772,112,diss_building2.mp4
10265,1062,839,112,diss_building2.mp4
10285,1062,862,115,diss_building2.mp4
10416,1062,947,142,diss_building2.mp4
10533,1062,968,150,diss_building2.mp4
10676,1062,983,164,diss_building2.mp4
10807,1062,992,187,diss_building2.mp4
10958,1062,999,212,diss_building2.mp4
11115,1062,1001,231,diss_building2.mp4
11122,1062,1001,232,diss_building2.mp4
11245,1062,1005,248,diss_building2.mp4
11383,1062,1015,258,diss_building2.mp4
11506,1062,1029,260,diss_building2.mp4
11636,1062,1050,260,diss_building2.mp4
11738,1062,1059,259,diss_building2.mp4
11931,1062,1001,272,diss_building2.mp4
12081,1062,945,278,diss_building2.mp4
12212,1062,897,278,diss_building2.mp4
12479,1062,847,270,diss_building2.mp4
12568,1062,831,266,diss_building2.mp4
12712,1062,802,261,diss_building2.mp4
12842,1062,775,256,diss_building2.mp4
12979,1062,738,252,diss_building2.mp4
13130,1062,683,261,diss_building2.mp4
13267,1062,650,275,diss_building2.mp4
13411,1062,623,300,diss_building2.mp4
13555,1062,604,331,diss_building2.mp4
13677,1062,591,361,diss_building2.mp4
13815,1062,618,409,diss_building2.mp4
13945,1062,635,419,diss_building2.mp4
14212,1062,715,428,diss_building2.mp4
14356,1062,760,426,diss_building2.mp4
14486,1062,808,416,diss_building2.mp4
14623,1062,839,402,diss_building2.mp4
14768,1062,866,380,diss_building2.mp4
14911,1062,888,357,diss_building2.mp4
15055,1062,903,336,diss_building2.mp4
15199,1062,909,308,diss_building2.mp4
15336,1062,915,284,diss_building2.mp4
15467,1062,916,265,diss_building2.mp4
15604,1062,927,235,diss_building2.mp4
15734,1062,940,214,diss_building2.mp4
15864,1062,959,202,diss_building2.mp4
16014,1062,998,197,diss_building2.mp4
16021,1062,1001,196,diss_building2.mp4
16158,1062,1047,177,diss_building2.mp4
16289,1062,1065,171,diss_building2.mp4
16419,1062,1086,168,diss_building2.mp4
16556,1062,1111,165,diss_building2.mp4
16830,1062,1156,144,diss_building2.mp4
16981,1062,1147,121,diss_building2.mp4
17138,1062,1095,90,diss_building2.mp4
17262,1062,1039,77,diss_building2.mp4
17392,1062,987,75,diss_building2.mp4
17522,1062,927,81,diss_building2.mp4
17666,1062,862,106,diss_building2.mp4
17673,1062,859,107,diss_building2.mp4
17810,1062,794,142,diss_building2.mp4
18091,1062,575,225,diss_building2.mp4
18228,1062,523,256,diss_building2.mp4
18310,1062,516,263,diss_building2.mp4
18735,1062,396,292,diss_building2.mp4
18831,1062,382,290,diss_building2.mp4
19091,1062,353,273,diss_building2.mp4
19215,1062,334,263,diss_building2.mp4
19222,1062,334,262,diss_building2.mp4
0,1057,605,386,diss_building2.mp4
96,1057,574,398,diss_building2.mp4
205,1057,546,406,diss_building2.mp4
349,1057,503,413,diss_building2.mp4
487,1057,438,421,diss_building2.mp4
740,1057,326,407,diss_building2.mp4
877,1057,305,387,diss_building2.mp4
1021,1057,279,361,diss_building2.mp4
1029,1057,278,360,diss_building2.mp4
1049,1057,276,358,diss_building2.mp4
1562,1057,170,293,diss_building2.mp4
1651,1057,130,270,diss_building2.mp4
1789,1057,110,257,diss_building2.mp4
1946,1057,97,237,diss_building2.mp4
2070,1057,94,220,diss_building2.mp4
2228,1057,127,182,diss_building2.mp4
2515,1057,243,186,diss_building2.mp4
2611,1057,317,168,diss_building2.mp4
2741,1057,358,161,diss_building2.mp4
2878,1057,389,161,diss_building2.mp4
3023,1057,439,161,diss_building2.mp4
3159,1057,475,161,diss_building2.mp4
3297,1057,500,162,diss_building2.mp4
3550,1057,513,282,diss_building2.mp4
3777,1057,349,412,diss_building2.mp4
4002,1057,194,535,diss_building2.mp4
4159,1057,158,585,diss_building2.mp4
4482,1057,84,718,diss_building2.mp4
4927,1057,125,709,diss_building2.mp4
5030,1057,162,714,diss_building2.mp4
5181,1057,231,712,diss_building2.mp4
5318,1057,259,702,diss_building2.mp4
5462,1057,330,628,diss_building2.mp4
5592,1057,359,576,diss_building2.mp4
5730,1057,416,481,diss_building2.mp4
5866,1057,443,419,diss_building2.mp4
6004,1057,455,369,diss_building2.mp4
6133,1057,471,323,diss_building2.mp4
6270,1057,494,300,diss_building2.mp4
6346,1057,503,297,diss_building2.mp4
6681,1057,538,328,diss_building2.mp4
6818,1057,587,390,diss_building2.mp4
6908,1057,605,404,diss_building2.mp4
7045,1057,632,417,diss_building2.mp4
7182,1057,647,424,diss_building2.mp4
7298,1057,662,428,diss_building2.mp4
7435,1057,678,431,diss_building2.mp4
7559,1057,689,431,diss_building2.mp4
7743,1057,696,431,diss_building2.mp4
8649,1057,675,375,diss_building2.mp4
8744,1057,664,352,diss_building2.mp4
8909,1057,649,308,diss_building2.mp4
9039,1057,633,270,diss_building2.mp4
9266,1057,603,225,diss_building2.mp4
9512,1057,600,220,diss_building2.mp4
9738,1057,716,226,diss_building2.mp4
9971,1057,819,231,diss_building2.mp4
10219,1057,880,242,diss_building2.mp4
10458,1057,925,251,diss_building2.mp4
10670,1057,961,258,diss_building2.mp4
10897,1057,975,260,diss_building2.mp4
11109,1057,986,260,diss_building2.mp4
11773,1057,986,261,diss_building2.mp4
12109,1057,984,263,diss_building2.mp4
12143,1057,984,264,diss_building2.mp4
12287,1057,933,383,diss_building2.mp4
12295,1057,933,384,diss_building2.mp4
12452,1057,925,402,diss_building2.mp4
12575,1057,916,471,diss_building2.mp4
12705,1057,915,523,diss_building2.mp4
12727,1057,913,525,diss_building2.mp4
13247,1057,998,529,diss_building2.mp4
13349,1057,1051,532,diss_building2.mp4
13452,1057,1075,527,diss_building2.mp4
13726,1057,1077,486,diss_building2.mp4
13864,1057,1062,443,diss_building2.mp4
13994,1057,1023,393,diss_building2.mp4
14138,1057,968,361,diss_building2.mp4
14275,1057,910,335,diss_building2.mp4
14412,1057,725,336,diss_building2.mp4
14501,1057,591,418,diss_building2.mp4
14940,1057,495,414,diss_building2.mp4
14947,1057,492,414,diss_building2.mp4
15097,1057,439,387,diss_building2.mp4
15228,1057,421,374,diss_building2.mp4
15371,1057,404,355,diss_building2.mp4
15509,1057,394,331,diss_building2.mp4
15646,1057,383,301,diss_building2.mp4
15790,1057,377,285,diss_building2.mp4
15885,1057,377,274,diss_building2.mp4
16153,1057,458,194,diss_building2.mp4
16291,1057,521,165,diss_building2.mp4
16441,1057,588,148,diss_building2.mp4
16577,1057,629,145,diss_building2.mp4
16708,1057,653,146,diss_building2.mp4
16844,1057,678,146,diss_building2.mp4
16968,1057,690,146,diss_building2.mp4
17270,1057,722,153,diss_building2.mp4
17359,1057,735,156,diss_building2.mp4
17386,1057,739,156,diss_building2.mp4
17859,1057,839,163,diss_building2.mp4
17968,1057,863,167,diss_building2.mp4
18106,1057,889,171,diss_building2.mp4
18256,1057,908,172,diss_building2.mp4
18387,1057,933,175,diss_building2.mp4
18605,1057,972,182,diss_building2.mp4
18818,1057,1007,189,diss_building2.mp4
19079,1057,922,260,diss_building2.mp4
0,1061,615,379,diss_truck2.mp4
13,1061,609,381,diss_truck2.mp4
164,1061,558,398,diss_truck2.mp4
172,1061,554,399,diss_truck2.mp4
301,1061,439,445,diss_truck2.mp4
439,1061,333,490,diss_truck2.mp4
589,1061,272,511,diss_truck2.mp4
727,1061,217,529,diss_truck2.mp4
863,1061,204,530,diss_truck2.mp4
1007,1061,189,530,diss_truck2.mp4
1137,1061,154,533,diss_truck2.mp4
1268,1061,135,533,diss_truck2.mp4
1405,1061,110,534,diss_truck2.mp4
1535,1061,108,530,diss_truck2.mp4
1672,1061,234,509,diss_truck2.mp4
1803,1061,262,515,diss_truck2.mp4
1933,1061,291,524,diss_truck2.mp4
2069,1061,321,527,diss_truck2.mp4
2207,1061,368,521,diss_truck2.mp4
2330,1061,429,507,diss_truck2.mp4
2474,1061,463,502,diss_truck2.mp4
2618,1061,504,495,diss_truck2.mp4
2906,1061,589,491,diss_truck2.mp4
3036,1061,618,501,diss_truck2.mp4
3174,1061,690,559,diss_truck2.mp4
3262,1061,717,609,diss_truck2.mp4
3283,1061,718,611,diss_truck2.mp4
3817,1061,738,635,diss_truck2.mp4
3948,1061,751,651,diss_truck2.mp4
4043,1061,761,660,diss_truck2.mp4
4146,1061,764,661,diss_truck2.mp4
4290,1061,763,651,diss_truck2.mp4
4550,1061,541,469,diss_truck2.mp4
4695,1061,494,440,diss_truck2.mp4
4832,1061,469,415,diss_truck2.mp4
4928,1061,458,401,diss_truck2.mp4
5421,1061,453,406,diss_truck2.mp4
5524,1061,456,408,diss_truck2.mp4
5545,1061,459,408,diss_truck2.mp4
5811,1061,526,406,diss_truck2.mp4
5915,1061,552,402,diss_truck2.mp4
6188,1061,604,385,diss_truck2.mp4
6292,1061,623,373,diss_truck2.mp4
6360,1061,627,368,diss_truck2.mp4
6922,1061,702,345,diss_truck2.mp4
7004,1061,731,334,diss_truck2.mp4
7121,1061,760,323,diss_truck2.mp4
7244,1061,778,314,diss_truck2.mp4
7395,1061,808,296,diss_truck2.mp4
7532,1061,833,283,diss_truck2.mp4
7669,1061,855,271,diss_truck2.mp4
7812,1061,869,266,diss_truck2.mp4
7929,1061,876,263,diss_truck2.mp4
8012,1061,879,263,diss_truck2.mp4
8766,1061,877,263,diss_truck2.mp4
8868,1061,861,263,diss_truck2.mp4
9012,1061,667,256,diss_truck2.mp4
9136,1061,505,245,diss_truck2.mp4
9279,1061,395,245,diss_truck2.mp4
9424,1061,344,257,diss_truck2.mp4
9883,1061,289,273,diss_truck2.mp4
9944,1061,285,273,diss_truck2.mp4
10027,1061,283,273,diss_truck2.mp4
10589,1061,402,259,diss_truck2.mp4
10691,1061,513,260,diss_truck2.mp4
10857,1061,625,263,diss_truck2.mp4
10979,1061,667,269,diss_truck2.mp4
11109,1061,736,285,diss_truck2.mp4
11260,1061,824,318,diss_truck2.mp4
11301,1061,833,319,diss_truck2.mp4
11754,1061,937,323,diss_truck2.mp4
11849,1061,955,325,diss_truck2.mp4
12000,1061,992,332,diss_truck2.mp4
12138,1061,1044,352,diss_truck2.mp4
12274,1061,1067,369,diss_truck2.mp4
12418,1061,1081,418,diss_truck2.mp4
12548,1061,1081,450,diss_truck2.mp4
12665,1061,1083,466,diss_truck2.mp4
12740,1061,1084,473,diss_truck2.mp4
13172,1061,1102,495,diss_truck2.mp4
13385,1061,1135,511,diss_truck2.mp4
13487,1061,1150,508,diss_truck2.mp4
13624,1061,1158,503,diss_truck2.mp4
13789,1061,1163,495,diss_truck2.mp4
13927,1061,1171,482,diss_truck2.mp4
14194,1061,1167,465,diss_truck2.mp4
14282,1061,1159,457,diss_truck2.mp4
14426,1061,1139,443,diss_truck2.mp4
14557,1061,1120,435,diss_truck2.mp4
14564,1061,1119,435,diss_truck2.mp4
14846,1061,1082,420,diss_truck2.mp4
14988,1061,994,322,diss_truck2.mp4
15112,1061,981,229,diss_truck2.mp4
15118,1061,984,220,diss_truck2.mp4
15256,1061,1089,116,diss_truck2.mp4
15386,1061,1180,91,diss_truck2.mp4
15502,1061,1204,90,diss_truck2.mp4
16016,1061,1204,105,diss_truck2.mp4
16120,1061,1193,125,diss_truck2.mp4
16256,1061,1147,161,diss_truck2.mp4
16393,1061,1088,190,diss_truck2.mp4
16530,1061,1050,209,diss_truck2.mp4
16675,1061,1010,232,diss_truck2.mp4
16818,1061,978,246,diss_truck2.mp4
16948,1061,897,254,diss_truck2.mp4
17079,1061,845,252,diss_truck2.mp4
17086,1061,840,252,diss_truck2.mp4
17230,1061,780,248,diss_truck2.mp4
17291,1061,768,247,diss_truck2.mp4
17765,1061,714,263,diss_truck2.mp4
17860,1061,687,271,diss_truck2.mp4
17997,1061,644,280,diss_truck2.mp4
18114,1061,605,282,diss_truck2.mp4
18272,1061,552,283,diss_truck2.mp4
18395,1061,513,288,diss_truck2.mp4
18532,1061,470,298,diss_truck2.mp4
18669,1061,433,315,diss_truck2.mp4
18738,1061,425,320,diss_truck2.mp4
19156,1061,372,343,diss_truck2.mp4
19397,1061,294,383,diss_truck2.mp4
19492,1061,280,392,diss_truck2.mp4
19635,1061,249,440,diss_truck2.mp4
19780,1061,259,462,diss_truck2.mp4
19992,1061,327,513,diss_truck2.mp4
0,1058,580,386,diss_car13.mp4
95,1058,540,386,diss_car13.mp4
274,1058,460,369,diss_car13.mp4
280,1058,457,368,diss_car13.mp4
411,1058,397,345,diss_car13.mp4
486,1058,384,336,diss_car13.mp4
932,1058,361,339,diss_car13.mp4
1185,1058,315,347,diss_car13.mp4
1281,1058,295,347,diss_car13.mp4
1432,1058,258,350,diss_car13.mp4
1528,1058,227,352,diss_car13.mp4
1651,1058,178,341,diss_car13.mp4
1788,1058,143,330,diss_car13.mp4
1933,1058,121,320,diss_car13.mp4
2186,1058,132,348,diss_car13.mp4
2330,1058,155,380,diss_car13.mp4
2467,1058,200,403,diss_car13.mp4
2473,1058,204,403,diss_car13.mp4
2624,1058,305,391,diss_car13.mp4
2885,1058,432,353,diss_car13.mp4
3030,1058,496,344,diss_car13.mp4
3475,1058,558,341,diss_car13.mp4
3571,1058,619,344,diss_car13.mp4
3673,1058,665,359,diss_car13.mp4
3804,1058,700,383,diss_car13.mp4
3927,1058,719,398,diss_car13.mp4
4057,1058,735,416,diss_car13.mp4
4194,1058,755,440,diss_car13.mp4
4325,1058,769,457,diss_car13.mp4
4462,1058,799,461,diss_car13.mp4
4620,1058,834,434,diss_car13.mp4
4756,1058,860,401,diss_car13.mp4
4894,1058,880,352,diss_car13.mp4
5051,1058,888,341,diss_car13.mp4
5188,1058,894,333,diss_car13.mp4
5237,1058,896,332,diss_car13.mp4
5812,1058,905,332,diss_car13.mp4
5901,1058,933,334,diss_car13.mp4
6046,1058,956,337,diss_car13.mp4
6169,1058,970,337,diss_car13.mp4
6327,1058,986,327,diss_car13.mp4
6456,1058,993,315,diss_car13.mp4
6601,1058,993,302,diss_car13.mp4
6744,1058,988,284,diss_car13.mp4
6882,1058,982,260,diss_car13.mp4
6890,1058,981,260,diss_car13.mp4
7019,1058,975,241,diss_car13.mp4
7136,1058,969,226,diss_car13.mp4
7417,1058,950,204,diss_car13.mp4
7567,1058,936,190,diss_car13.mp4
7712,1058,912,167,diss_car13.mp4
7848,1058,892,143,diss_car13.mp4
7855,1058,889,140,diss_car13.mp4
7992,1058,864,112,diss_car13.mp4
8157,1058,827,86,diss_car13.mp4
8561,1058,787,107,diss_car13.mp4
8650,1058,777,109,diss_car13.mp4
8671,1058,776,109,diss_car13.mp4
8808,1058,768,111,diss_car13.mp4
8938,1058,760,114,diss_car13.mp4
9185,1058,745,115,diss_car13.mp4
9301,1058,735,115,diss_car13.mp4
9445,1058,716,115,diss_car13.mp4
9582,1058,694,117,diss_car13.mp4
9720,1058,678,120,diss_car13.mp4
9857,1058,658,124,diss_car13.mp4
9987,1058,640,128,diss_car13.mp4
10125,1058,616,133,diss_car13.mp4
10399,1058,572,137,diss_car13.mp4
10494,1058,570,132,diss_car13.mp4
10645,1058,612,90,diss_car13.mp4
10776,1058,696,37,diss_car13.mp4
10905,1058,737,13,diss_car13.mp4
11035,1058,745,9,diss_car13.mp4
11563,1058,791,8,diss_car13.mp4
11666,1058,806,27,diss_car13.mp4
11803,1058,824,57,diss_car13.mp4
11948,1058,842,92,diss_car13.mp4
12091,1058,860,131,diss_car13.mp4
12221,1058,875,163,diss_car13.mp4
12317,1058,879,177,diss_car13.mp4
12667,1058,870,205,diss_car13.mp4
12674,1058,862,232,diss_car13.mp4
12921,1058,797,317,diss_car13.mp4
13017,1058,785,332,diss_car13.mp4
13113,1058,768,341,diss_car13.mp4
13387,1058,641,383,diss_car13.mp4
13531,1058,623,390,diss_car13.mp4
0,1059,636,381,diss_Soccer1.mp4
145,1059,537,463,diss_Soccer1.mp4
234,1059,504,476,diss_Soccer1.mp4
384,1059,411,508,diss_Soccer1.mp4
522,1059,345,525,diss_Soccer1.mp4
659,1059,300,534,diss_Soccer1.mp4
803,1059,281,534,diss_Soccer1.mp4
933,1059,269,539,diss_Soccer1.mp4
1174,1059,255,554,diss_Soccer1.mp4
1303,1059,246,559,diss_Soccer1.mp4
1838,1059,281,564,diss_Soccer1.mp4
1921,1059,289,564,diss_Soccer1.mp4
2064,1059,295,561,diss_Soccer1.mp4
2194,1059,325,551,diss_Soccer1.mp4
2325,1059,355,548,diss_Soccer1.mp4
2407,1059,360,548,diss_Soccer1.mp4
2593,1059,359,548,diss_Soccer1.mp4
2819,1059,402,542,diss_Soccer1.mp4
2935,1059,411,542,diss_Soccer1.mp4
3093,1059,446,552,diss_Soccer1.mp4
3229,1059,511,560,diss_Soccer1.mp4
3367,1059,551,562,diss_Soccer1.mp4
3504,1059,593,563,diss_Soccer1.mp4
3634,1059,627,564,diss_Soccer1.mp4
3696,1059,631,564,diss_Soccer1.mp4
5986,1059,621,562,diss_Soccer1.mp4
6163,1059,611,555,diss_Soccer1.mp4
6246,1059,610,554,diss_Soccer1.mp4
6431,1059,604,549,diss_Soccer1.mp4
6513,1059,602,548,diss_Soccer1.mp4
6699,1059,601,547,diss_Soccer1.mp4
6794,1059,598,545,diss_Soccer1.mp4
7514,1059,598,544,diss_Soccer1.mp4
7596,1059,594,541,diss_Soccer1.mp4
7740,1059,587,536,diss_Soccer1.mp4
7884,1059,579,532,diss_Soccer1.mp4
8042,1059,578,527,diss_Soccer1.mp4
8344,1059,574,513,diss_Soccer1.mp4
8453,1059,576,513,diss_Soccer1.mp4
9153,1059,577,513,diss_Soccer1.mp4
9282,1059,581,515,diss_Soccer1.mp4
9488,1059,597,495,diss_Soccer1.mp4
9605,1059,603,488,diss_Soccer1.mp4
9921,1059,603,487,diss_Soccer1.mp4
10606,1059,603,486,diss_Soccer1.mp4
10811,1059,615,473,diss_Soccer1.mp4
10832,1059,616,473,diss_Soccer1.mp4
11401,1059,616,474,diss_Soccer1.mp4
12272,1059,613,474,diss_Soccer1.mp4
12375,1059,610,474,diss_Soccer1.mp4
12525,1059,606,473,diss_Soccer1.mp4
12636,1059,605,472,diss_Soccer1.mp4
12772,1059,603,472,diss_Soccer1.mp4
14075,1059,586,460,diss_Soccer1.mp4
14170,1059,578,455,diss_Soccer1.mp4
14294,1059,573,452,diss_Soccer1.mp4
14398,1059,573,451,diss_Soccer1.mp4
15219,1059,574,451,diss_Soccer1.mp4
15323,1059,577,451,diss_Soccer1.mp4
15480,1059,582,451,diss_Soccer1.mp4
15617,1059,586,451,diss_Soccer1.mp4
15782,1059,597,452,diss_Soccer1.mp4
15795,1059,598,452,diss_Soccer1.mp4
15939,1059,604,452,diss_Soccer1.mp4
16865,1059,605,452,diss_Soccer1.mp4
16933,1059,605,453,diss_Soccer1.mp4
17366,1059,606,453,diss_Soccer1.mp4
17694,1059,605,455,diss_Soccer1.mp4
17783,1059,601,456,diss_Soccer1.mp4
17961,1059,600,451,diss_Soccer1.mp4
18099,1059,598,439,diss_Soccer1.mp4
18243,1059,595,424,diss_Soccer1.mp4
18366,1059,592,417,diss_Soccer1.mp4
18531,1059,588,411,diss_Soccer1.mp4
18661,1059,585,406,diss_Soccer1.mp4
18675,1059,584,406,diss_Soccer1.mp4
18928,1059,584,395,diss_Soccer1.mp4
19024,1059,584,393,diss_Soccer1.mp4
19141,1059,584,391,diss_Soccer1.mp4
19443,1059,592,381,diss_Soccer1.mp4
19573,1059,603,378,diss_Soccer1.mp4
19704,1059,611,377,diss_Soccer1.mp4
