verifToken,stimuli_id,source_id,media_a_id,source_a,created_at,source_name_vote,reversed,source_position_vote,bl,bd,nb_replay
hahvyjzz,1084,5564,44534,diss_building1.mp4,1644245791,1,,1,8,120,59
hahvyjzz,1100,5573,44543,diss_truck2.mp4,1644245833,1,,1,8,120,1
hahvyjzz,1101,5574,44544,diss_truck3.mp4,1644245852,1,,1,8,120,1
hahvyjzz,1093,5555,44525,diss_Girl2.mp4,1644245873,1,,1,8,120,1
hahvyjzz,1083,5563,44533,diss_bike3.mp4,1644245892,1,,1,8,120,1
hahvyjzz,1087,5567,44537,diss_building4.mp4,1644245911,1,,1,8,120,1
hahvyjzz,1082,5562,44532,diss_bike2.mp4,1644245931,1,,1,8,120,1
hahvyjzz,1096,5572,44542,diss_person22.mp4,1644245951,1,,1,8,120,1
hahvyjzz,1092,5554,44524,diss_Girl1.mp4,1644245971,1,,1,8,120,1
hahvyjzz,1095,5557,44527,diss_ManRunning2.mp4,1644245990,1,,1,8,120,1
hahvyjzz,1102,5561,44531,diss_Walking.mp4,1644246010,1,,1,8,120,1
hahvyjzz,1089,5569,44539,diss_car12.mp4,1644246030,1,,1,8,120,1
hahvyjzz,1094,5556,44526,diss_ManRunning1.mp4,1644246049,1,,1,8,120,1
hahvyjzz,1097,5558,44528,diss_Soccer1.mp4,1644246070,1,,1,8,120,1
hahvyjzz,1081,5553,44523,diss_Basketball.mp4,1644246089,1,,1,8,120,1
hahvyjzz,1091,5571,44541,diss_car15.mp4,1644246109,1,,1,8,120,1
hahvyjzz,1098,5559,44529,diss_Soccer2.mp4,1644246129,1,,1,8,120,1
hahvyjzz,1086,5566,44536,diss_building3.mp4,1644246149,1,,1,8,120,1
hahvyjzz,1090,5570,44540,diss_car13.mp4,1644246169,1,,1,8,120,1
hahvyjzz,1099,5560,44530,diss_StreetBasketball1.mp4,1644246190,1,,1,8,120,1
hahvyjzz,1088,5568,44538,diss_car11.mp4,1644246210,1,,1,8,120,1
hahvyjzz,1085,5565,44535,diss_building2.mp4,1644246229,1,,1,8,120,1
