verifToken,stimuli_id,source_id,media_a_id,source_a,created_at,source_name_vote,reversed,source_position_vote,bl,bd,nb_replay
uwp15j4g,1071,4277,14068,diss_car12.mp4,1644430561,1,,1,8,120,0
uwp15j4g,1070,4276,14067,diss_building4.mp4,1644430598,1,,1,8,120,1
uwp15j4g,1074,4272,14063,diss_Basketball.mp4,1644430649,1,,1,8,120,0
uwp15j4g,1069,4275,14066,diss_bike2.mp4,1644430672,1,,1,8,120,0
uwp15j4g,1073,4274,14065,diss_Soccer2.mp4,1644430684,1,,1,8,120,0
uwp15j4g,1072,4273,14064,diss_ManRunning2.mp4,1644430697,1,,1,8,120,0
