timestamp,stimuli_id,mouseX,mouseY,stimuli
0,1059,638,375,diss_Soccer1.mp4
4038,1059,637,375,diss_Soccer1.mp4
4057,1059,636,375,diss_Soccer1.mp4
4087,1059,635,375,diss_Soccer1.mp4
4117,1059,634,375,diss_Soccer1.mp4
4130,1059,633,375,diss_Soccer1.mp4
4156,1059,632,375,diss_Soccer1.mp4
4233,1059,631,376,diss_Soccer1.mp4
4240,1059,630,376,diss_Soccer1.mp4
4264,1059,629,376,diss_Soccer1.mp4
4285,1059,628,376,diss_Soccer1.mp4
4304,1059,627,376,diss_Soccer1.mp4
4338,1059,626,376,diss_Soccer1.mp4
4366,1059,625,376,diss_Soccer1.mp4
4723,1059,625,377,diss_Soccer1.mp4
4753,1059,624,377,diss_Soccer1.mp4
4828,1059,624,378,diss_Soccer1.mp4
5270,1059,626,378,diss_Soccer1.mp4
5284,1059,628,378,diss_Soccer1.mp4
5303,1059,629,378,diss_Soccer1.mp4
5319,1059,632,378,diss_Soccer1.mp4
5353,1059,634,378,diss_Soccer1.mp4
5368,1059,635,378,diss_Soccer1.mp4
5373,1059,636,378,diss_Soccer1.mp4
5395,1059,637,378,diss_Soccer1.mp4
5418,1059,639,378,diss_Soccer1.mp4
5432,1059,640,378,diss_Soccer1.mp4
5457,1059,642,379,diss_Soccer1.mp4
5486,1059,644,379,diss_Soccer1.mp4
5492,1059,644,380,diss_Soccer1.mp4
5516,1059,646,380,diss_Soccer1.mp4
5535,1059,648,381,diss_Soccer1.mp4
5555,1059,648,382,diss_Soccer1.mp4
5578,1059,649,382,diss_Soccer1.mp4
5604,1059,650,383,diss_Soccer1.mp4
5640,1059,651,384,diss_Soccer1.mp4
5683,1059,651,385,diss_Soccer1.mp4
5702,1059,650,387,diss_Soccer1.mp4
5718,1059,648,389,diss_Soccer1.mp4
5737,1059,646,392,diss_Soccer1.mp4
5752,1059,644,393,diss_Soccer1.mp4
5767,1059,640,394,diss_Soccer1.mp4
5787,1059,636,396,diss_Soccer1.mp4
5802,1059,632,396,diss_Soccer1.mp4
5817,1059,628,396,diss_Soccer1.mp4
5836,1059,622,396,diss_Soccer1.mp4
5851,1059,618,396,diss_Soccer1.mp4
5870,1059,612,396,diss_Soccer1.mp4
5885,1059,611,396,diss_Soccer1.mp4
5891,1059,610,396,diss_Soccer1.mp4
5907,1059,608,396,diss_Soccer1.mp4
5934,1059,606,396,diss_Soccer1.mp4
5949,1059,604,396,diss_Soccer1.mp4
5969,1059,602,396,diss_Soccer1.mp4
5975,1059,601,396,diss_Soccer1.mp4
5990,1059,600,396,diss_Soccer1.mp4
6019,1059,598,396,diss_Soccer1.mp4
6047,1059,596,396,diss_Soccer1.mp4
6058,1059,594,396,diss_Soccer1.mp4
6082,1059,592,396,diss_Soccer1.mp4
6095,1059,591,396,diss_Soccer1.mp4
6108,1059,590,396,diss_Soccer1.mp4
6136,1059,587,396,diss_Soccer1.mp4
6152,1059,585,396,diss_Soccer1.mp4
6157,1059,584,396,diss_Soccer1.mp4
6187,1059,582,396,diss_Soccer1.mp4
6191,1059,581,396,diss_Soccer1.mp4
6220,1059,578,396,diss_Soccer1.mp4
6228,1059,577,396,diss_Soccer1.mp4
6250,1059,575,396,diss_Soccer1.mp4
6263,1059,574,396,diss_Soccer1.mp4
6284,1059,572,396,diss_Soccer1.mp4
6313,1059,570,396,diss_Soccer1.mp4
6325,1059,569,396,diss_Soccer1.mp4
6353,1059,567,396,diss_Soccer1.mp4
6369,1059,566,396,diss_Soccer1.mp4
6388,1059,565,396,diss_Soccer1.mp4
6402,1059,564,396,diss_Soccer1.mp4
6430,1059,563,396,diss_Soccer1.mp4
6453,1059,562,396,diss_Soccer1.mp4
6472,1059,561,396,diss_Soccer1.mp4
6752,1059,562,396,diss_Soccer1.mp4
6794,1059,563,395,diss_Soccer1.mp4
6816,1059,564,394,diss_Soccer1.mp4
6837,1059,565,393,diss_Soccer1.mp4
6851,1059,566,392,diss_Soccer1.mp4
6869,1059,570,389,diss_Soccer1.mp4
6884,1059,573,387,diss_Soccer1.mp4
6899,1059,580,383,diss_Soccer1.mp4
6919,1059,592,378,diss_Soccer1.mp4
6933,1059,600,376,diss_Soccer1.mp4
6949,1059,604,375,diss_Soccer1.mp4
6968,1059,609,374,diss_Soccer1.mp4
6983,1059,611,374,diss_Soccer1.mp4
7003,1059,615,372,diss_Soccer1.mp4
7017,1059,618,372,diss_Soccer1.mp4
7032,1059,620,372,diss_Soccer1.mp4
7048,1059,624,372,diss_Soccer1.mp4
7066,1059,628,372,diss_Soccer1.mp4
7086,1059,631,372,diss_Soccer1.mp4
7096,1059,632,372,diss_Soccer1.mp4
7115,1059,634,372,diss_Soccer1.mp4
7137,1059,636,372,diss_Soccer1.mp4
7150,1059,638,372,diss_Soccer1.mp4
7165,1059,639,372,diss_Soccer1.mp4
7184,1059,641,372,diss_Soccer1.mp4
7194,1059,643,372,diss_Soccer1.mp4
7208,1059,644,372,diss_Soccer1.mp4
7234,1059,647,372,diss_Soccer1.mp4
7249,1059,649,372,diss_Soccer1.mp4
7268,1059,652,372,diss_Soccer1.mp4
7283,1059,654,372,diss_Soccer1.mp4
7298,1059,656,372,diss_Soccer1.mp4
7317,1059,659,372,diss_Soccer1.mp4
7332,1059,661,371,diss_Soccer1.mp4
7352,1059,664,371,diss_Soccer1.mp4
7366,1059,666,370,diss_Soccer1.mp4
7376,1059,668,370,diss_Soccer1.mp4
7397,1059,670,370,diss_Soccer1.mp4
7410,1059,672,370,diss_Soccer1.mp4
7436,1059,676,370,diss_Soccer1.mp4
7450,1059,677,370,diss_Soccer1.mp4
7465,1059,679,370,diss_Soccer1.mp4
7480,1059,681,370,diss_Soccer1.mp4
7499,1059,683,370,diss_Soccer1.mp4
7514,1059,684,370,diss_Soccer1.mp4
7549,1059,685,370,diss_Soccer1.mp4
7569,1059,686,370,diss_Soccer1.mp4
7592,1059,687,370,diss_Soccer1.mp4
7697,1059,687,371,diss_Soccer1.mp4
10760,1059,686,372,diss_Soccer1.mp4
10782,1059,684,375,diss_Soccer1.mp4
10797,1059,682,378,diss_Soccer1.mp4
10816,1059,678,384,diss_Soccer1.mp4
10832,1059,676,391,diss_Soccer1.mp4
10846,1059,673,396,diss_Soccer1.mp4
10864,1059,671,400,diss_Soccer1.mp4
10872,1059,670,402,diss_Soccer1.mp4
10900,1059,668,405,diss_Soccer1.mp4
10913,1059,667,407,diss_Soccer1.mp4
10923,1059,667,408,diss_Soccer1.mp4
10948,1059,665,411,diss_Soccer1.mp4
10963,1059,664,412,diss_Soccer1.mp4
10983,1059,664,413,diss_Soccer1.mp4
11006,1059,664,414,diss_Soccer1.mp4
11032,1059,663,415,diss_Soccer1.mp4
11076,1059,663,416,diss_Soccer1.mp4
11424,1059,662,416,diss_Soccer1.mp4
11447,1059,661,412,diss_Soccer1.mp4
11466,1059,660,408,diss_Soccer1.mp4
11493,1059,659,406,diss_Soccer1.mp4
11515,1059,658,404,diss_Soccer1.mp4
11530,1059,658,403,diss_Soccer1.mp4
11549,1059,658,401,diss_Soccer1.mp4
11558,1059,658,400,diss_Soccer1.mp4
11585,1059,658,399,diss_Soccer1.mp4
11602,1059,658,397,diss_Soccer1.mp4
11619,1059,658,396,diss_Soccer1.mp4
11642,1059,658,395,diss_Soccer1.mp4
11669,1059,658,394,diss_Soccer1.mp4
11712,1059,658,393,diss_Soccer1.mp4
11726,1059,658,392,diss_Soccer1.mp4
11748,1059,659,392,diss_Soccer1.mp4
11761,1059,660,391,diss_Soccer1.mp4
11774,1059,661,390,diss_Soccer1.mp4
11795,1059,662,388,diss_Soccer1.mp4
11810,1059,664,388,diss_Soccer1.mp4
11824,1059,665,388,diss_Soccer1.mp4
11846,1059,667,388,diss_Soccer1.mp4
11864,1059,668,388,diss_Soccer1.mp4
11878,1059,668,387,diss_Soccer1.mp4
11909,1059,669,386,diss_Soccer1.mp4
11928,1059,670,386,diss_Soccer1.mp4
11962,1059,671,386,diss_Soccer1.mp4
12012,1059,671,385,diss_Soccer1.mp4
12032,1059,671,384,diss_Soccer1.mp4
12082,1059,670,382,diss_Soccer1.mp4
12102,1059,669,381,diss_Soccer1.mp4
12124,1059,668,380,diss_Soccer1.mp4
12161,1059,667,380,diss_Soccer1.mp4
12173,1059,667,379,diss_Soccer1.mp4
12185,1059,666,379,diss_Soccer1.mp4
12221,1059,665,379,diss_Soccer1.mp4
12263,1059,664,379,diss_Soccer1.mp4
12355,1059,664,378,diss_Soccer1.mp4
12460,1059,664,377,diss_Soccer1.mp4
12481,1059,663,377,diss_Soccer1.mp4
12486,1059,663,376,diss_Soccer1.mp4
12515,1059,662,376,diss_Soccer1.mp4
12545,1059,662,375,diss_Soccer1.mp4
12572,1059,662,374,diss_Soccer1.mp4
12620,1059,661,374,diss_Soccer1.mp4
12642,1059,660,374,diss_Soccer1.mp4
12655,1059,660,373,diss_Soccer1.mp4
12678,1059,660,372,diss_Soccer1.mp4
12698,1059,659,372,diss_Soccer1.mp4
12732,1059,658,372,diss_Soccer1.mp4
12766,1059,657,372,diss_Soccer1.mp4
14029,1059,656,372,diss_Soccer1.mp4
14045,1059,655,372,diss_Soccer1.mp4
14078,1059,652,372,diss_Soccer1.mp4
14113,1059,652,371,diss_Soccer1.mp4
14129,1059,651,371,diss_Soccer1.mp4
14135,1059,650,371,diss_Soccer1.mp4
14157,1059,649,370,diss_Soccer1.mp4
14178,1059,648,369,diss_Soccer1.mp4
14212,1059,647,368,diss_Soccer1.mp4
14242,1059,646,368,diss_Soccer1.mp4
15840,1059,646,373,diss_Soccer1.mp4
15856,1059,645,384,diss_Soccer1.mp4
15878,1059,645,392,diss_Soccer1.mp4
15894,1059,645,394,diss_Soccer1.mp4
15910,1059,645,396,diss_Soccer1.mp4
15946,1059,645,397,diss_Soccer1.mp4
15967,1059,645,398,diss_Soccer1.mp4
15981,1059,645,399,diss_Soccer1.mp4
16016,1059,645,400,diss_Soccer1.mp4
16345,1059,644,403,diss_Soccer1.mp4
16360,1059,644,405,diss_Soccer1.mp4
16366,1059,644,408,diss_Soccer1.mp4
16395,1059,644,413,diss_Soccer1.mp4
16410,1059,644,416,diss_Soccer1.mp4
16423,1059,644,419,diss_Soccer1.mp4
16443,1059,644,424,diss_Soccer1.mp4
16459,1059,644,425,diss_Soccer1.mp4
16464,1059,644,427,diss_Soccer1.mp4
16493,1059,644,429,diss_Soccer1.mp4
16498,1059,644,430,diss_Soccer1.mp4
16521,1059,644,432,diss_Soccer1.mp4
16556,1059,644,433,diss_Soccer1.mp4
16569,1059,644,434,diss_Soccer1.mp4
16611,1059,644,436,diss_Soccer1.mp4
16647,1059,644,437,diss_Soccer1.mp4
16676,1059,644,438,diss_Soccer1.mp4
16688,1059,644,439,diss_Soccer1.mp4
16730,1059,644,440,diss_Soccer1.mp4
16808,1059,644,441,diss_Soccer1.mp4
17010,1059,644,442,diss_Soccer1.mp4
17025,1059,644,443,diss_Soccer1.mp4
17064,1059,644,444,diss_Soccer1.mp4
18655,1059,644,443,diss_Soccer1.mp4
18675,1059,644,440,diss_Soccer1.mp4
18690,1059,645,438,diss_Soccer1.mp4
18704,1059,645,436,diss_Soccer1.mp4
18724,1059,646,435,diss_Soccer1.mp4
18739,1059,646,433,diss_Soccer1.mp4
18743,1059,647,432,diss_Soccer1.mp4
18765,1059,647,431,diss_Soccer1.mp4
18779,1059,648,430,diss_Soccer1.mp4
18800,1059,648,429,diss_Soccer1.mp4
18813,1059,648,428,diss_Soccer1.mp4
18843,1059,649,427,diss_Soccer1.mp4
18862,1059,649,426,diss_Soccer1.mp4
18892,1059,649,424,diss_Soccer1.mp4
18941,1059,649,422,diss_Soccer1.mp4
18967,1059,650,421,diss_Soccer1.mp4
19003,1059,650,420,diss_Soccer1.mp4
19066,1059,650,418,diss_Soccer1.mp4
19089,1059,650,417,diss_Soccer1.mp4
19102,1059,650,416,diss_Soccer1.mp4
19157,1059,650,414,diss_Soccer1.mp4
19173,1059,650,413,diss_Soccer1.mp4
19192,1059,650,412,diss_Soccer1.mp4
19221,1059,650,411,diss_Soccer1.mp4
19256,1059,650,410,diss_Soccer1.mp4
19296,1059,650,409,diss_Soccer1.mp4
19389,1059,650,408,diss_Soccer1.mp4
0,1059,637,364,diss_Soccer1.mp4
21,1059,605,363,diss_Soccer1.mp4
33,1059,592,360,diss_Soccer1.mp4
54,1059,586,360,diss_Soccer1.mp4
67,1059,582,359,diss_Soccer1.mp4
83,1059,578,358,diss_Soccer1.mp4
104,1059,569,356,diss_Soccer1.mp4
117,1059,564,354,diss_Soccer1.mp4
132,1059,559,353,diss_Soccer1.mp4
147,1059,552,352,diss_Soccer1.mp4
166,1059,547,351,diss_Soccer1.mp4
187,1059,540,348,diss_Soccer1.mp4
201,1059,535,347,diss_Soccer1.mp4
216,1059,531,346,diss_Soccer1.mp4
236,1059,525,344,diss_Soccer1.mp4
250,1059,523,344,diss_Soccer1.mp4
271,1059,519,344,diss_Soccer1.mp4
285,1059,515,343,diss_Soccer1.mp4
300,1059,512,343,diss_Soccer1.mp4
319,1059,508,343,diss_Soccer1.mp4
333,1059,505,343,diss_Soccer1.mp4
348,1059,504,343,diss_Soccer1.mp4
369,1059,500,343,diss_Soccer1.mp4
382,1059,497,343,diss_Soccer1.mp4
404,1059,494,343,diss_Soccer1.mp4
418,1059,491,343,diss_Soccer1.mp4
433,1059,488,344,diss_Soccer1.mp4
452,1059,484,346,diss_Soccer1.mp4
466,1059,479,348,diss_Soccer1.mp4
481,1059,476,349,diss_Soccer1.mp4
502,1059,471,352,diss_Soccer1.mp4
515,1059,468,354,diss_Soccer1.mp4
537,1059,462,357,diss_Soccer1.mp4
551,1059,459,360,diss_Soccer1.mp4
565,1059,453,363,diss_Soccer1.mp4
585,1059,445,369,diss_Soccer1.mp4
599,1059,439,374,diss_Soccer1.mp4
620,1059,429,382,diss_Soccer1.mp4
635,1059,424,384,diss_Soccer1.mp4
648,1059,417,389,diss_Soccer1.mp4
669,1059,406,396,diss_Soccer1.mp4
683,1059,400,400,diss_Soccer1.mp4
698,1059,393,404,diss_Soccer1.mp4
718,1059,385,410,diss_Soccer1.mp4
732,1059,379,413,diss_Soccer1.mp4
747,1059,374,416,diss_Soccer1.mp4
767,1059,364,424,diss_Soccer1.mp4
782,1059,357,429,diss_Soccer1.mp4
802,1059,348,436,diss_Soccer1.mp4
816,1059,343,440,diss_Soccer1.mp4
831,1059,338,444,diss_Soccer1.mp4
851,1059,328,452,diss_Soccer1.mp4
865,1059,324,458,diss_Soccer1.mp4
887,1059,314,468,diss_Soccer1.mp4
900,1059,307,476,diss_Soccer1.mp4
915,1059,302,482,diss_Soccer1.mp4
936,1059,294,492,diss_Soccer1.mp4
949,1059,288,500,diss_Soccer1.mp4
964,1059,285,503,diss_Soccer1.mp4
983,1059,276,512,diss_Soccer1.mp4
998,1059,273,516,diss_Soccer1.mp4
1018,1059,268,523,diss_Soccer1.mp4
1033,1059,264,528,diss_Soccer1.mp4
1048,1059,261,532,diss_Soccer1.mp4
1068,1059,259,537,diss_Soccer1.mp4
1081,1059,255,543,diss_Soccer1.mp4
1102,1059,250,550,diss_Soccer1.mp4
1117,1059,248,553,diss_Soccer1.mp4
1131,1059,244,556,diss_Soccer1.mp4
1152,1059,240,564,diss_Soccer1.mp4
1165,1059,231,581,diss_Soccer1.mp4
1180,1059,223,602,diss_Soccer1.mp4
1201,1059,216,617,diss_Soccer1.mp4
1619,1059,204,613,diss_Soccer1.mp4
1634,1059,201,612,diss_Soccer1.mp4
1641,1059,200,610,diss_Soccer1.mp4
1656,1059,198,609,diss_Soccer1.mp4
1672,1059,197,608,diss_Soccer1.mp4
1695,1059,196,607,diss_Soccer1.mp4
1709,1059,196,606,diss_Soccer1.mp4
1725,1059,195,605,diss_Soccer1.mp4
1748,1059,195,604,diss_Soccer1.mp4
1780,1059,196,602,diss_Soccer1.mp4
1801,1059,200,599,diss_Soccer1.mp4
1817,1059,204,597,diss_Soccer1.mp4
1832,1059,205,596,diss_Soccer1.mp4
1852,1059,212,594,diss_Soccer1.mp4
1866,1059,216,592,diss_Soccer1.mp4
1882,1059,223,590,diss_Soccer1.mp4
1902,1059,238,584,diss_Soccer1.mp4
1915,1059,252,578,diss_Soccer1.mp4
1931,1059,265,572,diss_Soccer1.mp4
1950,1059,276,566,diss_Soccer1.mp4
1965,1059,280,564,diss_Soccer1.mp4
1981,1059,283,563,diss_Soccer1.mp4
1999,1059,284,562,diss_Soccer1.mp4
2015,1059,284,561,diss_Soccer1.mp4
2028,1059,285,561,diss_Soccer1.mp4
2042,1059,286,561,diss_Soccer1.mp4
2076,1059,287,561,diss_Soccer1.mp4
2187,1059,288,561,diss_Soccer1.mp4
2279,1059,290,560,diss_Soccer1.mp4
2299,1059,296,558,diss_Soccer1.mp4
2315,1059,314,552,diss_Soccer1.mp4
2334,1059,334,544,diss_Soccer1.mp4
2348,1059,346,541,diss_Soccer1.mp4
2365,1059,369,540,diss_Soccer1.mp4
2383,1059,400,541,diss_Soccer1.mp4
2398,1059,424,545,diss_Soccer1.mp4
2419,1059,444,548,diss_Soccer1.mp4
2433,1059,451,550,diss_Soccer1.mp4
2448,1059,454,551,diss_Soccer1.mp4
2453,1059,456,552,diss_Soccer1.mp4
2474,1059,457,552,diss_Soccer1.mp4
3363,1059,450,552,diss_Soccer1.mp4
3383,1059,381,532,diss_Soccer1.mp4
3397,1059,361,526,diss_Soccer1.mp4
3417,1059,345,520,diss_Soccer1.mp4
3433,1059,338,517,diss_Soccer1.mp4
3447,1059,333,516,diss_Soccer1.mp4
3467,1059,328,513,diss_Soccer1.mp4
3482,1059,326,512,diss_Soccer1.mp4
3500,1059,317,510,diss_Soccer1.mp4
3516,1059,305,507,diss_Soccer1.mp4
3530,1059,287,504,diss_Soccer1.mp4
3551,1059,264,502,diss_Soccer1.mp4
3565,1059,256,501,diss_Soccer1.mp4
3584,1059,251,501,diss_Soccer1.mp4
3600,1059,248,501,diss_Soccer1.mp4
3615,1059,246,501,diss_Soccer1.mp4
3634,1059,242,501,diss_Soccer1.mp4
3648,1059,240,501,diss_Soccer1.mp4
3664,1059,239,501,diss_Soccer1.mp4
3684,1059,235,501,diss_Soccer1.mp4
3698,1059,230,502,diss_Soccer1.mp4
3717,1059,216,509,diss_Soccer1.mp4
3733,1059,207,516,diss_Soccer1.mp4
3748,1059,197,523,diss_Soccer1.mp4
3767,1059,180,532,diss_Soccer1.mp4
3782,1059,172,536,diss_Soccer1.mp4
3796,1059,166,539,diss_Soccer1.mp4
3816,1059,161,540,diss_Soccer1.mp4
3831,1059,160,541,diss_Soccer1.mp4
3850,1059,156,542,diss_Soccer1.mp4
3871,1059,155,543,diss_Soccer1.mp4
3893,1059,153,543,diss_Soccer1.mp4
3915,1059,152,543,diss_Soccer1.mp4
3977,1059,150,543,diss_Soccer1.mp4
4004,1059,149,544,diss_Soccer1.mp4
4053,1059,148,544,diss_Soccer1.mp4
4466,1059,151,540,diss_Soccer1.mp4
4481,1059,153,536,diss_Soccer1.mp4
4495,1059,155,533,diss_Soccer1.mp4
4516,1059,157,530,diss_Soccer1.mp4
4530,1059,159,528,diss_Soccer1.mp4
4911,1059,155,517,diss_Soccer1.mp4
4929,1059,151,510,diss_Soccer1.mp4
4943,1059,149,506,diss_Soccer1.mp4
4966,1059,146,502,diss_Soccer1.mp4
4981,1059,145,500,diss_Soccer1.mp4
4997,1059,144,499,diss_Soccer1.mp4
5013,1059,142,497,diss_Soccer1.mp4
5030,1059,140,496,diss_Soccer1.mp4
5044,1059,139,494,diss_Soccer1.mp4
5059,1059,136,492,diss_Soccer1.mp4
5082,1059,133,491,diss_Soccer1.mp4
5098,1059,130,489,diss_Soccer1.mp4
5114,1059,125,488,diss_Soccer1.mp4
5128,1059,124,486,diss_Soccer1.mp4
5148,1059,117,485,diss_Soccer1.mp4
5163,1059,115,484,diss_Soccer1.mp4
5183,1059,112,484,diss_Soccer1.mp4
5210,1059,109,484,diss_Soccer1.mp4
5231,1059,107,484,diss_Soccer1.mp4
5247,1059,104,484,diss_Soccer1.mp4
5261,1059,101,484,diss_Soccer1.mp4
5281,1059,96,485,diss_Soccer1.mp4
5296,1059,93,486,diss_Soccer1.mp4
5315,1059,88,488,diss_Soccer1.mp4
5331,1059,85,488,diss_Soccer1.mp4
5345,1059,81,489,diss_Soccer1.mp4
5365,1059,78,490,diss_Soccer1.mp4
5380,1059,76,491,diss_Soccer1.mp4
5399,1059,75,491,diss_Soccer1.mp4
5414,1059,74,492,diss_Soccer1.mp4
5420,1059,73,492,diss_Soccer1.mp4
5442,1059,72,492,diss_Soccer1.mp4
5546,1059,72,491,diss_Soccer1.mp4
5562,1059,74,488,diss_Soccer1.mp4
5581,1059,78,482,diss_Soccer1.mp4
5597,1059,80,478,diss_Soccer1.mp4
5611,1059,83,476,diss_Soccer1.mp4
5631,1059,84,472,diss_Soccer1.mp4
5637,1059,85,471,diss_Soccer1.mp4
5665,1059,86,469,diss_Soccer1.mp4
5672,1059,87,468,diss_Soccer1.mp4
5686,1059,88,468,diss_Soccer1.mp4
5715,1059,88,465,diss_Soccer1.mp4
5730,1059,88,464,diss_Soccer1.mp4
5749,1059,89,463,diss_Soccer1.mp4
5770,1059,90,462,diss_Soccer1.mp4
5792,1059,91,461,diss_Soccer1.mp4
5827,1059,92,460,diss_Soccer1.mp4
5848,1059,93,458,diss_Soccer1.mp4
6381,1059,98,456,diss_Soccer1.mp4
6397,1059,102,453,diss_Soccer1.mp4
6413,1059,104,452,diss_Soccer1.mp4
6427,1059,106,452,diss_Soccer1.mp4
6440,1059,108,451,diss_Soccer1.mp4
6482,1059,110,450,diss_Soccer1.mp4
6497,1059,111,450,diss_Soccer1.mp4
6510,1059,112,449,diss_Soccer1.mp4
6594,1059,114,449,diss_Soccer1.mp4
6614,1059,115,449,diss_Soccer1.mp4
6630,1059,116,449,diss_Soccer1.mp4
6644,1059,117,449,diss_Soccer1.mp4
6664,1059,128,448,diss_Soccer1.mp4
6679,1059,163,441,diss_Soccer1.mp4
6693,1059,229,419,diss_Soccer1.mp4
6713,1059,288,396,diss_Soccer1.mp4
6727,1059,316,385,diss_Soccer1.mp4
6747,1059,348,378,diss_Soccer1.mp4
6762,1059,370,377,diss_Soccer1.mp4
6777,1059,388,377,diss_Soccer1.mp4
6797,1059,412,379,diss_Soccer1.mp4
6812,1059,422,381,diss_Soccer1.mp4
6831,1059,432,383,diss_Soccer1.mp4
6846,1059,433,384,diss_Soccer1.mp4
7211,1059,436,384,diss_Soccer1.mp4
7227,1059,448,384,diss_Soccer1.mp4
7246,1059,468,387,diss_Soccer1.mp4
7261,1059,480,388,diss_Soccer1.mp4
7274,1059,488,390,diss_Soccer1.mp4
7296,1059,503,392,diss_Soccer1.mp4
7311,1059,507,393,diss_Soccer1.mp4
7329,1059,513,394,diss_Soccer1.mp4
7345,1059,516,396,diss_Soccer1.mp4
7360,1059,520,396,diss_Soccer1.mp4
7379,1059,524,396,diss_Soccer1.mp4
7394,1059,525,397,diss_Soccer1.mp4
7414,1059,528,397,diss_Soccer1.mp4
7428,1059,528,398,diss_Soccer1.mp4
7444,1059,530,399,diss_Soccer1.mp4
7457,1059,532,399,diss_Soccer1.mp4
7483,1059,533,399,diss_Soccer1.mp4
7512,1059,535,399,diss_Soccer1.mp4
7861,1059,585,380,diss_Soccer1.mp4
7877,1059,606,374,diss_Soccer1.mp4
7897,1059,636,366,diss_Soccer1.mp4
7912,1059,652,364,diss_Soccer1.mp4
7925,1059,661,363,diss_Soccer1.mp4
7946,1059,677,362,diss_Soccer1.mp4
7961,1059,687,362,diss_Soccer1.mp4
7975,1059,696,362,diss_Soccer1.mp4
7994,1059,707,362,diss_Soccer1.mp4
8009,1059,715,362,diss_Soccer1.mp4
8029,1059,728,363,diss_Soccer1.mp4
8045,1059,734,363,diss_Soccer1.mp4
8058,1059,742,363,diss_Soccer1.mp4
8080,1059,751,363,diss_Soccer1.mp4
8093,1059,758,362,diss_Soccer1.mp4
8098,1059,760,362,diss_Soccer1.mp4
8376,1059,818,358,diss_Soccer1.mp4
8392,1059,875,357,diss_Soccer1.mp4
8412,1059,943,356,diss_Soccer1.mp4
8428,1059,979,355,diss_Soccer1.mp4
8443,1059,999,355,diss_Soccer1.mp4
8459,1059,1010,356,diss_Soccer1.mp4
8476,1059,1017,356,diss_Soccer1.mp4
8492,1059,1024,358,diss_Soccer1.mp4
8506,1059,1026,360,diss_Soccer1.mp4
8529,1059,1028,361,diss_Soccer1.mp4
8537,1059,1029,361,diss_Soccer1.mp4
8560,1059,1030,362,diss_Soccer1.mp4
8598,1059,1031,363,diss_Soccer1.mp4
8642,1059,1032,363,diss_Soccer1.mp4
8698,1059,1033,363,diss_Soccer1.mp4
8726,1059,1037,363,diss_Soccer1.mp4
8746,1059,1053,364,diss_Soccer1.mp4
8760,1059,1065,364,diss_Soccer1.mp4
8775,1059,1081,365,diss_Soccer1.mp4
8795,1059,1112,368,diss_Soccer1.mp4
8810,1059,1125,369,diss_Soccer1.mp4
8825,1059,1133,370,diss_Soccer1.mp4
8844,1059,1140,372,diss_Soccer1.mp4
8859,1059,1141,372,diss_Soccer1.mp4
8879,1059,1143,372,diss_Soccer1.mp4
8894,1059,1144,372,diss_Soccer1.mp4
8900,1059,1144,373,diss_Soccer1.mp4
8944,1059,1144,374,diss_Soccer1.mp4
8958,1059,1145,374,diss_Soccer1.mp4
9091,1059,1144,374,diss_Soccer1.mp4
9112,1059,1095,370,diss_Soccer1.mp4
9124,1059,1047,362,diss_Soccer1.mp4
9144,1059,1006,356,diss_Soccer1.mp4
9159,1059,965,348,diss_Soccer1.mp4
9175,1059,924,335,diss_Soccer1.mp4
9194,1059,862,307,diss_Soccer1.mp4
9209,1059,826,288,diss_Soccer1.mp4
9229,1059,802,271,diss_Soccer1.mp4
9243,1059,790,260,diss_Soccer1.mp4
9257,1059,784,256,diss_Soccer1.mp4
9277,1059,779,247,diss_Soccer1.mp4
9293,1059,779,244,diss_Soccer1.mp4
9312,1059,778,242,diss_Soccer1.mp4
9326,1059,778,240,diss_Soccer1.mp4
9342,1059,778,238,diss_Soccer1.mp4
9362,1059,778,236,diss_Soccer1.mp4
9411,1059,779,234,diss_Soccer1.mp4
9419,1059,779,233,diss_Soccer1.mp4
9459,1059,779,232,diss_Soccer1.mp4
9870,1059,752,246,diss_Soccer1.mp4
9893,1059,710,264,diss_Soccer1.mp4
9906,1059,687,268,diss_Soccer1.mp4
9927,1059,648,269,diss_Soccer1.mp4
9942,1059,627,269,diss_Soccer1.mp4
9962,1059,610,268,diss_Soccer1.mp4
9977,1059,603,268,diss_Soccer1.mp4
9991,1059,598,268,diss_Soccer1.mp4
10011,1059,593,268,diss_Soccer1.mp4
10026,1059,590,268,diss_Soccer1.mp4
10039,1059,588,268,diss_Soccer1.mp4
10060,1059,584,268,diss_Soccer1.mp4
10074,1059,583,268,diss_Soccer1.mp4
10088,1059,582,268,diss_Soccer1.mp4
10102,1059,581,268,diss_Soccer1.mp4
10115,1059,580,268,diss_Soccer1.mp4
10171,1059,582,268,diss_Soccer1.mp4
10193,1059,624,259,diss_Soccer1.mp4
10207,1059,685,254,diss_Soccer1.mp4
10228,1059,740,249,diss_Soccer1.mp4
10243,1059,764,247,diss_Soccer1.mp4
10257,1059,796,246,diss_Soccer1.mp4
10277,1059,853,248,diss_Soccer1.mp4
10292,1059,890,253,diss_Soccer1.mp4
10312,1059,923,259,diss_Soccer1.mp4
10326,1059,934,262,diss_Soccer1.mp4
10340,1059,940,264,diss_Soccer1.mp4
10361,1059,944,265,diss_Soccer1.mp4
10381,1059,945,265,diss_Soccer1.mp4
10410,1059,948,266,diss_Soccer1.mp4
10425,1059,948,267,diss_Soccer1.mp4
10444,1059,950,268,diss_Soccer1.mp4
10451,1059,951,268,diss_Soccer1.mp4
10464,1059,952,268,diss_Soccer1.mp4
10522,1059,953,268,diss_Soccer1.mp4
10607,1059,953,269,diss_Soccer1.mp4
10640,1059,949,269,diss_Soccer1.mp4
10660,1059,883,257,diss_Soccer1.mp4
10676,1059,838,247,diss_Soccer1.mp4
10691,1059,807,242,diss_Soccer1.mp4
10710,1059,775,239,diss_Soccer1.mp4
10725,1059,761,240,diss_Soccer1.mp4
10739,1059,753,240,diss_Soccer1.mp4
10760,1059,739,244,diss_Soccer1.mp4
10774,1059,728,247,diss_Soccer1.mp4
10794,1059,712,249,diss_Soccer1.mp4
10810,1059,706,250,diss_Soccer1.mp4
10823,1059,702,252,diss_Soccer1.mp4
10843,1059,699,252,diss_Soccer1.mp4
10858,1059,697,252,diss_Soccer1.mp4
10871,1059,697,253,diss_Soccer1.mp4
10878,1059,696,253,diss_Soccer1.mp4
10913,1059,695,253,diss_Soccer1.mp4
10956,1059,694,253,diss_Soccer1.mp4
11115,1059,693,253,diss_Soccer1.mp4
11143,1059,687,253,diss_Soccer1.mp4
11159,1059,661,254,diss_Soccer1.mp4
11173,1059,596,257,diss_Soccer1.mp4
11193,1059,564,263,diss_Soccer1.mp4
11208,1059,541,269,diss_Soccer1.mp4
11221,1059,530,273,diss_Soccer1.mp4
11243,1059,513,279,diss_Soccer1.mp4
11256,1059,504,282,diss_Soccer1.mp4
11277,1059,497,284,diss_Soccer1.mp4
11283,1059,496,284,diss_Soccer1.mp4
11306,1059,493,284,diss_Soccer1.mp4
11326,1059,492,284,diss_Soccer1.mp4
11376,1059,491,284,diss_Soccer1.mp4
11403,1059,490,284,diss_Soccer1.mp4
11452,1059,490,285,diss_Soccer1.mp4
11474,1059,490,286,diss_Soccer1.mp4
11507,1059,489,286,diss_Soccer1.mp4
11528,1059,489,287,diss_Soccer1.mp4
11557,1059,487,290,diss_Soccer1.mp4
11571,1059,482,296,diss_Soccer1.mp4
11592,1059,474,304,diss_Soccer1.mp4
11606,1059,469,310,diss_Soccer1.mp4
11626,1059,462,317,diss_Soccer1.mp4
11640,1059,458,322,diss_Soccer1.mp4
11655,1059,451,332,diss_Soccer1.mp4
11675,1059,444,340,diss_Soccer1.mp4
11690,1059,441,344,diss_Soccer1.mp4
11705,1059,440,346,diss_Soccer1.mp4
11725,1059,440,348,diss_Soccer1.mp4
11731,1059,439,348,diss_Soccer1.mp4
11759,1059,438,349,diss_Soccer1.mp4
11788,1059,437,350,diss_Soccer1.mp4
11809,1059,437,351,diss_Soccer1.mp4
11824,1059,436,351,diss_Soccer1.mp4
11872,1059,439,350,diss_Soccer1.mp4
11893,1059,511,316,diss_Soccer1.mp4
11907,1059,575,287,diss_Soccer1.mp4
11920,1059,630,270,diss_Soccer1.mp4
11942,1059,751,246,diss_Soccer1.mp4
11956,1059,819,236,diss_Soccer1.mp4
11976,1059,909,230,diss_Soccer1.mp4
11991,1059,960,228,diss_Soccer1.mp4
12005,1059,984,230,diss_Soccer1.mp4
12025,1059,1011,237,diss_Soccer1.mp4
12040,1059,1031,243,diss_Soccer1.mp4
12059,1059,1048,248,diss_Soccer1.mp4
12075,1059,1054,252,diss_Soccer1.mp4
12090,1059,1057,252,diss_Soccer1.mp4
12103,1059,1060,254,diss_Soccer1.mp4
12124,1059,1061,254,diss_Soccer1.mp4
12139,1059,1063,255,diss_Soccer1.mp4
12151,1059,1064,256,diss_Soccer1.mp4
12173,1059,1066,256,diss_Soccer1.mp4
12186,1059,1067,257,diss_Soccer1.mp4
12199,1059,1068,258,diss_Soccer1.mp4
12221,1059,1068,260,diss_Soccer1.mp4
12229,1059,1069,260,diss_Soccer1.mp4
12257,1059,1069,261,diss_Soccer1.mp4
12284,1059,1069,263,diss_Soccer1.mp4
12306,1059,1067,266,diss_Soccer1.mp4
12326,1059,1061,269,diss_Soccer1.mp4
12340,1059,1054,272,diss_Soccer1.mp4
12354,1059,1048,274,diss_Soccer1.mp4
12375,1059,1044,275,diss_Soccer1.mp4
12395,1059,1043,276,diss_Soccer1.mp4
12416,1059,1042,276,diss_Soccer1.mp4
12439,1059,1041,276,diss_Soccer1.mp4
12453,1059,1040,277,diss_Soccer1.mp4
12474,1059,1039,277,diss_Soccer1.mp4
12487,1059,1028,280,diss_Soccer1.mp4
12508,1059,911,289,diss_Soccer1.mp4
12523,1059,860,289,diss_Soccer1.mp4
12543,1059,760,286,diss_Soccer1.mp4
12558,1059,705,286,diss_Soccer1.mp4
12571,1059,665,286,diss_Soccer1.mp4
12592,1059,612,293,diss_Soccer1.mp4
12606,1059,586,301,diss_Soccer1.mp4
12626,1059,556,310,diss_Soccer1.mp4
12640,1059,546,317,diss_Soccer1.mp4
12656,1059,540,320,diss_Soccer1.mp4
12675,1059,529,325,diss_Soccer1.mp4
12690,1059,527,326,diss_Soccer1.mp4
12696,1059,525,327,diss_Soccer1.mp4
12710,1059,524,328,diss_Soccer1.mp4
13054,1059,512,328,diss_Soccer1.mp4
13075,1059,478,333,diss_Soccer1.mp4
13090,1059,467,335,diss_Soccer1.mp4
13109,1059,453,337,diss_Soccer1.mp4
13124,1059,448,339,diss_Soccer1.mp4
13139,1059,444,340,diss_Soccer1.mp4
13158,1059,440,342,diss_Soccer1.mp4
13173,1059,440,343,diss_Soccer1.mp4
13178,1059,439,343,diss_Soccer1.mp4
13208,1059,437,344,diss_Soccer1.mp4
13242,1059,436,344,diss_Soccer1.mp4
13269,1059,436,345,diss_Soccer1.mp4
13291,1059,435,346,diss_Soccer1.mp4
13306,1059,434,347,diss_Soccer1.mp4
13319,1059,434,348,diss_Soccer1.mp4
13347,1059,433,348,diss_Soccer1.mp4
13389,1059,433,349,diss_Soccer1.mp4
13395,1059,432,349,diss_Soccer1.mp4
13424,1059,432,351,diss_Soccer1.mp4
13439,1059,431,353,diss_Soccer1.mp4
13458,1059,429,364,diss_Soccer1.mp4
13473,1059,428,394,diss_Soccer1.mp4
13488,1059,426,428,diss_Soccer1.mp4
13502,1059,428,456,diss_Soccer1.mp4
13523,1059,432,479,diss_Soccer1.mp4
13536,1059,435,489,diss_Soccer1.mp4
13557,1059,440,511,diss_Soccer1.mp4
13572,1059,444,524,diss_Soccer1.mp4
13586,1059,446,530,diss_Soccer1.mp4
13604,1059,449,540,diss_Soccer1.mp4
13620,1059,453,553,diss_Soccer1.mp4
13640,1059,455,561,diss_Soccer1.mp4
13647,1059,456,562,diss_Soccer1.mp4
13988,1059,453,579,diss_Soccer1.mp4
14003,1059,452,589,diss_Soccer1.mp4
14023,1059,452,598,diss_Soccer1.mp4
14039,1059,452,602,diss_Soccer1.mp4
14053,1059,452,604,diss_Soccer1.mp4
14073,1059,453,607,diss_Soccer1.mp4
14078,1059,454,608,diss_Soccer1.mp4
14107,1059,460,611,diss_Soccer1.mp4
14122,1059,467,612,diss_Soccer1.mp4
14141,1059,504,609,diss_Soccer1.mp4
14157,1059,555,594,diss_Soccer1.mp4
14171,1059,596,576,diss_Soccer1.mp4
14191,1059,639,556,diss_Soccer1.mp4
14206,1059,675,534,diss_Soccer1.mp4
14220,1059,710,519,diss_Soccer1.mp4
14240,1059,739,505,diss_Soccer1.mp4
14255,1059,756,500,diss_Soccer1.mp4
14269,1059,768,497,diss_Soccer1.mp4
14290,1059,774,496,diss_Soccer1.mp4
14304,1059,776,496,diss_Soccer1.mp4
14436,1059,774,497,diss_Soccer1.mp4
14456,1059,763,500,diss_Soccer1.mp4
14471,1059,755,504,diss_Soccer1.mp4
14486,1059,747,508,diss_Soccer1.mp4
14506,1059,743,511,diss_Soccer1.mp4
14512,1059,740,512,diss_Soccer1.mp4
14534,1059,739,513,diss_Soccer1.mp4
14555,1059,737,514,diss_Soccer1.mp4
14569,1059,736,514,diss_Soccer1.mp4
14578,1059,736,515,diss_Soccer1.mp4
14598,1059,735,515,diss_Soccer1.mp4
14633,1059,734,515,diss_Soccer1.mp4
14654,1059,733,515,diss_Soccer1.mp4
14932,1059,732,516,diss_Soccer1.mp4
14954,1059,730,517,diss_Soccer1.mp4
14969,1059,728,519,diss_Soccer1.mp4
14989,1059,725,521,diss_Soccer1.mp4
15004,1059,724,523,diss_Soccer1.mp4
15017,1059,723,524,diss_Soccer1.mp4
15039,1059,722,524,diss_Soccer1.mp4
15073,1059,720,525,diss_Soccer1.mp4
15088,1059,720,526,diss_Soccer1.mp4
15115,1059,720,527,diss_Soccer1.mp4
15485,1059,720,526,diss_Soccer1.mp4
15506,1059,728,523,diss_Soccer1.mp4
15521,1059,739,517,diss_Soccer1.mp4
15534,1059,754,510,diss_Soccer1.mp4
15555,1059,768,503,diss_Soccer1.mp4
15570,1059,772,500,diss_Soccer1.mp4
15589,1059,775,499,diss_Soccer1.mp4
15605,1059,776,499,diss_Soccer1.mp4
15633,1059,777,498,diss_Soccer1.mp4
15645,1059,778,498,diss_Soccer1.mp4
15673,1059,780,496,diss_Soccer1.mp4
15688,1059,780,495,diss_Soccer1.mp4
15694,1059,780,494,diss_Soccer1.mp4
15722,1059,782,492,diss_Soccer1.mp4
15738,1059,783,488,diss_Soccer1.mp4
15751,1059,784,485,diss_Soccer1.mp4
15772,1059,786,482,diss_Soccer1.mp4
15787,1059,788,480,diss_Soccer1.mp4
15806,1059,788,479,diss_Soccer1.mp4
15821,1059,788,477,diss_Soccer1.mp4
15836,1059,788,476,diss_Soccer1.mp4
15855,1059,789,476,diss_Soccer1.mp4
15876,1059,789,475,diss_Soccer1.mp4
15904,1059,789,474,diss_Soccer1.mp4
16037,1059,787,476,diss_Soccer1.mp4
16052,1059,784,479,diss_Soccer1.mp4
16072,1059,774,489,diss_Soccer1.mp4
16088,1059,766,498,diss_Soccer1.mp4
16101,1059,755,509,diss_Soccer1.mp4
16122,1059,736,533,diss_Soccer1.mp4
16137,1059,725,544,diss_Soccer1.mp4
16156,1059,708,556,diss_Soccer1.mp4
16171,1059,699,559,diss_Soccer1.mp4
16186,1059,689,563,diss_Soccer1.mp4
16205,1059,680,565,diss_Soccer1.mp4
16220,1059,673,566,diss_Soccer1.mp4
16234,1059,667,568,diss_Soccer1.mp4
16255,1059,652,569,diss_Soccer1.mp4
16269,1059,643,569,diss_Soccer1.mp4
16283,1059,637,569,diss_Soccer1.mp4
16304,1059,632,569,diss_Soccer1.mp4
16337,1059,630,569,diss_Soccer1.mp4
16344,1059,629,569,diss_Soccer1.mp4
16367,1059,628,569,diss_Soccer1.mp4
16422,1059,628,568,diss_Soccer1.mp4
16485,1059,628,567,diss_Soccer1.mp4
16506,1059,629,567,diss_Soccer1.mp4
16520,1059,632,564,diss_Soccer1.mp4
16535,1059,638,561,diss_Soccer1.mp4
16555,1059,665,548,diss_Soccer1.mp4
16570,1059,680,540,diss_Soccer1.mp4
16583,1059,686,537,diss_Soccer1.mp4
16604,1059,693,536,diss_Soccer1.mp4
16619,1059,696,534,diss_Soccer1.mp4
16631,1059,697,533,diss_Soccer1.mp4
16646,1059,698,533,diss_Soccer1.mp4
16668,1059,699,533,diss_Soccer1.mp4
16681,1059,700,533,diss_Soccer1.mp4
16737,1059,701,533,diss_Soccer1.mp4
17449,1059,697,536,diss_Soccer1.mp4
17471,1059,657,556,diss_Soccer1.mp4
17486,1059,632,559,diss_Soccer1.mp4
17500,1059,620,559,diss_Soccer1.mp4
17520,1059,611,557,diss_Soccer1.mp4
17535,1059,608,556,diss_Soccer1.mp4
17554,1059,605,556,diss_Soccer1.mp4
17561,1059,604,556,diss_Soccer1.mp4
17598,1059,603,556,diss_Soccer1.mp4
17624,1059,602,556,diss_Soccer1.mp4
17688,1059,602,554,diss_Soccer1.mp4
17702,1059,603,553,diss_Soccer1.mp4
17718,1059,604,552,diss_Soccer1.mp4
17737,1059,606,552,diss_Soccer1.mp4
17752,1059,608,551,diss_Soccer1.mp4
17786,1059,609,550,diss_Soccer1.mp4
17792,1059,610,550,diss_Soccer1.mp4
17814,1059,610,549,diss_Soccer1.mp4
17827,1059,611,549,diss_Soccer1.mp4
17903,1059,609,549,diss_Soccer1.mp4
17933,1059,608,550,diss_Soccer1.mp4
17982,1059,607,550,diss_Soccer1.mp4
17995,1059,606,550,diss_Soccer1.mp4
18652,1059,608,523,diss_Soccer1.mp4
18668,1059,608,502,diss_Soccer1.mp4
18683,1059,608,483,diss_Soccer1.mp4
18702,1059,607,451,diss_Soccer1.mp4
18717,1059,608,432,diss_Soccer1.mp4
18737,1059,610,413,diss_Soccer1.mp4
18752,1059,611,406,diss_Soccer1.mp4
18766,1059,612,402,diss_Soccer1.mp4
18780,1059,612,400,diss_Soccer1.mp4
18801,1059,612,399,diss_Soccer1.mp4
18814,1059,612,398,diss_Soccer1.mp4
18835,1059,612,397,diss_Soccer1.mp4
19350,1059,612,392,diss_Soccer1.mp4
19365,1059,612,386,diss_Soccer1.mp4
19385,1059,612,377,diss_Soccer1.mp4
19400,1059,612,373,diss_Soccer1.mp4
19419,1059,612,369,diss_Soccer1.mp4
19435,1059,612,367,diss_Soccer1.mp4
19450,1059,612,365,diss_Soccer1.mp4
19463,1059,612,362,diss_Soccer1.mp4
19475,1059,612,360,diss_Soccer1.mp4
19498,1059,612,359,diss_Soccer1.mp4
19512,1059,612,357,diss_Soccer1.mp4
19525,1059,612,356,diss_Soccer1.mp4
19547,1059,612,355,diss_Soccer1.mp4
19567,1059,612,354,diss_Soccer1.mp4
19589,1059,612,353,diss_Soccer1.mp4
19631,1059,612,352,diss_Soccer1.mp4
19883,1059,614,352,diss_Soccer1.mp4
19902,1059,628,353,diss_Soccer1.mp4
19917,1059,636,354,diss_Soccer1.mp4
19931,1059,643,354,diss_Soccer1.mp4
0,1060,642,378,diss_person22.mp4
15,1060,651,390,diss_person22.mp4
32,1060,653,394,diss_person22.mp4
50,1060,658,401,diss_person22.mp4
65,1060,659,404,diss_person22.mp4
92,1060,661,409,diss_person22.mp4
99,1060,661,411,diss_person22.mp4
113,1060,663,413,diss_person22.mp4
133,1060,664,416,diss_person22.mp4
146,1060,664,418,diss_person22.mp4
161,1060,664,420,diss_person22.mp4
183,1060,664,421,diss_person22.mp4
203,1060,664,422,diss_person22.mp4
231,1060,664,424,diss_person22.mp4
280,1060,665,424,diss_person22.mp4
315,1060,667,424,diss_person22.mp4
350,1060,669,424,diss_person22.mp4
364,1060,673,424,diss_person22.mp4
380,1060,678,424,diss_person22.mp4
400,1060,694,424,diss_person22.mp4
413,1060,711,424,diss_person22.mp4
429,1060,730,426,diss_person22.mp4
449,1060,759,432,diss_person22.mp4
464,1060,771,436,diss_person22.mp4
483,1060,788,444,diss_person22.mp4
498,1060,796,448,diss_person22.mp4
513,1060,801,451,diss_person22.mp4
533,1060,807,454,diss_person22.mp4
547,1060,810,456,diss_person22.mp4
562,1060,812,458,diss_person22.mp4
575,1060,814,460,diss_person22.mp4
597,1060,816,460,diss_person22.mp4
616,1060,817,462,diss_person22.mp4
631,1060,818,463,diss_person22.mp4
637,1060,819,463,diss_person22.mp4
652,1060,820,464,diss_person22.mp4
700,1060,820,465,diss_person22.mp4
729,1060,821,465,diss_person22.mp4
769,1060,822,465,diss_person22.mp4
1243,1060,860,464,diss_person22.mp4
1270,1060,912,456,diss_person22.mp4
1276,1060,922,454,diss_person22.mp4
1297,1060,946,451,diss_person22.mp4
1311,1060,959,449,diss_person22.mp4
1332,1060,976,446,diss_person22.mp4
1345,1060,986,446,diss_person22.mp4
1360,1060,994,445,diss_person22.mp4
1380,1060,1000,445,diss_person22.mp4
1395,1060,1003,445,diss_person22.mp4
1403,1060,1004,445,diss_person22.mp4
1424,1060,1006,445,diss_person22.mp4
1438,1060,1008,445,diss_person22.mp4
1479,1060,1011,445,diss_person22.mp4
1494,1060,1012,444,diss_person22.mp4
1514,1060,1014,443,diss_person22.mp4
1527,1060,1018,440,diss_person22.mp4
1549,1060,1026,424,diss_person22.mp4
1562,1060,1035,397,diss_person22.mp4
1577,1060,1042,367,diss_person22.mp4
1598,1060,1050,331,diss_person22.mp4
1612,1060,1053,320,diss_person22.mp4
1632,1060,1056,312,diss_person22.mp4
1647,1060,1057,310,diss_person22.mp4
1661,1060,1058,308,diss_person22.mp4
1682,1060,1059,308,diss_person22.mp4
1704,1060,1059,307,diss_person22.mp4
1726,1060,1059,306,diss_person22.mp4
1745,1060,1060,305,diss_person22.mp4
1780,1060,1060,304,diss_person22.mp4
1828,1060,1060,303,diss_person22.mp4
2229,1060,1028,284,diss_person22.mp4
2245,1060,946,246,diss_person22.mp4
2265,1060,846,215,diss_person22.mp4
2281,1060,799,204,diss_person22.mp4
2297,1060,760,196,diss_person22.mp4
2313,1060,740,190,diss_person22.mp4
2328,1060,732,188,diss_person22.mp4
2347,1060,721,186,diss_person22.mp4
2362,1060,718,186,diss_person22.mp4
2367,1060,716,186,diss_person22.mp4
2729,1060,679,191,diss_person22.mp4
2742,1060,592,191,diss_person22.mp4
2763,1060,516,185,diss_person22.mp4
2778,1060,484,180,diss_person22.mp4
2798,1060,452,178,diss_person22.mp4
2812,1060,436,179,diss_person22.mp4
2827,1060,426,181,diss_person22.mp4
2847,1060,413,184,diss_person22.mp4
2862,1060,408,186,diss_person22.mp4
2881,1060,404,189,diss_person22.mp4
2896,1060,402,190,diss_person22.mp4
2911,1060,400,192,diss_person22.mp4
2931,1060,398,193,diss_person22.mp4
2945,1060,396,195,diss_person22.mp4
2959,1060,395,197,diss_person22.mp4
2972,1060,392,200,diss_person22.mp4
2995,1060,388,204,diss_person22.mp4
3014,1060,381,213,diss_person22.mp4
3029,1060,377,220,diss_person22.mp4
3044,1060,374,224,diss_person22.mp4
3063,1060,368,233,diss_person22.mp4
3078,1060,366,237,diss_person22.mp4
3092,1060,363,243,diss_person22.mp4
3105,1060,360,248,diss_person22.mp4
3127,1060,358,252,diss_person22.mp4
3147,1060,355,256,diss_person22.mp4
3162,1060,354,257,diss_person22.mp4
3176,1060,352,260,diss_person22.mp4
3197,1060,349,264,diss_person22.mp4
3211,1060,348,266,diss_person22.mp4
3231,1060,344,271,diss_person22.mp4
3245,1060,343,274,diss_person22.mp4
3260,1060,341,278,diss_person22.mp4
3280,1060,338,283,diss_person22.mp4
3295,1060,336,287,diss_person22.mp4
3314,1060,332,292,diss_person22.mp4
3330,1060,326,298,diss_person22.mp4
3344,1060,319,304,diss_person22.mp4
3364,1060,307,312,diss_person22.mp4
3896,1060,304,330,diss_person22.mp4
3910,1060,303,338,diss_person22.mp4
3929,1060,302,359,diss_person22.mp4
3945,1060,301,368,diss_person22.mp4
3960,1060,301,376,diss_person22.mp4
3979,1060,301,388,diss_person22.mp4
3994,1060,301,394,diss_person22.mp4
4012,1060,301,399,diss_person22.mp4
4028,1060,302,401,diss_person22.mp4
4042,1060,303,403,diss_person22.mp4
4056,1060,303,404,diss_person22.mp4
4068,1060,304,405,diss_person22.mp4
4092,1060,304,407,diss_person22.mp4
4112,1060,307,408,diss_person22.mp4
4127,1060,312,409,diss_person22.mp4
4146,1060,338,410,diss_person22.mp4
4162,1060,354,408,diss_person22.mp4
4176,1060,373,406,diss_person22.mp4
4196,1060,400,404,diss_person22.mp4
4210,1060,414,403,diss_person22.mp4
4230,1060,429,403,diss_person22.mp4
4244,1060,436,403,diss_person22.mp4
4259,1060,442,404,diss_person22.mp4
4278,1060,452,405,diss_person22.mp4
4293,1060,462,407,diss_person22.mp4
4309,1060,472,410,diss_person22.mp4
4327,1060,483,414,diss_person22.mp4
4343,1060,488,416,diss_person22.mp4
4358,1060,494,418,diss_person22.mp4
4377,1060,501,421,diss_person22.mp4
4392,1060,505,423,diss_person22.mp4
4411,1060,508,425,diss_person22.mp4
4426,1060,511,427,diss_person22.mp4
4442,1060,515,429,diss_person22.mp4
4460,1060,520,434,diss_person22.mp4
4476,1060,525,440,diss_person22.mp4
4495,1060,534,458,diss_person22.mp4
4510,1060,535,474,diss_person22.mp4
4525,1060,534,482,diss_person22.mp4
4544,1060,530,489,diss_person22.mp4
4979,1060,553,465,diss_person22.mp4
4994,1060,575,445,diss_person22.mp4
5009,1060,592,433,diss_person22.mp4
5028,1060,610,419,diss_person22.mp4
5044,1060,620,413,diss_person22.mp4
5060,1060,623,411,diss_person22.mp4
5072,1060,627,409,diss_person22.mp4
5093,1060,629,409,diss_person22.mp4
5112,1060,630,409,diss_person22.mp4
5133,1060,631,409,diss_person22.mp4
5161,1060,632,409,diss_person22.mp4
5428,1060,624,409,diss_person22.mp4
5442,1060,595,406,diss_person22.mp4
5461,1060,572,400,diss_person22.mp4
5477,1060,568,398,diss_person22.mp4
5492,1060,565,397,diss_person22.mp4
5511,1060,561,396,diss_person22.mp4
5526,1060,560,396,diss_person22.mp4
5560,1060,559,396,diss_person22.mp4
5575,1060,558,396,diss_person22.mp4
5588,1060,557,396,diss_person22.mp4
5638,1060,556,396,diss_person22.mp4
0,1062,621,381,diss_building2.mp4
15,1062,608,392,diss_building2.mp4
29,1062,600,398,diss_building2.mp4
49,1062,588,408,diss_building2.mp4
64,1062,584,410,diss_building2.mp4
79,1062,581,414,diss_building2.mp4
96,1062,579,416,diss_building2.mp4
106,1062,577,417,diss_building2.mp4
127,1062,576,419,diss_building2.mp4
145,1062,575,420,diss_building2.mp4
161,1062,574,420,diss_building2.mp4
190,1062,573,421,diss_building2.mp4
209,1062,573,422,diss_building2.mp4
244,1062,573,423,diss_building2.mp4
516,1062,664,408,diss_building2.mp4
530,1062,708,408,diss_building2.mp4
545,1062,752,417,diss_building2.mp4
561,1062,806,432,diss_building2.mp4
580,1062,866,454,diss_building2.mp4
596,1062,906,467,diss_building2.mp4
615,1062,934,476,diss_building2.mp4
630,1062,940,477,diss_building2.mp4
645,1062,944,479,diss_building2.mp4
664,1062,950,480,diss_building2.mp4
680,1062,953,481,diss_building2.mp4
694,1062,956,483,diss_building2.mp4
714,1062,957,483,diss_building2.mp4
728,1062,958,484,diss_building2.mp4
748,1062,959,484,diss_building2.mp4
763,1062,960,484,diss_building2.mp4
944,1062,960,485,diss_building2.mp4
965,1062,960,486,diss_building2.mp4
980,1062,958,486,diss_building2.mp4
994,1062,872,482,diss_building2.mp4
1014,1062,731,464,diss_building2.mp4
1030,1062,645,456,diss_building2.mp4
1043,1062,559,447,diss_building2.mp4
1063,1062,468,441,diss_building2.mp4
1078,1062,418,440,diss_building2.mp4
1111,1062,369,438,diss_building2.mp4
1132,1062,358,436,diss_building2.mp4
1145,1062,355,435,diss_building2.mp4
1154,1062,354,435,diss_building2.mp4
1479,1062,340,436,diss_building2.mp4
1495,1062,311,441,diss_building2.mp4
1508,1062,292,445,diss_building2.mp4
1528,1062,271,451,diss_building2.mp4
1544,1062,262,453,diss_building2.mp4
1563,1062,257,455,diss_building2.mp4
1578,1062,255,456,diss_building2.mp4
1593,1062,252,456,diss_building2.mp4
1611,1062,249,458,diss_building2.mp4
1619,1062,248,458,diss_building2.mp4
1646,1062,244,460,diss_building2.mp4
1676,1062,242,460,diss_building2.mp4
1696,1062,240,460,diss_building2.mp4
1711,1062,239,460,diss_building2.mp4
1731,1062,236,461,diss_building2.mp4
1760,1062,235,462,diss_building2.mp4
1780,1062,233,463,diss_building2.mp4
1793,1062,232,463,diss_building2.mp4
1829,1062,228,464,diss_building2.mp4
1843,1062,227,464,diss_building2.mp4
1864,1062,224,464,diss_building2.mp4
1871,1062,223,464,diss_building2.mp4
1884,1062,221,464,diss_building2.mp4
1913,1062,219,464,diss_building2.mp4
1927,1062,218,464,diss_building2.mp4
1947,1062,216,464,diss_building2.mp4
2346,1062,204,462,diss_building2.mp4
2363,1062,192,459,diss_building2.mp4
2378,1062,184,456,diss_building2.mp4
2394,1062,180,456,diss_building2.mp4
2408,1062,177,455,diss_building2.mp4
2429,1062,173,453,diss_building2.mp4
2444,1062,171,453,diss_building2.mp4
2463,1062,168,452,diss_building2.mp4
2478,1062,165,450,diss_building2.mp4
2497,1062,161,448,diss_building2.mp4
2512,1062,159,446,diss_building2.mp4
2527,1062,157,444,diss_building2.mp4
2546,1062,152,439,diss_building2.mp4
2561,1062,148,434,diss_building2.mp4
2576,1062,144,424,diss_building2.mp4
2596,1062,140,412,diss_building2.mp4
2611,1062,137,404,diss_building2.mp4
2631,1062,135,390,diss_building2.mp4
2645,1062,132,376,diss_building2.mp4
2659,1062,128,360,diss_building2.mp4
2679,1062,125,349,diss_building2.mp4
2694,1062,124,343,diss_building2.mp4
2713,1062,122,338,diss_building2.mp4
2728,1062,122,336,diss_building2.mp4
2735,1062,122,335,diss_building2.mp4
2762,1062,121,331,diss_building2.mp4
2777,1062,121,328,diss_building2.mp4
2793,1062,121,327,diss_building2.mp4
2813,1062,121,323,diss_building2.mp4
2828,1062,123,320,diss_building2.mp4
2847,1062,128,312,diss_building2.mp4
2862,1062,137,300,diss_building2.mp4
2877,1062,159,277,diss_building2.mp4
2896,1062,184,254,diss_building2.mp4
2912,1062,196,244,diss_building2.mp4
2925,1062,201,239,diss_building2.mp4
2946,1062,212,232,diss_building2.mp4
2960,1062,219,228,diss_building2.mp4
2980,1062,231,224,diss_building2.mp4
2995,1062,237,222,diss_building2.mp4
3010,1062,245,221,diss_building2.mp4
3029,1062,254,220,diss_building2.mp4
3045,1062,258,219,diss_building2.mp4
3050,1062,261,219,diss_building2.mp4
3395,1062,294,210,diss_building2.mp4
3412,1062,318,204,diss_building2.mp4
3427,1062,340,200,diss_building2.mp4
3443,1062,356,197,diss_building2.mp4
3460,1062,372,196,diss_building2.mp4
3475,1062,388,196,diss_building2.mp4
3490,1062,403,195,diss_building2.mp4
3512,1062,422,194,diss_building2.mp4
3526,1062,450,194,diss_building2.mp4
3540,1062,465,194,diss_building2.mp4
3561,1062,485,195,diss_building2.mp4
3575,1062,497,196,diss_building2.mp4
3595,1062,517,199,diss_building2.mp4
3611,1062,528,201,diss_building2.mp4
3629,1062,548,207,diss_building2.mp4
3644,1062,556,211,diss_building2.mp4
3660,1062,560,213,diss_building2.mp4
3679,1062,564,216,diss_building2.mp4
3694,1062,565,217,diss_building2.mp4
3699,1062,565,218,diss_building2.mp4
4042,1062,576,215,diss_building2.mp4
4059,1062,620,196,diss_building2.mp4
4074,1062,652,184,diss_building2.mp4
4095,1062,679,175,diss_building2.mp4
4112,1062,689,172,diss_building2.mp4
4119,1062,694,171,diss_building2.mp4
4142,1062,700,169,diss_building2.mp4
4154,1062,704,169,diss_building2.mp4
4176,1062,707,168,diss_building2.mp4
4196,1062,709,168,diss_building2.mp4
4211,1062,711,168,diss_building2.mp4
4217,1062,712,168,diss_building2.mp4
4239,1062,713,168,diss_building2.mp4
4252,1062,714,168,diss_building2.mp4
4274,1062,715,168,diss_building2.mp4
4294,1062,717,168,diss_building2.mp4
4309,1062,720,168,diss_building2.mp4
4329,1062,728,168,diss_building2.mp4
4344,1062,732,168,diss_building2.mp4
4358,1062,742,170,diss_building2.mp4
4378,1062,779,179,diss_building2.mp4
4393,1062,827,195,diss_building2.mp4
4407,1062,843,202,diss_building2.mp4
4428,1062,861,211,diss_building2.mp4
4441,1062,869,215,diss_building2.mp4
4461,1062,873,217,diss_building2.mp4
4477,1062,875,219,diss_building2.mp4
4491,1062,876,220,diss_building2.mp4
4511,1062,879,222,diss_building2.mp4
4526,1062,880,223,diss_building2.mp4
4540,1062,881,224,diss_building2.mp4
4546,1062,882,224,diss_building2.mp4
4575,1062,883,226,diss_building2.mp4
4588,1062,884,226,diss_building2.mp4
4609,1062,884,227,diss_building2.mp4
4638,1062,885,227,diss_building2.mp4
4664,1062,885,228,diss_building2.mp4
4693,1062,882,231,diss_building2.mp4
4708,1062,871,239,diss_building2.mp4
4727,1062,834,265,diss_building2.mp4
4742,1062,794,294,diss_building2.mp4
4762,1062,753,326,diss_building2.mp4
4776,1062,724,345,diss_building2.mp4
4791,1062,707,356,diss_building2.mp4
4810,1062,675,373,diss_building2.mp4
4825,1062,664,377,diss_building2.mp4
4841,1062,654,379,diss_building2.mp4
4860,1062,648,380,diss_building2.mp4
4876,1062,645,380,diss_building2.mp4
4895,1062,642,381,diss_building2.mp4
4909,1062,640,382,diss_building2.mp4
4924,1062,637,382,diss_building2.mp4
4944,1062,635,383,diss_building2.mp4
4959,1062,633,383,diss_building2.mp4
4979,1062,632,383,diss_building2.mp4
5020,1062,631,383,diss_building2.mp4
5042,1062,630,383,diss_building2.mp4
5374,1062,636,384,diss_building2.mp4
5388,1062,655,388,diss_building2.mp4
5411,1062,673,390,diss_building2.mp4
5427,1062,680,391,diss_building2.mp4
5443,1062,684,391,diss_building2.mp4
5459,1062,688,392,diss_building2.mp4
5474,1062,692,392,diss_building2.mp4
5489,1062,696,392,diss_building2.mp4
5510,1062,700,393,diss_building2.mp4
5525,1062,704,393,diss_building2.mp4
5544,1062,706,393,diss_building2.mp4
5560,1062,708,393,diss_building2.mp4
5574,1062,711,393,diss_building2.mp4
5594,1062,714,393,diss_building2.mp4
5609,1062,716,394,diss_building2.mp4
5622,1062,719,395,diss_building2.mp4
5643,1062,723,396,diss_building2.mp4
5658,1062,727,397,diss_building2.mp4
5677,1062,733,400,diss_building2.mp4
5692,1062,741,404,diss_building2.mp4
5706,1062,748,408,diss_building2.mp4
5727,1062,762,412,diss_building2.mp4
5742,1062,769,416,diss_building2.mp4
5755,1062,776,420,diss_building2.mp4
5776,1062,785,424,diss_building2.mp4
5791,1062,791,426,diss_building2.mp4
5811,1062,799,429,diss_building2.mp4
5826,1062,805,432,diss_building2.mp4
5839,1062,810,434,diss_building2.mp4
5860,1062,816,436,diss_building2.mp4
5875,1062,818,438,diss_building2.mp4
5894,1062,821,440,diss_building2.mp4
5901,1062,822,440,diss_building2.mp4
5915,1062,824,440,diss_building2.mp4
6222,1062,843,440,diss_building2.mp4
6243,1062,888,442,diss_building2.mp4
6258,1062,908,444,diss_building2.mp4
6273,1062,928,448,diss_building2.mp4
6293,1062,949,455,diss_building2.mp4
6307,1062,962,460,diss_building2.mp4
6327,1062,982,469,diss_building2.mp4
6342,1062,988,472,diss_building2.mp4
6356,1062,997,476,diss_building2.mp4
6376,1062,1007,479,diss_building2.mp4
6391,1062,1011,480,diss_building2.mp4
6406,1062,1013,481,diss_building2.mp4
6426,1062,1017,483,diss_building2.mp4
6439,1062,1018,483,diss_building2.mp4
6453,1062,1019,484,diss_building2.mp4
6475,1062,1020,484,diss_building2.mp4
6559,1062,1011,480,diss_building2.mp4
6573,1062,932,459,diss_building2.mp4
6593,1062,865,442,diss_building2.mp4
6608,1062,810,429,diss_building2.mp4
6622,1062,767,420,diss_building2.mp4
6642,1062,709,411,diss_building2.mp4
6656,1062,682,408,diss_building2.mp4
6677,1062,654,404,diss_building2.mp4
6692,1062,644,402,diss_building2.mp4
6706,1062,637,400,diss_building2.mp4
6726,1062,633,400,diss_building2.mp4
6732,1062,632,400,diss_building2.mp4
7072,1062,606,400,diss_building2.mp4
7087,1062,547,402,diss_building2.mp4
7107,1062,507,403,diss_building2.mp4
7122,1062,482,404,diss_building2.mp4
7142,1062,459,405,diss_building2.mp4
7157,1062,448,406,diss_building2.mp4
7176,1062,441,408,diss_building2.mp4
7191,1062,438,408,diss_building2.mp4
7205,1062,436,409,diss_building2.mp4
7226,1062,434,410,diss_building2.mp4
7232,1062,432,410,diss_building2.mp4
7260,1062,430,411,diss_building2.mp4
7275,1062,429,412,diss_building2.mp4
7280,1062,428,412,diss_building2.mp4
7302,1062,424,413,diss_building2.mp4
7324,1062,423,414,diss_building2.mp4
7338,1062,421,415,diss_building2.mp4
7351,1062,420,416,diss_building2.mp4
7373,1062,419,416,diss_building2.mp4
7392,1062,418,416,diss_building2.mp4
7408,1062,418,417,diss_building2.mp4
7436,1062,416,417,diss_building2.mp4
7553,1062,416,416,diss_building2.mp4
7575,1062,428,404,diss_building2.mp4
7591,1062,445,388,diss_building2.mp4
7603,1062,488,363,diss_building2.mp4
7624,1062,535,341,diss_building2.mp4
7639,1062,560,333,diss_building2.mp4
7659,1062,596,325,diss_building2.mp4
7674,1062,615,324,diss_building2.mp4
7688,1062,635,324,diss_building2.mp4
7708,1062,656,324,diss_building2.mp4
7724,1062,669,326,diss_building2.mp4
7742,1062,680,329,diss_building2.mp4
7757,1062,684,329,diss_building2.mp4
7772,1062,688,331,diss_building2.mp4
7792,1062,692,332,diss_building2.mp4
7806,1062,693,332,diss_building2.mp4
7820,1062,695,333,diss_building2.mp4
7841,1062,696,333,diss_building2.mp4
7856,1062,696,334,diss_building2.mp4
7882,1062,697,334,diss_building2.mp4
7911,1062,698,334,diss_building2.mp4
7944,1062,699,334,diss_building2.mp4
7974,1062,700,334,diss_building2.mp4
7989,1062,706,334,diss_building2.mp4
8009,1062,761,335,diss_building2.mp4
8024,1062,785,338,diss_building2.mp4
8037,1062,805,341,diss_building2.mp4
8058,1062,814,345,diss_building2.mp4
8073,1062,816,347,diss_building2.mp4
8092,1062,818,349,diss_building2.mp4
8107,1062,820,351,diss_building2.mp4
8122,1062,820,352,diss_building2.mp4
8142,1062,821,356,diss_building2.mp4
8156,1062,820,359,diss_building2.mp4
8170,1062,819,363,diss_building2.mp4
8191,1062,809,372,diss_building2.mp4
8206,1062,803,376,diss_building2.mp4
8225,1062,784,384,diss_building2.mp4
8240,1062,763,387,diss_building2.mp4
8254,1062,716,388,diss_building2.mp4
8275,1062,669,378,diss_building2.mp4
8290,1062,647,372,diss_building2.mp4
8303,1062,633,368,diss_building2.mp4
8323,1062,614,359,diss_building2.mp4
8339,1062,605,352,diss_building2.mp4
8358,1062,596,340,diss_building2.mp4
8373,1062,594,337,diss_building2.mp4
8387,1062,592,334,diss_building2.mp4
8408,1062,592,331,diss_building2.mp4
8422,1062,592,330,diss_building2.mp4
8441,1062,592,324,diss_building2.mp4
8455,1062,595,316,diss_building2.mp4
8470,1062,600,307,diss_building2.mp4
8490,1062,606,295,diss_building2.mp4
8504,1062,609,291,diss_building2.mp4
8524,1062,612,285,diss_building2.mp4
8539,1062,615,282,diss_building2.mp4
8547,1062,616,280,diss_building2.mp4
8573,1062,618,276,diss_building2.mp4
8587,1062,620,274,diss_building2.mp4
8595,1062,621,272,diss_building2.mp4
8623,1062,624,271,diss_building2.mp4
8638,1062,624,270,diss_building2.mp4
8653,1062,626,270,diss_building2.mp4
8672,1062,627,269,diss_building2.mp4
8679,1062,628,269,diss_building2.mp4
8702,1062,629,269,diss_building2.mp4
8715,1062,630,269,diss_building2.mp4
8728,1062,631,269,diss_building2.mp4
8749,1062,632,269,diss_building2.mp4
8821,1062,633,269,diss_building2.mp4
8953,1062,635,272,diss_building2.mp4
8974,1062,640,277,diss_building2.mp4
8989,1062,645,285,diss_building2.mp4
9003,1062,650,298,diss_building2.mp4
9023,1062,656,319,diss_building2.mp4
9038,1062,656,327,diss_building2.mp4
9057,1062,657,336,diss_building2.mp4
9073,1062,657,341,diss_building2.mp4
9087,1062,657,345,diss_building2.mp4
9100,1062,657,348,diss_building2.mp4
9122,1062,657,350,diss_building2.mp4
9135,1062,657,352,diss_building2.mp4
9157,1062,658,353,diss_building2.mp4
9171,1062,658,354,diss_building2.mp4
9184,1062,658,356,diss_building2.mp4
9519,1062,704,364,diss_building2.mp4
9541,1062,734,374,diss_building2.mp4
9556,1062,744,379,diss_building2.mp4
9571,1062,753,383,diss_building2.mp4
9590,1062,764,388,diss_building2.mp4
9605,1062,768,389,diss_building2.mp4
9620,1062,772,392,diss_building2.mp4
9640,1062,783,397,diss_building2.mp4
9655,1062,793,401,diss_building2.mp4
9674,1062,803,406,diss_building2.mp4
9688,1062,806,408,diss_building2.mp4
9703,1062,809,409,diss_building2.mp4
9718,1062,812,412,diss_building2.mp4
9738,1062,815,413,diss_building2.mp4
9752,1062,818,415,diss_building2.mp4
9772,1062,823,417,diss_building2.mp4
9788,1062,825,418,diss_building2.mp4
9807,1062,830,420,diss_building2.mp4
9822,1062,831,420,diss_building2.mp4
9836,1062,832,422,diss_building2.mp4
9849,1062,834,423,diss_building2.mp4
9871,1062,836,424,diss_building2.mp4
9898,1062,837,424,diss_building2.mp4
9911,1062,838,425,diss_building2.mp4
9939,1062,839,425,diss_building2.mp4
9947,1062,839,426,diss_building2.mp4
9969,1062,840,426,diss_building2.mp4
9983,1062,840,427,diss_building2.mp4
10115,1062,840,428,diss_building2.mp4
10171,1062,838,428,diss_building2.mp4
10186,1062,827,428,diss_building2.mp4
10206,1062,732,414,diss_building2.mp4
10220,1062,684,405,diss_building2.mp4
10233,1062,635,392,diss_building2.mp4
10255,1062,595,378,diss_building2.mp4
10270,1062,568,368,diss_building2.mp4
10289,1062,537,357,diss_building2.mp4
10305,1062,523,351,diss_building2.mp4
10319,1062,513,347,diss_building2.mp4
10338,1062,506,344,diss_building2.mp4
10354,1062,504,344,diss_building2.mp4
10373,1062,502,342,diss_building2.mp4
10380,1062,501,341,diss_building2.mp4
10752,1062,474,331,diss_building2.mp4
10769,1062,453,319,diss_building2.mp4
10783,1062,442,311,diss_building2.mp4
10805,1062,436,306,diss_building2.mp4
10820,1062,435,302,diss_building2.mp4
10840,1062,432,299,diss_building2.mp4
10854,1062,432,296,diss_building2.mp4
10869,1062,432,294,diss_building2.mp4
10889,1062,432,289,diss_building2.mp4
10904,1062,433,284,diss_building2.mp4
10918,1062,438,275,diss_building2.mp4
10939,1062,448,260,diss_building2.mp4
10953,1062,452,254,diss_building2.mp4
10972,1062,456,250,diss_building2.mp4
10988,1062,456,248,diss_building2.mp4
11002,1062,457,248,diss_building2.mp4
11015,1062,458,247,diss_building2.mp4
11037,1062,459,245,diss_building2.mp4
11051,1062,460,244,diss_building2.mp4
11072,1062,461,243,diss_building2.mp4
11086,1062,461,242,diss_building2.mp4
11106,1062,461,241,diss_building2.mp4
11112,1062,462,241,diss_building2.mp4
11147,1062,463,240,diss_building2.mp4
11189,1062,463,239,diss_building2.mp4
11203,1062,463,238,diss_building2.mp4
11210,1062,464,238,diss_building2.mp4
11238,1062,465,236,diss_building2.mp4
11254,1062,471,229,diss_building2.mp4
11268,1062,483,222,diss_building2.mp4
11287,1062,540,204,diss_building2.mp4
11303,1062,568,201,diss_building2.mp4
11323,1062,596,202,diss_building2.mp4
11338,1062,616,206,diss_building2.mp4
11351,1062,626,208,diss_building2.mp4
11371,1062,640,211,diss_building2.mp4
11386,1062,644,211,diss_building2.mp4
11401,1062,645,212,diss_building2.mp4
11868,1062,672,212,diss_building2.mp4
11888,1062,699,216,diss_building2.mp4
11903,1062,712,220,diss_building2.mp4
11917,1062,720,222,diss_building2.mp4
11937,1062,728,228,diss_building2.mp4
11953,1062,731,232,diss_building2.mp4
11972,1062,736,237,diss_building2.mp4
11986,1062,738,239,diss_building2.mp4
12001,1062,740,241,diss_building2.mp4
12021,1062,740,246,diss_building2.mp4
12036,1062,742,249,diss_building2.mp4
12051,1062,742,258,diss_building2.mp4
12070,1062,734,280,diss_building2.mp4
12085,1062,728,289,diss_building2.mp4
12104,1062,719,302,diss_building2.mp4
12120,1062,711,311,diss_building2.mp4
12134,1062,700,320,diss_building2.mp4
12154,1062,681,330,diss_building2.mp4
12169,1062,668,335,diss_building2.mp4
12183,1062,660,337,diss_building2.mp4
12203,1062,654,338,diss_building2.mp4
12218,1062,653,339,diss_building2.mp4
12232,1062,652,339,diss_building2.mp4
12258,1062,651,339,diss_building2.mp4
12315,1062,651,338,diss_building2.mp4
12327,1062,652,337,diss_building2.mp4
12351,1062,652,336,diss_building2.mp4
12370,1062,653,336,diss_building2.mp4
12377,1062,653,335,diss_building2.mp4
12405,1062,654,335,diss_building2.mp4
12426,1062,655,334,diss_building2.mp4
12803,1062,650,356,diss_building2.mp4
12818,1062,648,369,diss_building2.mp4
12837,1062,648,381,diss_building2.mp4
12853,1062,648,391,diss_building2.mp4
12868,1062,648,396,diss_building2.mp4
12887,1062,647,403,diss_building2.mp4
12893,1062,647,404,diss_building2.mp4
12916,1062,647,408,diss_building2.mp4
12937,1062,646,410,diss_building2.mp4
12951,1062,646,411,diss_building2.mp4
12956,1062,646,412,diss_building2.mp4
12984,1062,646,413,diss_building2.mp4
13021,1062,646,414,diss_building2.mp4
13026,1062,646,415,diss_building2.mp4
13069,1062,646,416,diss_building2.mp4
13446,1062,646,415,diss_building2.mp4
13460,1062,646,414,diss_building2.mp4
13482,1062,647,413,diss_building2.mp4
13496,1062,648,412,diss_building2.mp4
13518,1062,648,410,diss_building2.mp4
13537,1062,650,408,diss_building2.mp4
13552,1062,651,405,diss_building2.mp4
13567,1062,652,403,diss_building2.mp4
13586,1062,653,399,diss_building2.mp4
13601,1062,653,396,diss_building2.mp4
13616,1062,654,393,diss_building2.mp4
13636,1062,654,388,diss_building2.mp4
13650,1062,654,384,diss_building2.mp4
13670,1062,652,378,diss_building2.mp4
13685,1062,651,374,diss_building2.mp4
13700,1062,650,372,diss_building2.mp4
13720,1062,649,370,diss_building2.mp4
13734,1062,648,369,diss_building2.mp4
13739,1062,648,368,diss_building2.mp4
13769,1062,646,367,diss_building2.mp4
13797,1062,645,366,diss_building2.mp4
13824,1062,645,365,diss_building2.mp4
13846,1062,644,364,diss_building2.mp4
15481,1062,646,363,diss_building2.mp4
15487,1062,647,362,diss_building2.mp4
15512,1062,648,361,diss_building2.mp4
15534,1062,649,360,diss_building2.mp4
15557,1062,650,360,diss_building2.mp4
15596,1062,651,359,diss_building2.mp4
15634,1062,652,358,diss_building2.mp4
15657,1062,652,357,diss_building2.mp4
15715,1062,653,356,diss_building2.mp4
15744,1062,653,355,diss_building2.mp4
15765,1062,653,354,diss_building2.mp4
15784,1062,654,353,diss_building2.mp4
15791,1062,654,352,diss_building2.mp4
15814,1062,655,352,diss_building2.mp4
15834,1062,656,349,diss_building2.mp4
15849,1062,656,348,diss_building2.mp4
15868,1062,656,347,diss_building2.mp4
15889,1062,656,346,diss_building2.mp4
15917,1062,657,344,diss_building2.mp4
15932,1062,658,344,diss_building2.mp4
15937,1062,659,343,diss_building2.mp4
15961,1062,659,342,diss_building2.mp4
15982,1062,660,340,diss_building2.mp4
16030,1062,660,339,diss_building2.mp4
16051,1062,655,338,diss_building2.mp4
16066,1062,641,340,diss_building2.mp4
16080,1062,624,345,diss_building2.mp4
16100,1062,592,353,diss_building2.mp4
16115,1062,580,356,diss_building2.mp4
16134,1062,567,359,diss_building2.mp4
16149,1062,561,360,diss_building2.mp4
16163,1062,556,362,diss_building2.mp4
16184,1062,549,364,diss_building2.mp4
16198,1062,543,368,diss_building2.mp4
16218,1062,525,372,diss_building2.mp4
16233,1062,516,375,diss_building2.mp4
16248,1062,506,377,diss_building2.mp4
16267,1062,499,380,diss_building2.mp4
16282,1062,493,381,diss_building2.mp4
16296,1062,490,383,diss_building2.mp4
16317,1062,482,387,diss_building2.mp4
16332,1062,477,390,diss_building2.mp4
16351,1062,472,393,diss_building2.mp4
16366,1062,469,395,diss_building2.mp4
16381,1062,468,396,diss_building2.mp4
16394,1062,467,396,diss_building2.mp4
16406,1062,466,397,diss_building2.mp4
16420,1062,465,397,diss_building2.mp4
16463,1062,466,397,diss_building2.mp4
16484,1062,484,394,diss_building2.mp4
16499,1062,511,387,diss_building2.mp4
16513,1062,559,372,diss_building2.mp4
16533,1062,596,364,diss_building2.mp4
16548,1062,612,360,diss_building2.mp4
16562,1062,629,357,diss_building2.mp4
16583,1062,643,354,diss_building2.mp4
16597,1062,651,353,diss_building2.mp4
16617,1062,660,351,diss_building2.mp4
16632,1062,664,349,diss_building2.mp4
16646,1062,669,348,diss_building2.mp4
16666,1062,679,344,diss_building2.mp4
16681,1062,689,340,diss_building2.mp4
16700,1062,696,337,diss_building2.mp4
16716,1062,700,336,diss_building2.mp4
16730,1062,701,335,diss_building2.mp4
16750,1062,705,332,diss_building2.mp4
16765,1062,708,332,diss_building2.mp4
16778,1062,713,330,diss_building2.mp4
16800,1062,723,327,diss_building2.mp4
16814,1062,728,326,diss_building2.mp4
16833,1062,733,325,diss_building2.mp4
16848,1062,736,325,diss_building2.mp4
16863,1062,740,325,diss_building2.mp4
16883,1062,748,326,diss_building2.mp4
16898,1062,753,328,diss_building2.mp4
16917,1062,757,332,diss_building2.mp4
16933,1062,759,335,diss_building2.mp4
16947,1062,760,338,diss_building2.mp4
16966,1062,760,346,diss_building2.mp4
16981,1062,757,354,diss_building2.mp4
16996,1062,748,366,diss_building2.mp4
17016,1062,729,384,diss_building2.mp4
17031,1062,711,396,diss_building2.mp4
17050,1062,673,412,diss_building2.mp4
17065,1062,656,416,diss_building2.mp4
17080,1062,645,417,diss_building2.mp4
17100,1062,636,417,diss_building2.mp4
17114,1062,630,417,diss_building2.mp4
17129,1062,625,417,diss_building2.mp4
17148,1062,620,417,diss_building2.mp4
17164,1062,618,417,diss_building2.mp4
17183,1062,615,417,diss_building2.mp4
17198,1062,614,417,diss_building2.mp4
17204,1062,613,417,diss_building2.mp4
17219,1062,612,417,diss_building2.mp4
17239,1062,611,417,diss_building2.mp4
17261,1062,610,418,diss_building2.mp4
17282,1062,608,418,diss_building2.mp4
17296,1062,607,420,diss_building2.mp4
17316,1062,604,422,diss_building2.mp4
17331,1062,600,424,diss_building2.mp4
17350,1062,596,428,diss_building2.mp4
17366,1062,592,430,diss_building2.mp4
17381,1062,591,432,diss_building2.mp4
17400,1062,586,436,diss_building2.mp4
17406,1062,584,436,diss_building2.mp4
17429,1062,581,438,diss_building2.mp4
17436,1062,580,440,diss_building2.mp4
17456,1062,578,440,diss_building2.mp4
17469,1062,577,440,diss_building2.mp4
17484,1062,577,441,diss_building2.mp4
17532,1062,584,440,diss_building2.mp4
17548,1062,612,429,diss_building2.mp4
17561,1062,648,411,diss_building2.mp4
17581,1062,676,394,diss_building2.mp4
17596,1062,688,386,diss_building2.mp4
17610,1062,696,381,diss_building2.mp4
17630,1062,706,375,diss_building2.mp4
17646,1062,711,372,diss_building2.mp4
17666,1062,715,370,diss_building2.mp4
17680,1062,717,369,diss_building2.mp4
17694,1062,720,368,diss_building2.mp4
17714,1062,723,366,diss_building2.mp4
17721,1062,724,364,diss_building2.mp4
17744,1062,728,360,diss_building2.mp4
17763,1062,732,355,diss_building2.mp4
17779,1062,733,348,diss_building2.mp4
17798,1062,736,328,diss_building2.mp4
17813,1062,736,316,diss_building2.mp4
17832,1062,729,301,diss_building2.mp4
17847,1062,721,293,diss_building2.mp4
17862,1062,712,287,diss_building2.mp4
17882,1062,690,276,diss_building2.mp4
17897,1062,676,268,diss_building2.mp4
17916,1062,660,262,diss_building2.mp4
17930,1062,653,260,diss_building2.mp4
17946,1062,645,259,diss_building2.mp4
17961,1062,641,258,diss_building2.mp4
17980,1062,636,257,diss_building2.mp4
17995,1062,634,257,diss_building2.mp4
18015,1062,631,257,diss_building2.mp4
18022,1062,629,257,diss_building2.mp4
18035,1062,628,257,diss_building2.mp4
18063,1062,626,256,diss_building2.mp4
18079,1062,625,256,diss_building2.mp4
18093,1062,624,256,diss_building2.mp4
18113,1062,624,255,diss_building2.mp4
18133,1062,624,253,diss_building2.mp4
18142,1062,624,252,diss_building2.mp4
0,1057,636,372,diss_building2.mp4
17,1057,636,369,diss_building2.mp4
31,1057,636,365,diss_building2.mp4
38,1057,636,364,diss_building2.mp4
69,1057,636,361,diss_building2.mp4
79,1057,636,360,diss_building2.mp4
94,1057,636,359,diss_building2.mp4
116,1057,636,357,diss_building2.mp4
147,1057,636,356,diss_building2.mp4
166,1057,634,356,diss_building2.mp4
181,1057,632,357,diss_building2.mp4
200,1057,628,359,diss_building2.mp4
216,1057,624,361,diss_building2.mp4
231,1057,618,363,diss_building2.mp4
249,1057,600,368,diss_building2.mp4
264,1057,584,373,diss_building2.mp4
286,1057,546,380,diss_building2.mp4
299,1057,530,381,diss_building2.mp4
314,1057,514,381,diss_building2.mp4
334,1057,500,380,diss_building2.mp4
349,1057,494,378,diss_building2.mp4
4509,1057,505,374,diss_building2.mp4
4530,1057,538,359,diss_building2.mp4
4545,1057,559,348,diss_building2.mp4
4564,1057,588,334,diss_building2.mp4
4579,1057,608,320,diss_building2.mp4
4593,1057,624,310,diss_building2.mp4
4614,1057,642,299,diss_building2.mp4
4628,1057,656,293,diss_building2.mp4
4648,1057,679,286,diss_building2.mp4
4663,1057,692,284,diss_building2.mp4
4677,1057,707,283,diss_building2.mp4
4697,1057,718,282,diss_building2.mp4
4712,1057,724,282,diss_building2.mp4
4732,1057,727,282,diss_building2.mp4
4746,1057,729,282,diss_building2.mp4
4761,1057,730,283,diss_building2.mp4
4767,1057,731,283,diss_building2.mp4
4788,1057,732,283,diss_building2.mp4
4836,1057,733,283,diss_building2.mp4
4859,1057,734,283,diss_building2.mp4
4894,1057,735,281,diss_building2.mp4
4914,1057,735,277,diss_building2.mp4
4929,1057,736,272,diss_building2.mp4
4948,1057,736,255,diss_building2.mp4
4963,1057,733,241,diss_building2.mp4
4986,1057,731,232,diss_building2.mp4
4990,1057,730,230,diss_building2.mp4
5010,1057,728,225,diss_building2.mp4
5019,1057,727,224,diss_building2.mp4
5046,1057,725,221,diss_building2.mp4
5060,1057,725,219,diss_building2.mp4
5081,1057,724,214,diss_building2.mp4
5094,1057,722,209,diss_building2.mp4
5109,1057,720,207,diss_building2.mp4
5130,1057,720,201,diss_building2.mp4
5143,1057,719,199,diss_building2.mp4
5159,1057,718,196,diss_building2.mp4
5179,1057,718,191,diss_building2.mp4
5192,1057,718,188,diss_building2.mp4
5213,1057,718,184,diss_building2.mp4
5227,1057,718,181,diss_building2.mp4
5248,1057,718,178,diss_building2.mp4
5257,1057,718,176,diss_building2.mp4
5276,1057,719,173,diss_building2.mp4
5291,1057,720,170,diss_building2.mp4
5311,1057,721,168,diss_building2.mp4
5326,1057,722,165,diss_building2.mp4
5341,1057,723,164,diss_building2.mp4
5361,1057,725,161,diss_building2.mp4
5375,1057,727,160,diss_building2.mp4
5396,1057,729,156,diss_building2.mp4
5409,1057,731,156,diss_building2.mp4
5431,1057,732,152,diss_building2.mp4
5444,1057,734,152,diss_building2.mp4
5459,1057,736,150,diss_building2.mp4
5468,1057,736,148,diss_building2.mp4
6178,1057,740,147,diss_building2.mp4
6194,1057,746,145,diss_building2.mp4
6213,1057,754,142,diss_building2.mp4
6229,1057,758,140,diss_building2.mp4
6233,1057,760,140,diss_building2.mp4
6257,1057,764,138,diss_building2.mp4
6278,1057,765,138,diss_building2.mp4
6291,1057,766,137,diss_building2.mp4
6303,1057,767,137,diss_building2.mp4
6326,1057,768,136,diss_building2.mp4
6346,1057,770,136,diss_building2.mp4
6353,1057,771,136,diss_building2.mp4
6366,1057,772,136,diss_building2.mp4
6402,1057,773,136,diss_building2.mp4
6424,1057,774,136,diss_building2.mp4
6459,1057,775,136,diss_building2.mp4
7492,1057,780,138,diss_building2.mp4
7509,1057,783,141,diss_building2.mp4
7528,1057,786,146,diss_building2.mp4
7543,1057,792,155,diss_building2.mp4
7557,1057,797,164,diss_building2.mp4
7577,1057,803,179,diss_building2.mp4
7593,1057,804,183,diss_building2.mp4
7612,1057,806,188,diss_building2.mp4
7627,1057,808,190,diss_building2.mp4
7641,1057,808,192,diss_building2.mp4
7661,1057,808,194,diss_building2.mp4
7668,1057,808,196,diss_building2.mp4
7681,1057,808,198,diss_building2.mp4
9589,1057,817,197,diss_building2.mp4
9609,1057,851,190,diss_building2.mp4
9623,1057,868,185,diss_building2.mp4
9643,1057,892,181,diss_building2.mp4
9659,1057,905,180,diss_building2.mp4
9673,1057,915,179,diss_building2.mp4
9692,1057,926,179,diss_building2.mp4
9707,1057,932,179,diss_building2.mp4
9727,1057,937,180,diss_building2.mp4
9742,1057,940,180,diss_building2.mp4
9756,1057,944,181,diss_building2.mp4
9776,1057,949,182,diss_building2.mp4
9791,1057,952,182,diss_building2.mp4
9805,1057,953,183,diss_building2.mp4
9826,1057,956,184,diss_building2.mp4
9840,1057,957,184,diss_building2.mp4
9859,1057,959,186,diss_building2.mp4
9866,1057,960,186,diss_building2.mp4
9890,1057,962,187,diss_building2.mp4
9909,1057,963,188,diss_building2.mp4
9915,1057,964,188,diss_building2.mp4
9938,1057,965,188,diss_building2.mp4
9959,1057,966,189,diss_building2.mp4
9973,1057,967,189,diss_building2.mp4
9987,1057,967,190,diss_building2.mp4
10013,1057,968,190,diss_building2.mp4
10289,1057,950,209,diss_building2.mp4
10307,1057,887,263,diss_building2.mp4
10323,1057,841,283,diss_building2.mp4
10343,1057,783,299,diss_building2.mp4
10357,1057,755,305,diss_building2.mp4
10377,1057,728,310,diss_building2.mp4
10392,1057,722,311,diss_building2.mp4
10407,1057,719,311,diss_building2.mp4
10426,1057,717,311,diss_building2.mp4
10441,1057,716,311,diss_building2.mp4
10446,1057,716,310,diss_building2.mp4
10469,1057,716,309,diss_building2.mp4
10490,1057,716,308,diss_building2.mp4
10509,1057,716,307,diss_building2.mp4
10531,1057,716,306,diss_building2.mp4
10545,1057,716,305,diss_building2.mp4
10565,1057,716,304,diss_building2.mp4
10608,1057,718,303,diss_building2.mp4
10623,1057,721,301,diss_building2.mp4
10642,1057,732,300,diss_building2.mp4
10658,1057,752,298,diss_building2.mp4
10672,1057,769,298,diss_building2.mp4
10693,1057,780,301,diss_building2.mp4
10707,1057,783,302,diss_building2.mp4
10726,1057,785,304,diss_building2.mp4
10734,1057,786,304,diss_building2.mp4
10756,1057,787,304,diss_building2.mp4
10776,1057,788,305,diss_building2.mp4
10805,1057,788,306,diss_building2.mp4
10825,1057,789,307,diss_building2.mp4
10874,1057,789,308,diss_building2.mp4
13866,1057,790,308,diss_building2.mp4
13978,1057,791,308,diss_building2.mp4
17236,1057,792,306,diss_building2.mp4
17251,1057,793,303,diss_building2.mp4
17266,1057,794,300,diss_building2.mp4
17286,1057,796,294,diss_building2.mp4
17300,1057,797,290,diss_building2.mp4
17315,1057,798,287,diss_building2.mp4
17335,1057,800,283,diss_building2.mp4
17350,1057,800,280,diss_building2.mp4
17363,1057,800,279,diss_building2.mp4
17384,1057,801,276,diss_building2.mp4
17413,1057,801,274,diss_building2.mp4
17434,1057,802,273,diss_building2.mp4
17452,1057,802,272,diss_building2.mp4
17495,1057,802,271,diss_building2.mp4
0,1058,625,424,diss_car13.mp4
15,1058,618,448,diss_car13.mp4
30,1058,616,467,diss_car13.mp4
49,1058,612,491,diss_car13.mp4
65,1058,611,500,diss_car13.mp4
85,1058,610,520,diss_car13.mp4
98,1058,610,528,diss_car13.mp4
114,1058,610,534,diss_car13.mp4
133,1058,609,539,diss_car13.mp4
148,1058,609,541,diss_car13.mp4
163,1058,608,544,diss_car13.mp4
182,1058,608,547,diss_car13.mp4
189,1058,608,548,diss_car13.mp4
217,1058,606,552,diss_car13.mp4
231,1058,606,554,diss_car13.mp4
237,1058,605,555,diss_car13.mp4
266,1058,604,558,diss_car13.mp4
281,1058,603,559,diss_car13.mp4
296,1058,603,560,diss_car13.mp4
309,1058,601,561,diss_car13.mp4
321,1058,600,562,diss_car13.mp4
350,1058,599,564,diss_car13.mp4
364,1058,596,564,diss_car13.mp4
379,1058,583,562,diss_car13.mp4
399,1058,512,531,diss_car13.mp4
414,1058,484,516,diss_car13.mp4
434,1058,452,500,diss_car13.mp4
448,1058,438,493,diss_car13.mp4
463,1058,426,484,diss_car13.mp4
482,1058,419,477,diss_car13.mp4
498,1058,416,475,diss_car13.mp4
517,1058,416,471,diss_car13.mp4
525,1058,416,469,diss_car13.mp4
539,1058,416,468,diss_car13.mp4
950,1058,376,432,diss_car13.mp4
964,1058,343,408,diss_car13.mp4
984,1058,321,395,diss_car13.mp4
999,1058,308,390,diss_car13.mp4
1013,1058,303,388,diss_car13.mp4
1033,1058,300,387,diss_car13.mp4
1049,1058,298,386,diss_car13.mp4
1497,1058,295,388,diss_car13.mp4
1513,1058,290,392,diss_car13.mp4
1531,1058,282,400,diss_car13.mp4
1547,1058,279,404,diss_car13.mp4
1566,1058,271,411,diss_car13.mp4
1581,1058,267,415,diss_car13.mp4
1596,1058,264,418,diss_car13.mp4
1616,1058,261,420,diss_car13.mp4
1624,1058,260,423,diss_car13.mp4
1645,1058,258,424,diss_car13.mp4
1664,1058,256,426,diss_car13.mp4
1680,1058,254,428,diss_car13.mp4
1695,1058,252,429,diss_car13.mp4
1708,1058,251,431,diss_car13.mp4
1720,1058,249,432,diss_car13.mp4
1748,1058,247,435,diss_car13.mp4
1762,1058,245,436,diss_car13.mp4
1783,1058,242,438,diss_car13.mp4
1797,1058,239,440,diss_car13.mp4
1811,1058,236,441,diss_car13.mp4
1832,1058,232,442,diss_car13.mp4
1846,1058,225,443,diss_car13.mp4
1861,1058,220,443,diss_car13.mp4
1881,1058,208,441,diss_car13.mp4
1894,1058,200,440,diss_car13.mp4
1910,1058,192,437,diss_car13.mp4
1930,1058,184,434,diss_car13.mp4
1945,1058,180,432,diss_car13.mp4
1965,1058,175,429,diss_car13.mp4
1979,1058,173,427,diss_car13.mp4
1994,1058,171,424,diss_car13.mp4
2013,1058,168,418,diss_car13.mp4
2027,1058,165,409,diss_car13.mp4
2044,1058,163,393,diss_car13.mp4
2063,1058,162,372,diss_car13.mp4
2078,1058,162,355,diss_car13.mp4
2097,1058,166,332,diss_car13.mp4
2112,1058,169,319,diss_car13.mp4
2133,1058,176,300,diss_car13.mp4
2147,1058,183,288,diss_car13.mp4
2161,1058,190,274,diss_car13.mp4
2183,1058,196,265,diss_car13.mp4
2744,1058,188,248,diss_car13.mp4
2762,1058,179,232,diss_car13.mp4
2781,1058,173,219,diss_car13.mp4
2796,1058,169,211,diss_car13.mp4
2815,1058,167,204,diss_car13.mp4
2829,1058,167,201,diss_car13.mp4
2836,1058,166,200,diss_car13.mp4
2864,1058,166,197,diss_car13.mp4
2879,1058,166,196,diss_car13.mp4
2913,1058,166,193,diss_car13.mp4
2920,1058,166,192,diss_car13.mp4
2943,1058,166,191,diss_car13.mp4
2956,1058,166,190,diss_car13.mp4
2969,1058,166,188,diss_car13.mp4
3012,1058,166,187,diss_car13.mp4
3034,1058,166,186,diss_car13.mp4
3067,1058,166,185,diss_car13.mp4
3088,1058,166,184,diss_car13.mp4
3130,1058,168,181,diss_car13.mp4
3146,1058,175,179,diss_car13.mp4
3159,1058,213,171,diss_car13.mp4
3180,1058,321,189,diss_car13.mp4
3195,1058,389,223,diss_car13.mp4
3215,1058,450,256,diss_car13.mp4
3229,1058,476,275,diss_car13.mp4
3244,1058,490,289,diss_car13.mp4
3264,1058,497,298,diss_car13.mp4
3279,1058,500,301,diss_car13.mp4
3292,1058,501,304,diss_car13.mp4
3680,1058,527,304,diss_car13.mp4
3694,1058,551,304,diss_car13.mp4
3713,1058,576,304,diss_car13.mp4
3729,1058,589,306,diss_car13.mp4
3743,1058,599,308,diss_car13.mp4
3763,1058,619,309,diss_car13.mp4
3778,1058,636,312,diss_car13.mp4
3797,1058,664,316,diss_car13.mp4
3813,1058,688,319,diss_car13.mp4
3827,1058,704,323,diss_car13.mp4
3847,1058,722,325,diss_car13.mp4
3862,1058,734,327,diss_car13.mp4
3882,1058,760,332,diss_car13.mp4
3896,1058,791,342,diss_car13.mp4
3911,1058,803,347,diss_car13.mp4
3930,1058,814,354,diss_car13.mp4
3945,1058,818,356,diss_car13.mp4
3960,1058,819,357,diss_car13.mp4
3973,1058,820,358,diss_car13.mp4
3986,1058,820,359,diss_car13.mp4
4009,1058,821,360,diss_car13.mp4
4028,1058,822,361,diss_car13.mp4
4035,1058,823,361,diss_car13.mp4
4539,1058,790,343,diss_car13.mp4
4555,1058,767,334,diss_car13.mp4
4577,1058,748,327,diss_car13.mp4
4597,1058,732,321,diss_car13.mp4
4612,1058,726,321,diss_car13.mp4
4627,1058,720,321,diss_car13.mp4
4646,1058,712,321,diss_car13.mp4
4661,1058,708,322,diss_car13.mp4
4680,1058,699,324,diss_car13.mp4
4695,1058,692,327,diss_car13.mp4
4711,1058,686,328,diss_car13.mp4
4730,1058,681,331,diss_car13.mp4
4745,1058,677,333,diss_car13.mp4
4758,1058,676,335,diss_car13.mp4
4773,1058,672,336,diss_car13.mp4
4794,1058,670,338,diss_car13.mp4
4814,1058,667,341,diss_car13.mp4
4829,1058,666,342,diss_car13.mp4
4843,1058,665,343,diss_car13.mp4
4849,1058,664,344,diss_car13.mp4
4883,1058,663,344,diss_car13.mp4
4897,1058,662,345,diss_car13.mp4
4927,1058,661,345,diss_car13.mp4
4946,1058,661,347,diss_car13.mp4
5645,1058,678,281,diss_car13.mp4
5661,1058,692,236,diss_car13.mp4
5674,1058,698,216,diss_car13.mp4
5695,1058,705,200,diss_car13.mp4
5710,1058,707,196,diss_car13.mp4
5724,1058,708,194,diss_car13.mp4
5736,1058,708,193,diss_car13.mp4
5750,1058,709,192,diss_car13.mp4
5778,1058,710,190,diss_car13.mp4
5785,1058,711,188,diss_car13.mp4
5808,1058,712,186,diss_car13.mp4
5828,1058,712,184,diss_car13.mp4
5849,1058,713,183,diss_car13.mp4
5869,1058,713,182,diss_car13.mp4
5883,1058,714,182,diss_car13.mp4
7105,1058,751,184,diss_car13.mp4
7127,1058,788,188,diss_car13.mp4
7142,1058,808,191,diss_car13.mp4
7161,1058,827,193,diss_car13.mp4
7176,1058,838,196,diss_car13.mp4
7191,1058,844,196,diss_car13.mp4
7210,1058,847,197,diss_car13.mp4
7217,1058,848,197,diss_car13.mp4
7244,1058,849,198,diss_car13.mp4
7294,1058,851,199,diss_car13.mp4
7323,1058,852,199,diss_car13.mp4
7386,1058,853,199,diss_car13.mp4
7407,1058,854,199,diss_car13.mp4
7447,1058,855,199,diss_car13.mp4
7841,1058,928,195,diss_car13.mp4
7860,1058,974,196,diss_car13.mp4
7875,1058,988,198,diss_car13.mp4
7889,1058,999,200,diss_car13.mp4
7909,1058,1006,203,diss_car13.mp4
7925,1058,1008,204,diss_car13.mp4
7944,1058,1011,204,diss_car13.mp4
7964,1058,1012,205,diss_car13.mp4
7986,1058,1013,205,diss_car13.mp4
8035,1058,1014,205,diss_car13.mp4
8174,1058,1014,206,diss_car13.mp4
8559,1058,1011,206,diss_car13.mp4
8574,1058,974,204,diss_car13.mp4
8588,1058,912,194,diss_car13.mp4
8609,1058,847,187,diss_car13.mp4
8624,1058,801,188,diss_car13.mp4
8643,1058,753,196,diss_car13.mp4
8658,1058,737,201,diss_car13.mp4
8672,1058,727,206,diss_car13.mp4
8693,1058,713,213,diss_car13.mp4
8707,1058,703,217,diss_car13.mp4
8727,1058,683,227,diss_car13.mp4
8742,1058,664,234,diss_car13.mp4
8756,1058,644,237,diss_car13.mp4
8776,1058,616,237,diss_car13.mp4
8791,1058,601,236,diss_car13.mp4
8805,1058,586,236,diss_car13.mp4
8826,1058,577,236,diss_car13.mp4
8840,1058,572,236,diss_car13.mp4
8860,1058,568,236,diss_car13.mp4
8875,1058,564,235,diss_car13.mp4
8910,1058,561,234,diss_car13.mp4
8924,1058,560,234,diss_car13.mp4
8929,1058,560,233,diss_car13.mp4
8952,1058,559,233,diss_car13.mp4
8973,1058,558,232,diss_car13.mp4
8993,1058,556,232,diss_car13.mp4
9356,1058,546,233,diss_car13.mp4
9376,1058,506,244,diss_car13.mp4
9391,1058,488,249,diss_car13.mp4
9406,1058,472,254,diss_car13.mp4
9426,1058,455,256,diss_car13.mp4
9440,1058,446,256,diss_car13.mp4
9460,1058,436,256,diss_car13.mp4
9475,1058,433,256,diss_car13.mp4
9481,1058,432,256,diss_car13.mp4
9503,1058,428,256,diss_car13.mp4
9524,1058,426,256,diss_car13.mp4
9538,1058,424,256,diss_car13.mp4
9552,1058,423,256,diss_car13.mp4
9573,1058,420,255,diss_car13.mp4
9587,1058,418,254,diss_car13.mp4
9608,1058,412,252,diss_car13.mp4
9622,1058,401,249,diss_car13.mp4
9642,1058,380,242,diss_car13.mp4
9657,1058,367,237,diss_car13.mp4
9670,1058,361,236,diss_car13.mp4
9692,1058,356,236,diss_car13.mp4
9706,1058,353,236,diss_car13.mp4
9725,1058,349,235,diss_car13.mp4
9732,1058,348,234,diss_car13.mp4
9755,1058,346,234,diss_car13.mp4
9769,1058,344,234,diss_car13.mp4
9790,1058,343,233,diss_car13.mp4
9804,1058,341,233,diss_car13.mp4
9817,1058,340,233,diss_car13.mp4
9853,1058,338,232,diss_car13.mp4
9874,1058,337,232,diss_car13.mp4
9893,1058,336,232,diss_car13.mp4
9909,1058,336,231,diss_car13.mp4
9942,1058,336,230,diss_car13.mp4
9973,1058,336,228,diss_car13.mp4
9991,1058,342,216,diss_car13.mp4
10007,1058,355,196,diss_car13.mp4
10026,1058,374,171,diss_car13.mp4
10040,1058,382,160,diss_car13.mp4
10055,1058,390,151,diss_car13.mp4
10074,1058,402,134,diss_car13.mp4
10089,1058,412,123,diss_car13.mp4
10105,1058,421,114,diss_car13.mp4
10124,1058,431,104,diss_car13.mp4
10138,1058,436,100,diss_car13.mp4
10154,1058,439,96,diss_car13.mp4
10172,1058,441,94,diss_car13.mp4
10179,1058,443,93,diss_car13.mp4
10194,1058,444,92,diss_car13.mp4
10222,1058,444,91,diss_car13.mp4
10237,1058,446,90,diss_car13.mp4
10257,1058,448,89,diss_car13.mp4
10264,1058,448,88,diss_car13.mp4
10277,1058,449,87,diss_car13.mp4
10306,1058,452,85,diss_car13.mp4
10328,1058,453,84,diss_car13.mp4
10356,1058,456,83,diss_car13.mp4
10375,1058,460,82,diss_car13.mp4
10391,1058,464,82,diss_car13.mp4
10406,1058,471,84,diss_car13.mp4
10424,1058,489,95,diss_car13.mp4
10439,1058,504,108,diss_car13.mp4
10454,1058,512,118,diss_car13.mp4
10475,1058,520,127,diss_car13.mp4
10489,1058,523,132,diss_car13.mp4
10508,1058,526,136,diss_car13.mp4
10524,1058,528,140,diss_car13.mp4
10538,1058,531,143,diss_car13.mp4
10557,1058,534,146,diss_car13.mp4
10564,1058,536,148,diss_car13.mp4
10587,1058,538,151,diss_car13.mp4
10608,1058,541,152,diss_car13.mp4
10622,1058,543,155,diss_car13.mp4
10641,1058,545,156,diss_car13.mp4
10657,1058,548,158,diss_car13.mp4
10671,1058,548,159,diss_car13.mp4
10684,1058,550,160,diss_car13.mp4
10711,1058,551,161,diss_car13.mp4
10725,1058,552,162,diss_car13.mp4
10775,1058,553,163,diss_car13.mp4
10781,1058,553,164,diss_car13.mp4
10795,1058,554,164,diss_car13.mp4
10901,1058,555,164,diss_car13.mp4
10928,1058,556,164,diss_car13.mp4
10972,1058,558,165,diss_car13.mp4
10991,1058,564,166,diss_car13.mp4
11006,1058,572,166,diss_car13.mp4
11021,1058,586,167,diss_car13.mp4
11041,1058,643,176,diss_car13.mp4
11055,1058,665,182,diss_car13.mp4
11069,1058,683,188,diss_car13.mp4
11090,1058,696,192,diss_car13.mp4
11105,1058,703,195,diss_car13.mp4
11124,1058,706,196,diss_car13.mp4
11139,1058,708,196,diss_car13.mp4
11153,1058,709,197,diss_car13.mp4
11160,1058,710,197,diss_car13.mp4
0,1061,666,424,diss_truck2.mp4
15,1061,676,444,diss_truck2.mp4
31,1061,686,462,diss_truck2.mp4
50,1061,694,482,diss_truck2.mp4
65,1061,699,492,diss_truck2.mp4
84,1061,701,502,diss_truck2.mp4
99,1061,702,505,diss_truck2.mp4
114,1061,702,506,diss_truck2.mp4
120,1061,702,507,diss_truck2.mp4
550,1061,755,506,diss_truck2.mp4
565,1061,795,505,diss_truck2.mp4
584,1061,858,500,diss_truck2.mp4
599,1061,897,488,diss_truck2.mp4
615,1061,914,482,diss_truck2.mp4
634,1061,930,475,diss_truck2.mp4
649,1061,934,473,diss_truck2.mp4
1463,1061,880,480,diss_truck2.mp4
1479,1061,824,488,diss_truck2.mp4
1499,1061,779,500,diss_truck2.mp4
1516,1061,761,504,diss_truck2.mp4
1531,1061,749,508,diss_truck2.mp4
1548,1061,740,511,diss_truck2.mp4
1564,1061,735,512,diss_truck2.mp4
1579,1061,731,513,diss_truck2.mp4
1593,1061,727,514,diss_truck2.mp4
1615,1061,722,514,diss_truck2.mp4
1632,1061,720,514,diss_truck2.mp4
1638,1061,718,514,diss_truck2.mp4
1663,1061,716,514,diss_truck2.mp4
2251,1061,692,520,diss_truck2.mp4
2280,1061,576,538,diss_truck2.mp4
2294,1061,521,540,diss_truck2.mp4
2314,1061,438,537,diss_truck2.mp4
2329,1061,398,536,diss_truck2.mp4
2348,1061,358,536,diss_truck2.mp4
2363,1061,340,539,diss_truck2.mp4
2378,1061,332,541,diss_truck2.mp4
2398,1061,328,542,diss_truck2.mp4
2413,1061,326,542,diss_truck2.mp4
2428,1061,325,542,diss_truck2.mp4
2460,1061,324,543,diss_truck2.mp4
2811,1061,324,544,diss_truck2.mp4
2825,1061,324,545,diss_truck2.mp4
2837,1061,324,547,diss_truck2.mp4
2861,1061,324,548,diss_truck2.mp4
2880,1061,324,549,diss_truck2.mp4
2896,1061,324,551,diss_truck2.mp4
2914,1061,325,553,diss_truck2.mp4
2930,1061,328,555,diss_truck2.mp4
2944,1061,329,558,diss_truck2.mp4
2964,1061,333,563,diss_truck2.mp4
2979,1061,336,565,diss_truck2.mp4
2993,1061,347,570,diss_truck2.mp4
3014,1061,373,578,diss_truck2.mp4
3028,1061,398,581,diss_truck2.mp4
3047,1061,421,581,diss_truck2.mp4
3062,1061,436,580,diss_truck2.mp4
3077,1061,450,578,diss_truck2.mp4
3097,1061,468,573,diss_truck2.mp4
3112,1061,486,570,diss_truck2.mp4
3131,1061,520,563,diss_truck2.mp4
3147,1061,548,558,diss_truck2.mp4
3162,1061,586,554,diss_truck2.mp4
3181,1061,632,548,diss_truck2.mp4
3196,1061,652,548,diss_truck2.mp4
3215,1061,674,549,diss_truck2.mp4
3230,1061,682,552,diss_truck2.mp4
3245,1061,688,553,diss_truck2.mp4
3264,1061,692,556,diss_truck2.mp4
3279,1061,694,558,diss_truck2.mp4
3294,1061,696,560,diss_truck2.mp4
3307,1061,698,560,diss_truck2.mp4
3761,1061,732,553,diss_truck2.mp4
3778,1061,764,546,diss_truck2.mp4
3797,1061,796,539,diss_truck2.mp4
3812,1061,813,536,diss_truck2.mp4
3826,1061,830,535,diss_truck2.mp4
3846,1061,856,533,diss_truck2.mp4
3862,1061,872,534,diss_truck2.mp4
3876,1061,883,536,diss_truck2.mp4
3895,1061,889,536,diss_truck2.mp4
3910,1061,892,537,diss_truck2.mp4
3930,1061,896,539,diss_truck2.mp4
3945,1061,900,540,diss_truck2.mp4
3964,1061,902,540,diss_truck2.mp4
3971,1061,903,540,diss_truck2.mp4
3994,1061,904,541,diss_truck2.mp4
4029,1061,905,542,diss_truck2.mp4
4043,1061,906,542,diss_truck2.mp4
4077,1061,907,542,diss_truck2.mp4
4510,1061,892,536,diss_truck2.mp4
4525,1061,852,515,diss_truck2.mp4
4546,1061,812,492,diss_truck2.mp4
4561,1061,801,485,diss_truck2.mp4
4580,1061,782,476,diss_truck2.mp4
4595,1061,775,473,diss_truck2.mp4
4609,1061,766,469,diss_truck2.mp4
4629,1061,760,466,diss_truck2.mp4
4644,1061,757,464,diss_truck2.mp4
4663,1061,754,462,diss_truck2.mp4
4678,1061,752,461,diss_truck2.mp4
4684,1061,752,460,diss_truck2.mp4
4713,1061,750,457,diss_truck2.mp4
4728,1061,748,456,diss_truck2.mp4
4742,1061,748,454,diss_truck2.mp4
4762,1061,746,453,diss_truck2.mp4
4768,1061,745,453,diss_truck2.mp4
4790,1061,744,452,diss_truck2.mp4
4804,1061,744,451,diss_truck2.mp4
4826,1061,743,450,diss_truck2.mp4
4846,1061,742,447,diss_truck2.mp4
4861,1061,742,444,diss_truck2.mp4
4879,1061,743,438,diss_truck2.mp4
4893,1061,744,434,diss_truck2.mp4
4907,1061,746,429,diss_truck2.mp4
4928,1061,773,410,diss_truck2.mp4
4942,1061,823,398,diss_truck2.mp4
4963,1061,868,401,diss_truck2.mp4
4977,1061,890,409,diss_truck2.mp4
4992,1061,908,420,diss_truck2.mp4
5012,1061,934,439,diss_truck2.mp4
5026,1061,945,448,diss_truck2.mp4
5041,1061,953,455,diss_truck2.mp4
5062,1061,959,462,diss_truck2.mp4
5077,1061,961,464,diss_truck2.mp4
5096,1061,963,465,diss_truck2.mp4
5105,1061,964,466,diss_truck2.mp4
5117,1061,964,467,diss_truck2.mp4
5152,1061,964,468,diss_truck2.mp4
5243,1061,965,468,diss_truck2.mp4
5278,1061,968,470,diss_truck2.mp4
5293,1061,975,472,diss_truck2.mp4
5308,1061,981,476,diss_truck2.mp4
5327,1061,989,480,diss_truck2.mp4
5342,1061,992,481,diss_truck2.mp4
5362,1061,993,482,diss_truck2.mp4
5370,1061,994,482,diss_truck2.mp4
5392,1061,995,483,diss_truck2.mp4
5411,1061,996,484,diss_truck2.mp4
5453,1061,997,484,diss_truck2.mp4
5480,1061,998,484,diss_truck2.mp4
5504,1061,998,485,diss_truck2.mp4
5962,1061,998,486,diss_truck2.mp4
6096,1061,998,487,diss_truck2.mp4
6139,1061,993,488,diss_truck2.mp4
6159,1061,872,485,diss_truck2.mp4
6175,1061,808,478,diss_truck2.mp4
6194,1061,711,464,diss_truck2.mp4
6209,1061,663,456,diss_truck2.mp4
6223,1061,622,451,diss_truck2.mp4
6242,1061,596,452,diss_truck2.mp4
6258,1061,584,452,diss_truck2.mp4
6278,1061,577,455,diss_truck2.mp4
6292,1061,573,456,diss_truck2.mp4
6307,1061,569,457,diss_truck2.mp4
6328,1061,566,457,diss_truck2.mp4
6342,1061,563,458,diss_truck2.mp4
6356,1061,561,458,diss_truck2.mp4
6370,1061,560,458,diss_truck2.mp4
6391,1061,559,458,diss_truck2.mp4
6405,1061,558,458,diss_truck2.mp4
6735,1061,553,448,diss_truck2.mp4
6757,1061,545,431,diss_truck2.mp4
6776,1061,540,417,diss_truck2.mp4
6791,1061,536,410,diss_truck2.mp4
6810,1061,535,404,diss_truck2.mp4
6825,1061,535,402,diss_truck2.mp4
6840,1061,535,400,diss_truck2.mp4
6859,1061,535,398,diss_truck2.mp4
6868,1061,535,397,diss_truck2.mp4
6880,1061,535,396,diss_truck2.mp4
6908,1061,537,391,diss_truck2.mp4
6924,1061,540,388,diss_truck2.mp4
6944,1061,550,377,diss_truck2.mp4
6957,1061,559,370,diss_truck2.mp4
6973,1061,569,364,diss_truck2.mp4
6992,1061,588,358,diss_truck2.mp4
7007,1061,600,357,diss_truck2.mp4
7022,1061,608,357,diss_truck2.mp4
7041,1061,624,357,diss_truck2.mp4
7061,1061,640,357,diss_truck2.mp4
7076,1061,652,357,diss_truck2.mp4
7091,1061,659,357,diss_truck2.mp4
7110,1061,674,358,diss_truck2.mp4
7125,1061,687,359,diss_truck2.mp4
7140,1061,701,360,diss_truck2.mp4
7161,1061,726,363,diss_truck2.mp4
7175,1061,740,367,diss_truck2.mp4
7190,1061,749,370,diss_truck2.mp4
7209,1061,757,375,diss_truck2.mp4
7224,1061,760,376,diss_truck2.mp4
7239,1061,763,379,diss_truck2.mp4
7258,1061,768,384,diss_truck2.mp4
7273,1061,772,388,diss_truck2.mp4
7293,1061,779,395,diss_truck2.mp4
7307,1061,781,400,diss_truck2.mp4
7323,1061,783,404,diss_truck2.mp4
7342,1061,783,414,diss_truck2.mp4
7356,1061,781,421,diss_truck2.mp4
7371,1061,777,428,diss_truck2.mp4
7391,1061,767,444,diss_truck2.mp4
7407,1061,758,452,diss_truck2.mp4
7426,1061,748,456,diss_truck2.mp4
7441,1061,743,459,diss_truck2.mp4
7460,1061,701,466,diss_truck2.mp4
7475,1061,659,464,diss_truck2.mp4
7490,1061,631,462,diss_truck2.mp4
7510,1061,568,451,diss_truck2.mp4
7524,1061,544,444,diss_truck2.mp4
7544,1061,500,431,diss_truck2.mp4
7558,1061,476,424,diss_truck2.mp4
7573,1061,459,420,diss_truck2.mp4
7594,1061,437,416,diss_truck2.mp4
7607,1061,428,412,diss_truck2.mp4
7623,1061,422,412,diss_truck2.mp4
7643,1061,413,411,diss_truck2.mp4
7658,1061,410,410,diss_truck2.mp4
7677,1061,405,409,diss_truck2.mp4
7691,1061,402,409,diss_truck2.mp4
7706,1061,398,409,diss_truck2.mp4
7727,1061,393,408,diss_truck2.mp4
7740,1061,391,408,diss_truck2.mp4
7756,1061,388,408,diss_truck2.mp4
7776,1061,384,408,diss_truck2.mp4
7790,1061,381,408,diss_truck2.mp4
7809,1061,377,406,diss_truck2.mp4
7824,1061,375,404,diss_truck2.mp4
7839,1061,373,401,diss_truck2.mp4
7859,1061,371,395,diss_truck2.mp4
7874,1061,370,387,diss_truck2.mp4
7890,1061,370,380,diss_truck2.mp4
7908,1061,376,360,diss_truck2.mp4
7923,1061,400,319,diss_truck2.mp4
7938,1061,432,275,diss_truck2.mp4
7957,1061,455,252,diss_truck2.mp4
7973,1061,471,234,diss_truck2.mp4
7993,1061,490,212,diss_truck2.mp4
8007,1061,499,205,diss_truck2.mp4
8027,1061,507,198,diss_truck2.mp4
8041,1061,511,195,diss_truck2.mp4
8056,1061,513,193,diss_truck2.mp4
8071,1061,515,192,diss_truck2.mp4
8090,1061,518,190,diss_truck2.mp4
8106,1061,520,188,diss_truck2.mp4
8125,1061,522,188,diss_truck2.mp4
8133,1061,524,187,diss_truck2.mp4
8155,1061,526,186,diss_truck2.mp4
8174,1061,528,184,diss_truck2.mp4
8181,1061,529,184,diss_truck2.mp4
8203,1061,531,184,diss_truck2.mp4
8223,1061,533,184,diss_truck2.mp4
8238,1061,534,183,diss_truck2.mp4
8252,1061,536,182,diss_truck2.mp4
8273,1061,538,182,diss_truck2.mp4
8288,1061,540,182,diss_truck2.mp4
8313,1061,542,182,diss_truck2.mp4
8328,1061,543,182,diss_truck2.mp4
8345,1061,544,182,diss_truck2.mp4
8372,1061,545,182,diss_truck2.mp4
8385,1061,546,182,diss_truck2.mp4
8407,1061,547,182,diss_truck2.mp4
8412,1061,548,183,diss_truck2.mp4
8442,1061,548,184,diss_truck2.mp4
8456,1061,549,184,diss_truck2.mp4
8476,1061,550,184,diss_truck2.mp4
8488,1061,551,185,diss_truck2.mp4
8503,1061,552,186,diss_truck2.mp4
8524,1061,553,187,diss_truck2.mp4
8538,1061,557,189,diss_truck2.mp4
8559,1061,578,200,diss_truck2.mp4
8573,1061,597,208,diss_truck2.mp4
8588,1061,616,213,diss_truck2.mp4
8608,1061,646,220,diss_truck2.mp4
8622,1061,672,223,diss_truck2.mp4
8643,1061,714,232,diss_truck2.mp4
8657,1061,728,237,diss_truck2.mp4
8671,1061,741,244,diss_truck2.mp4
8691,1061,758,255,diss_truck2.mp4
8705,1061,765,259,diss_truck2.mp4
8720,1061,769,262,diss_truck2.mp4
8740,1061,773,266,diss_truck2.mp4
8754,1061,775,268,diss_truck2.mp4
8770,1061,777,271,diss_truck2.mp4
8790,1061,781,275,diss_truck2.mp4
8804,1061,783,276,diss_truck2.mp4
8819,1061,784,278,diss_truck2.mp4
9220,1061,816,284,diss_truck2.mp4
9241,1061,848,294,diss_truck2.mp4
9257,1061,863,299,diss_truck2.mp4
9272,1061,880,305,diss_truck2.mp4
9292,1061,896,312,diss_truck2.mp4
9307,1061,906,317,diss_truck2.mp4
9325,1061,912,320,diss_truck2.mp4
9341,1061,917,323,diss_truck2.mp4
9347,1061,920,324,diss_truck2.mp4
9375,1061,925,327,diss_truck2.mp4
9390,1061,928,329,diss_truck2.mp4
9404,1061,930,330,diss_truck2.mp4
9417,1061,932,331,diss_truck2.mp4
9791,1061,932,344,diss_truck2.mp4
9806,1061,934,348,diss_truck2.mp4
9821,1061,935,352,diss_truck2.mp4
9841,1061,936,356,diss_truck2.mp4
9856,1061,936,359,diss_truck2.mp4
9875,1061,936,361,diss_truck2.mp4
9889,1061,937,362,diss_truck2.mp4
9905,1061,937,363,diss_truck2.mp4
9924,1061,938,364,diss_truck2.mp4
9938,1061,939,365,diss_truck2.mp4
9945,1061,939,366,diss_truck2.mp4
9959,1061,939,367,diss_truck2.mp4
9979,1061,939,368,diss_truck2.mp4
10058,1061,939,369,diss_truck2.mp4
10071,1061,939,370,diss_truck2.mp4
10106,1061,938,372,diss_truck2.mp4
10121,1061,919,384,diss_truck2.mp4
10140,1061,827,418,diss_truck2.mp4
10155,1061,753,438,diss_truck2.mp4
10170,1061,698,456,diss_truck2.mp4
10189,1061,625,488,diss_truck2.mp4
10204,1061,586,509,diss_truck2.mp4
10225,1061,553,531,diss_truck2.mp4
10239,1061,538,541,diss_truck2.mp4
10254,1061,531,547,diss_truck2.mp4
10273,1061,525,552,diss_truck2.mp4
10288,1061,523,553,diss_truck2.mp4
10303,1061,521,555,diss_truck2.mp4
10317,1061,520,556,diss_truck2.mp4
10329,1061,518,557,diss_truck2.mp4
10352,1061,517,558,diss_truck2.mp4
10372,1061,516,560,diss_truck2.mp4
10378,1061,514,560,diss_truck2.mp4
10406,1061,513,561,diss_truck2.mp4
10421,1061,513,563,diss_truck2.mp4
10441,1061,514,569,diss_truck2.mp4
10455,1061,520,584,diss_truck2.mp4
10470,1061,530,599,diss_truck2.mp4
10490,1061,540,612,diss_truck2.mp4
10505,1061,543,615,diss_truck2.mp4
10520,1061,544,617,diss_truck2.mp4
10539,1061,547,619,diss_truck2.mp4
10546,1061,547,620,diss_truck2.mp4
10560,1061,548,620,diss_truck2.mp4
10583,1061,548,621,diss_truck2.mp4
10594,1061,548,622,diss_truck2.mp4
10631,1061,549,622,diss_truck2.mp4
10657,1061,550,622,diss_truck2.mp4
10666,1061,551,622,diss_truck2.mp4
10687,1061,552,620,diss_truck2.mp4
10708,1061,557,616,diss_truck2.mp4
10721,1061,569,605,diss_truck2.mp4
10736,1061,596,584,diss_truck2.mp4
10755,1061,652,545,diss_truck2.mp4
10771,1061,675,532,diss_truck2.mp4
10786,1061,692,522,diss_truck2.mp4
10804,1061,716,508,diss_truck2.mp4
10820,1061,732,502,diss_truck2.mp4
10840,1061,745,496,diss_truck2.mp4
10854,1061,754,494,diss_truck2.mp4
10869,1061,760,493,diss_truck2.mp4
10888,1061,764,492,diss_truck2.mp4
10904,1061,768,492,diss_truck2.mp4
10918,1061,771,491,diss_truck2.mp4
10938,1061,778,490,diss_truck2.mp4
10953,1061,784,490,diss_truck2.mp4
10972,1061,796,488,diss_truck2.mp4
10987,1061,800,488,diss_truck2.mp4
11003,1061,803,488,diss_truck2.mp4
11023,1061,806,487,diss_truck2.mp4
11037,1061,808,486,diss_truck2.mp4
11051,1061,809,486,diss_truck2.mp4
11073,1061,811,486,diss_truck2.mp4
11078,1061,812,486,diss_truck2.mp4
11106,1061,812,485,diss_truck2.mp4
11112,1061,813,485,diss_truck2.mp4
11154,1061,814,485,diss_truck2.mp4
11170,1061,815,485,diss_truck2.mp4
11211,1061,816,485,diss_truck2.mp4
12765,1061,816,486,diss_truck2.mp4
12788,1061,814,486,diss_truck2.mp4
12803,1061,813,486,diss_truck2.mp4
12825,1061,812,486,diss_truck2.mp4
12854,1061,811,486,diss_truck2.mp4
12889,1061,810,486,diss_truck2.mp4
12932,1061,809,486,diss_truck2.mp4
13021,1061,809,487,diss_truck2.mp4
13036,1061,808,487,diss_truck2.mp4
13071,1061,800,487,diss_truck2.mp4
13086,1061,780,484,diss_truck2.mp4
13099,1061,747,478,diss_truck2.mp4
13120,1061,699,465,diss_truck2.mp4
13135,1061,674,456,diss_truck2.mp4
13154,1061,640,444,diss_truck2.mp4
13170,1061,627,441,diss_truck2.mp4
13184,1061,620,441,diss_truck2.mp4
13204,1061,614,442,diss_truck2.mp4
13219,1061,611,443,diss_truck2.mp4
13238,1061,607,444,diss_truck2.mp4
13245,1061,606,444,diss_truck2.mp4
14037,1061,612,434,diss_truck2.mp4
14053,1061,622,419,diss_truck2.mp4
14067,1061,632,405,diss_truck2.mp4
14087,1061,640,394,diss_truck2.mp4
14101,1061,643,388,diss_truck2.mp4
14120,1061,647,383,diss_truck2.mp4
14137,1061,648,380,diss_truck2.mp4
14151,1061,649,378,diss_truck2.mp4
14171,1061,650,376,diss_truck2.mp4
14185,1061,650,374,diss_truck2.mp4
14200,1061,650,372,diss_truck2.mp4
14219,1061,650,370,diss_truck2.mp4
14234,1061,650,368,diss_truck2.mp4
14262,1061,650,366,diss_truck2.mp4
14284,1061,649,365,diss_truck2.mp4
14303,1061,648,364,diss_truck2.mp4
14310,1061,648,363,diss_truck2.mp4
14333,1061,647,362,diss_truck2.mp4
18213,1061,664,356,diss_truck2.mp4
18229,1061,718,339,diss_truck2.mp4
18245,1061,764,327,diss_truck2.mp4
18267,1061,828,312,diss_truck2.mp4
18283,1061,859,303,diss_truck2.mp4
18299,1061,883,299,diss_truck2.mp4
18314,1061,904,296,diss_truck2.mp4
18331,1061,917,294,diss_truck2.mp4
18350,1061,929,292,diss_truck2.mp4
18365,1061,943,288,diss_truck2.mp4
18380,1061,952,286,diss_truck2.mp4
18400,1061,962,283,diss_truck2.mp4
18415,1061,968,282,diss_truck2.mp4
18433,1061,971,281,diss_truck2.mp4
18440,1061,972,280,diss_truck2.mp4
18470,1061,973,280,diss_truck2.mp4
18498,1061,976,280,diss_truck2.mp4
18512,1061,979,279,diss_truck2.mp4
18532,1061,988,276,diss_truck2.mp4
18548,1061,992,275,diss_truck2.mp4
18567,1061,996,273,diss_truck2.mp4
18582,1061,999,272,diss_truck2.mp4
18597,1061,1001,272,diss_truck2.mp4
18617,1061,1004,272,diss_truck2.mp4
18631,1061,1007,272,diss_truck2.mp4
18650,1061,1011,272,diss_truck2.mp4
18657,1061,1012,272,diss_truck2.mp4
18680,1061,1014,272,diss_truck2.mp4
18699,1061,1017,272,diss_truck2.mp4
18715,1061,1022,272,diss_truck2.mp4
18729,1061,1059,267,diss_truck2.mp4
18749,1061,1119,255,diss_truck2.mp4
18764,1061,1124,252,diss_truck2.mp4
18778,1061,1127,252,diss_truck2.mp4
18804,1061,1127,251,diss_truck2.mp4
18853,1061,1127,250,diss_truck2.mp4
19000,1061,1127,249,diss_truck2.mp4
