verifToken,stimuli_id,source_id,media_a_id,source_a,created_at,source_name_vote,reversed,source_position_vote,bl,bd,nb_replay
77npihs2,1086,5566,44536,diss_building3.mp4,1646994263,1,,1,8,120,1
77npihs2,1090,5570,44540,diss_car13.mp4,1646994325,1,,1,8,120,1
77npihs2,1101,5574,44544,diss_truck3.mp4,1646994343,1,,1,8,120,1
77npihs2,1099,5560,44530,diss_StreetBasketball1.mp4,1646994365,1,,1,8,120,1
77npihs2,1098,5559,44529,diss_Soccer2.mp4,1646994386,1,,1,8,120,1
77npihs2,1092,5554,44524,diss_Girl1.mp4,1646994399,1,,1,8,120,1
77npihs2,1089,5569,44539,diss_car12.mp4,1646994409,1,,1,8,120,1
77npihs2,1097,5558,44528,diss_Soccer1.mp4,1646994421,1,,1,8,120,1
77npihs2,1084,5564,44534,diss_building1.mp4,1646994432,1,,1,8,120,1
77npihs2,1100,5573,44543,diss_truck2.mp4,1646994443,1,,1,8,120,1
77npihs2,1094,5556,44526,diss_ManRunning1.mp4,1646994453,1,,1,8,120,1
77npihs2,1093,5555,44525,diss_Girl2.mp4,1646994483,1,,1,8,120,1
77npihs2,1081,5553,44523,diss_Basketball.mp4,1646994502,1,,1,8,120,1
77npihs2,1096,5572,44542,diss_person22.mp4,1646994528,1,,1,8,120,1
77npihs2,1087,5567,44537,diss_building4.mp4,1646994551,1,,1,8,120,1
77npihs2,1088,5568,44538,diss_car11.mp4,1646994571,1,,1,8,120,1
77npihs2,1083,5563,44533,diss_bike3.mp4,1646994590,1,,1,8,120,1
77npihs2,1082,5562,44532,diss_bike2.mp4,1646994614,1,,1,8,120,1
77npihs2,1102,5561,44531,diss_Walking.mp4,1646994637,1,,1,8,120,1
77npihs2,1091,5571,44541,diss_car15.mp4,1646994661,1,,1,8,120,2
77npihs2,1085,5565,44535,diss_building2.mp4,1646994685,1,,1,8,120,1
77npihs2,1095,5557,44527,diss_ManRunning2.mp4,1646994710,1,,1,8,120,1
