verifToken,stimuli_id,source_id,media_a_id,source_a,created_at,source_name_vote,reversed,source_position_vote,bl,bd,nb_replay
3l9h7nbl,1094,5556,44526,diss_ManRunning1.mp4,1644591971,1,,1,12,120,1
3l9h7nbl,1099,5560,44530,diss_StreetBasketball1.mp4,1644592014,1,,1,12,120,1
3l9h7nbl,1102,5561,44531,diss_Walking.mp4,1644592026,1,,1,12,120,1
3l9h7nbl,1081,5553,44523,diss_Basketball.mp4,1644592054,1,,1,12,120,1
3l9h7nbl,1092,5554,44524,diss_Girl1.mp4,1644592070,1,,1,12,120,1
3l9h7nbl,1096,5572,44542,diss_person22.mp4,1644592089,1,,1,12,120,2
3l9h7nbl,1101,5574,44544,diss_truck3.mp4,1644592111,1,,1,12,120,1
3l9h7nbl,1085,5565,44535,diss_building2.mp4,1644592123,1,,1,12,120,1
3l9h7nbl,1084,5564,44534,diss_building1.mp4,1644592134,1,,1,12,120,1
3l9h7nbl,1083,5563,44533,diss_bike3.mp4,1644592145,1,,1,12,120,1
3l9h7nbl,1082,5562,44532,diss_bike2.mp4,1644592155,1,,1,12,120,1
3l9h7nbl,1093,5555,44525,diss_Girl2.mp4,1644592190,1,,1,12,120,1
3l9h7nbl,1086,5566,44536,diss_building3.mp4,1644592212,1,,1,12,120,1
3l9h7nbl,1100,5573,44543,diss_truck2.mp4,1644592234,1,,1,12,120,1
3l9h7nbl,1091,5571,44541,diss_car15.mp4,1644592257,1,,1,12,120,1
3l9h7nbl,1097,5558,44528,diss_Soccer1.mp4,1644592280,1,,1,12,120,1
3l9h7nbl,1098,5559,44529,diss_Soccer2.mp4,1644592300,1,,1,12,120,1
3l9h7nbl,1095,5557,44527,diss_ManRunning2.mp4,1644592318,1,,1,12,120,1
3l9h7nbl,1090,5570,44540,diss_car13.mp4,1644592337,1,,1,12,120,1
3l9h7nbl,1089,5569,44539,diss_car12.mp4,1644592355,1,,1,12,120,1
3l9h7nbl,1088,5568,44538,diss_car11.mp4,1644592377,1,,1,12,120,1
3l9h7nbl,1087,5567,44537,diss_building4.mp4,1644592399,1,,1,12,120,1
