verifToken,stimuli_id,source_id,media_a_id,source_a,created_at,source_name_vote,reversed,source_position_vote,bl,bd,nb_replay
bdse5ckb,1057,4263,14054,diss_building2.mp4,1644423759,1,,1,8,120,2
bdse5ckb,1058,4264,14055,diss_car13.mp4,1644423811,1,,1,8,120,0
bdse5ckb,1059,4262,14053,diss_Soccer1.mp4,1644423835,1,,1,8,120,0
bdse5ckb,1061,4266,14057,diss_truck2.mp4,1644423860,1,,1,8,120,0
bdse5ckb,1060,4265,14056,diss_person22.mp4,1644423887,1,,1,8,120,0
bdse5ckb,1062,4263,14054,diss_building2.mp4,1644423898,1,,1,8,120,0
