verifToken,stimuli_id,source_id,media_a_id,source_a,created_at,source_name_vote,reversed,source_position_vote,bl,bd,nb_replay
h4pu8e4i,1065,4271,14062,diss_car15.mp4,1644424286,1,,1,8,120,0
h4pu8e4i,1066,4267,14058,diss_Girl2.mp4,1644424312,1,,1,8,120,0
h4pu8e4i,1067,4268,14059,diss_StreetBasketball1.mp4,1644424324,1,,1,8,120,0
h4pu8e4i,1063,4269,14060,diss_bike3.mp4,1644424343,1,,1,8,120,0
h4pu8e4i,1068,4269,14060,diss_bike3.mp4,1644424361,1,,1,8,120,0
h4pu8e4i,1064,4270,14061,diss_building3.mp4,1644424393,1,,1,8,120,0
