verifToken,stimuli_id,source_id,media_a_id,source_a,created_at,source_name_vote,reversed,source_position_vote,bl,bd,nb_replay
7hmd645t,1077,4278,14069,diss_Girl1.mp4,1644477563,1,,1,8,120,2
7hmd645t,1075,4281,14072,diss_building1.mp4,1644477589,1,,1,8,120,1
7hmd645t,1078,4279,14070,diss_ManRunning1.mp4,1644477610,1,,1,8,120,0
7hmd645t,1079,4283,14074,diss_truck3.mp4,1644477629,1,,1,8,120,1
7hmd645t,1076,4282,14073,diss_car11.mp4,1644477654,1,,1,8,120,1
7hmd645t,1080,4280,14071,diss_Walking.mp4,1644477676,1,,1,8,120,1
