timestamp,stimuli_id,mouseX,mouseY,stimuli
0,1080,612,370,diss_Walking.mp4
967,1080,576,335,diss_Walking.mp4
1728,1080,550,311,diss_Walking.mp4
2744,1080,534,312,diss_Walking.mp4
3626,1080,527,310,diss_Walking.mp4
3650,1080,523,310,diss_Walking.mp4
4422,1080,501,310,diss_Walking.mp4
5541,1080,471,314,diss_Walking.mp4
6261,1080,471,311,diss_Walking.mp4
6971,1080,451,287,diss_Walking.mp4
7853,1080,539,346,diss_Walking.mp4
8897,1080,596,368,diss_Walking.mp4
9605,1080,650,392,diss_Walking.mp4
11345,1080,699,376,diss_Walking.mp4
48010,1080,698,376,diss_Walking.mp4
48780,1080,665,376,diss_Walking.mp4
49687,1080,658,376,diss_Walking.mp4
49712,1080,657,376,diss_Walking.mp4
49937,1080,654,376,diss_Walking.mp4
51328,1080,654,380,diss_Walking.mp4
52010,1080,654,385,diss_Walking.mp4
71446,1080,652,385,diss_Walking.mp4
72328,1080,490,296,diss_Walking.mp4
73285,1080,395,210,diss_Walking.mp4
74031,1080,367,176,diss_Walking.mp4
75125,1080,269,171,diss_Walking.mp4
76031,1080,174,250,diss_Walking.mp4
77013,1080,111,345,diss_Walking.mp4
77026,1080,110,346,diss_Walking.mp4
77882,1080,110,398,diss_Walking.mp4
78766,1080,152,377,diss_Walking.mp4
79486,1080,229,319,diss_Walking.mp4
80418,1080,306,259,diss_Walking.mp4
81524,1080,448,105,diss_Walking.mp4
82257,1080,494,71,diss_Walking.mp4
83151,1080,588,20,diss_Walking.mp4
85002,1080,678,137,diss_Walking.mp4
86556,1080,699,215,diss_Walking.mp4
87476,1080,732,329,diss_Walking.mp4
89104,1080,695,426,diss_Walking.mp4
89973,1080,660,437,diss_Walking.mp4
90917,1080,612,444,diss_Walking.mp4
90930,1080,611,444,diss_Walking.mp4
93340,1080,582,312,diss_Walking.mp4
93665,1080,595,281,diss_Walking.mp4
95055,1080,619,288,diss_Walking.mp4
96186,1080,619,289,diss_Walking.mp4
96571,1080,625,322,diss_Walking.mp4
0,1080,638,367,diss_Walking.mp4
13,1080,638,366,diss_Walking.mp4
560,1080,649,310,diss_Walking.mp4
1528,1080,637,245,diss_Walking.mp4
2274,1080,636,176,diss_Walking.mp4
5367,1080,674,176,diss_Walking.mp4
6399,1080,707,260,diss_Walking.mp4
6462,1080,759,283,diss_Walking.mp4
7071,1080,697,211,diss_Walking.mp4
8898,1080,715,284,diss_Walking.mp4
9134,1080,719,284,diss_Walking.mp4
9319,1080,744,279,diss_Walking.mp4
11631,1080,689,239,diss_Walking.mp4
12475,1080,680,208,diss_Walking.mp4
13456,1080,640,190,diss_Walking.mp4
14339,1080,588,179,diss_Walking.mp4
14364,1080,587,179,diss_Walking.mp4
15309,1080,474,164,diss_Walking.mp4
16129,1080,364,170,diss_Walking.mp4
17060,1080,312,170,diss_Walking.mp4
17782,1080,269,173,diss_Walking.mp4
18725,1080,213,196,diss_Walking.mp4
19558,1080,180,227,diss_Walking.mp4
20427,1080,159,267,diss_Walking.mp4
21260,1080,101,302,diss_Walking.mp4
22291,1080,36,326,diss_Walking.mp4
23124,1080,29,346,diss_Walking.mp4
23497,1080,114,356,diss_Walking.mp4
24739,1080,201,326,diss_Walking.mp4
25621,1080,548,300,diss_Walking.mp4
26367,1080,965,290,diss_Walking.mp4
29896,1080,1172,7,diss_Walking.mp4
30790,1080,750,238,diss_Walking.mp4
31325,1080,561,310,diss_Walking.mp4
32207,1080,414,184,diss_Walking.mp4
32716,1080,261,285,diss_Walking.mp4
35040,1080,298,280,diss_Walking.mp4
37748,1080,474,241,diss_Walking.mp4
40543,1080,912,187,diss_Walking.mp4
41413,1080,1036,223,diss_Walking.mp4
42184,1080,1053,237,diss_Walking.mp4
43004,1080,996,251,diss_Walking.mp4
43090,1080,983,250,diss_Walking.mp4
47876,1080,980,250,diss_Walking.mp4
47889,1080,979,251,diss_Walking.mp4
48100,1080,894,271,diss_Walking.mp4
52736,1080,890,271,diss_Walking.mp4
52798,1080,877,272,diss_Walking.mp4
52961,1080,841,274,diss_Walking.mp4
56742,1080,840,274,diss_Walking.mp4
56755,1080,839,274,diss_Walking.mp4
56941,1080,794,279,diss_Walking.mp4
60555,1080,791,279,diss_Walking.mp4
60568,1080,789,279,diss_Walking.mp4
60729,1080,734,281,diss_Walking.mp4
79962,1080,733,281,diss_Walking.mp4
80135,1080,728,281,diss_Walking.mp4
81639,1080,724,282,diss_Walking.mp4
81664,1080,722,282,diss_Walking.mp4
81875,1080,712,284,diss_Walking.mp4
84178,1080,712,284,diss_Walking.mp4
0,1076,637,359,diss_car11.mp4
11,1076,637,358,diss_car11.mp4
37,1076,637,357,diss_car11.mp4
49,1076,636,357,diss_car11.mp4
73,1076,636,356,diss_car11.mp4
199,1076,635,356,diss_car11.mp4
336,1076,630,352,diss_car11.mp4
522,1076,633,348,diss_car11.mp4
22338,1076,481,340,diss_car11.mp4
22488,1076,363,327,diss_car11.mp4
23979,1076,152,389,diss_car11.mp4
25807,1076,26,666,diss_car11.mp4
25855,1076,30,679,diss_car11.mp4
26614,1076,157,541,diss_car11.mp4
27359,1076,375,369,diss_car11.mp4
28428,1076,506,300,diss_car11.mp4
29161,1076,610,354,diss_car11.mp4
30044,1076,687,427,diss_car11.mp4
30877,1076,745,478,diss_car11.mp4
32057,1076,901,430,diss_car11.mp4
32131,1076,919,432,diss_car11.mp4
32404,1076,952,466,diss_car11.mp4
33362,1076,1034,492,diss_car11.mp4
34605,1076,1067,442,diss_car11.mp4
35624,1076,1103,380,diss_car11.mp4
36407,1076,1097,316,diss_car11.mp4
37239,1076,969,291,diss_car11.mp4
38208,1076,866,270,diss_car11.mp4
39078,1076,805,264,diss_car11.mp4
39252,1076,766,269,diss_car11.mp4
40060,1076,728,297,diss_car11.mp4
40944,1076,645,364,diss_car11.mp4
42272,1076,645,367,diss_car11.mp4
42571,1076,639,388,diss_car11.mp4
43589,1076,632,412,diss_car11.mp4
45516,1076,630,460,diss_car11.mp4
46387,1076,638,460,diss_car11.mp4
47430,1076,644,447,diss_car11.mp4
48313,1076,657,419,diss_car11.mp4
49307,1076,669,378,diss_car11.mp4
89696,1076,687,353,diss_car11.mp4
90319,1076,735,343,diss_car11.mp4
91611,1076,734,341,diss_car11.mp4
92531,1076,680,328,diss_car11.mp4
92567,1076,677,329,diss_car11.mp4
92580,1076,676,330,diss_car11.mp4
93449,1076,651,348,diss_car11.mp4
94382,1076,550,592,diss_car11.mp4
95300,1076,575,645,diss_car11.mp4
98432,1076,649,719,diss_car11.mp4
99341,1076,616,638,diss_car11.mp4
99352,1076,616,635,diss_car11.mp4
100185,1076,597,591,diss_car11.mp4
101266,1076,588,578,diss_car11.mp4
102124,1076,563,562,diss_car11.mp4
0,1079,658,355,diss_truck3.mp4
12,1079,676,346,diss_truck3.mp4
1814,1079,714,31,diss_truck3.mp4
2734,1079,791,43,diss_truck3.mp4
3714,1079,748,115,diss_truck3.mp4
3728,1079,745,116,diss_truck3.mp4
4499,1079,724,139,diss_truck3.mp4
5433,1079,728,174,diss_truck3.mp4
6362,1079,500,160,diss_truck3.mp4
7196,1079,328,185,diss_truck3.mp4
8126,1079,1,224,diss_truck3.mp4
10575,1079,17,386,diss_truck3.mp4
11459,1079,193,359,diss_truck3.mp4
12179,1079,246,334,diss_truck3.mp4
13310,1079,243,360,diss_truck3.mp4
14093,1079,260,398,diss_truck3.mp4
14813,1079,402,440,diss_truck3.mp4
15995,1079,590,423,diss_truck3.mp4
16876,1079,650,430,diss_truck3.mp4
17274,1079,696,394,diss_truck3.mp4
18579,1079,702,398,diss_truck3.mp4
18590,1079,707,409,diss_truck3.mp4
19536,1079,767,541,diss_truck3.mp4
20494,1079,777,568,diss_truck3.mp4
20617,1079,780,572,diss_truck3.mp4
22158,1079,801,610,diss_truck3.mp4
22991,1079,813,629,diss_truck3.mp4
23787,1079,838,660,diss_truck3.mp4
24781,1079,868,691,diss_truck3.mp4
25439,1079,884,696,diss_truck3.mp4
26209,1079,908,696,diss_truck3.mp4
28052,1079,938,450,diss_truck3.mp4
28930,1079,899,280,diss_truck3.mp4
29651,1079,667,244,diss_truck3.mp4
30546,1079,531,271,diss_truck3.mp4
31453,1079,485,355,diss_truck3.mp4
32397,1079,531,383,diss_truck3.mp4
33205,1079,611,377,diss_truck3.mp4
34149,1079,647,364,diss_truck3.mp4
34176,1079,648,363,diss_truck3.mp4
46329,1079,628,358,diss_truck3.mp4
46888,1079,614,345,diss_truck3.mp4
48318,1079,609,345,diss_truck3.mp4
49089,1079,504,375,diss_truck3.mp4
50617,1079,504,372,diss_truck3.mp4
51163,1079,553,317,diss_truck3.mp4
52531,1079,553,316,diss_truck3.mp4
53239,1079,602,280,diss_truck3.mp4
54395,1079,604,275,diss_truck3.mp4
54842,1079,620,253,diss_truck3.mp4
89077,1079,620,254,diss_truck3.mp4
89413,1079,614,285,diss_truck3.mp4
90506,1079,609,309,diss_truck3.mp4
0,1075,665,430,diss_building1.mp4
856,1075,682,479,diss_building1.mp4
4576,1075,596,480,diss_building1.mp4
6847,1075,651,508,diss_building1.mp4
9469,1075,300,556,diss_building1.mp4
9593,1075,285,559,diss_building1.mp4
11607,1075,538,641,diss_building1.mp4
13496,1075,596,675,diss_building1.mp4
17435,1075,697,717,diss_building1.mp4
18518,1075,703,696,diss_building1.mp4
20629,1075,735,709,diss_building1.mp4
21810,1075,771,707,diss_building1.mp4
23624,1075,770,707,diss_building1.mp4
24519,1075,686,542,diss_building1.mp4
24531,1075,684,536,diss_building1.mp4
25488,1075,585,372,diss_building1.mp4
26035,1075,532,310,diss_building1.mp4
28061,1075,441,234,diss_building1.mp4
28906,1075,467,287,diss_building1.mp4
29738,1075,498,320,diss_building1.mp4
31031,1075,499,320,diss_building1.mp4
31180,1075,534,341,diss_building1.mp4
32410,1075,594,375,diss_building1.mp4
33579,1075,681,361,diss_building1.mp4
36912,1075,678,360,diss_building1.mp4
37321,1075,526,302,diss_building1.mp4
49488,1075,543,308,diss_building1.mp4
49774,1075,589,321,diss_building1.mp4
0,1078,627,385,diss_ManRunning1.mp4
12,1078,618,385,diss_ManRunning1.mp4
236,1078,558,388,diss_ManRunning1.mp4
1776,1078,493,328,diss_ManRunning1.mp4
2485,1078,490,272,diss_ManRunning1.mp4
2496,1078,490,268,diss_ManRunning1.mp4
5877,1078,1018,17,diss_ManRunning1.mp4
6759,1078,543,198,diss_ManRunning1.mp4
7680,1078,585,204,diss_ManRunning1.mp4
7692,1078,583,204,diss_ManRunning1.mp4
9988,1078,583,202,diss_ManRunning1.mp4
10212,1078,618,149,diss_ManRunning1.mp4
11530,1078,622,99,diss_ManRunning1.mp4
12784,1078,622,98,diss_ManRunning1.mp4
13281,1078,619,127,diss_ManRunning1.mp4
14288,1078,618,155,diss_ManRunning1.mp4
15393,1078,617,178,diss_ManRunning1.mp4
15423,1078,617,179,diss_ManRunning1.mp4
98951,1078,617,179,diss_ManRunning1.mp4
103067,1078,588,202,diss_ManRunning1.mp4
103987,1078,583,205,diss_ManRunning1.mp4
104832,1078,624,176,diss_ManRunning1.mp4
105615,1078,641,174,diss_ManRunning1.mp4
106131,1078,641,174,diss_ManRunning1.mp4
0,1077,743,272,diss_Girl1.mp4
2473,1077,741,3,diss_Girl1.mp4
3368,1077,952,96,diss_Girl1.mp4
3383,1077,953,96,diss_Girl1.mp4
4126,1077,986,141,diss_Girl1.mp4
4996,1077,842,257,diss_Girl1.mp4
6262,1077,739,348,diss_Girl1.mp4
7418,1077,686,345,diss_Girl1.mp4
8462,1077,724,292,diss_Girl1.mp4
9543,1077,960,335,diss_Girl1.mp4
10475,1077,1093,386,diss_Girl1.mp4
10723,1077,1168,422,diss_Girl1.mp4
12215,1077,1170,411,diss_Girl1.mp4
13084,1077,1156,381,diss_Girl1.mp4
13916,1077,1149,354,diss_Girl1.mp4
14077,1077,1146,318,diss_Girl1.mp4
15034,1077,1135,272,diss_Girl1.mp4
16277,1077,1132,262,diss_Girl1.mp4
17196,1077,1174,251,diss_Girl1.mp4
18115,1077,847,261,diss_Girl1.mp4
19022,1077,549,273,diss_Girl1.mp4
19669,1077,182,269,diss_Girl1.mp4
22128,1077,3,252,diss_Girl1.mp4
23048,1077,136,212,diss_Girl1.mp4
23856,1077,191,203,diss_Girl1.mp4
24625,1077,192,203,diss_Girl1.mp4
