verifToken,stimuli_id,source_id,media_a_id,source_a,created_at,source_name_vote,reversed,source_position_vote,bl,bd,nb_replay
n43rulzl,1100,5573,44543,diss_truck2.mp4,1646392596,1,,1,12,120,1
n43rulzl,1085,5565,44535,diss_building2.mp4,1646392646,1,,1,12,120,1
n43rulzl,1096,5572,44542,diss_person22.mp4,1646392669,1,,1,12,120,1
n43rulzl,1088,5568,44538,diss_car11.mp4,1646392681,1,,1,12,120,1
n43rulzl,1093,5555,44525,diss_Girl2.mp4,1646392691,1,,1,12,120,1
n43rulzl,1090,5570,44540,diss_car13.mp4,1646392706,1,,1,12,120,1
n43rulzl,1095,5557,44527,diss_ManRunning2.mp4,1646392720,1,,1,12,120,1
n43rulzl,1084,5564,44534,diss_building1.mp4,1646392745,1,,1,12,120,1
n43rulzl,1099,5560,44530,diss_StreetBasketball1.mp4,1646392768,1,,1,12,120,1
n43rulzl,1089,5569,44539,diss_car12.mp4,1646392787,1,,1,12,120,1
n43rulzl,1091,5571,44541,diss_car15.mp4,1646392803,1,,1,12,120,1
n43rulzl,1097,5558,44528,diss_Soccer1.mp4,1646392819,1,,1,12,120,1
n43rulzl,1086,5566,44536,diss_building3.mp4,1646392830,1,,1,12,120,1
n43rulzl,1082,5562,44532,diss_bike2.mp4,1646392851,1,,1,12,120,1
n43rulzl,1083,5563,44533,diss_bike3.mp4,1646392869,1,,1,12,120,1
n43rulzl,1087,5567,44537,diss_building4.mp4,1646392882,1,,1,12,120,1
n43rulzl,1102,5561,44531,diss_Walking.mp4,1646392893,1,,1,12,120,1
n43rulzl,1081,5553,44523,diss_Basketball.mp4,1646392914,1,,1,12,120,1
n43rulzl,1092,5554,44524,diss_Girl1.mp4,1646392933,1,,1,12,120,1
n43rulzl,1094,5556,44526,diss_ManRunning1.mp4,1646392954,1,,1,12,120,1
n43rulzl,1098,5559,44529,diss_Soccer2.mp4,1646392973,1,,1,12,120,1
n43rulzl,1101,5574,44544,diss_truck3.mp4,1646392997,1,,1,12,120,1
