verifToken,stimuli_id,source_id,media_a_id,source_a,created_at,source_name_vote,reversed,source_position_vote,bl,bd,nb_replay
ijih6csa,1064,4270,14061,diss_building3.mp4,1644424240,1,,1,8,120,0
ijih6csa,1067,4268,14059,diss_StreetBasketball1.mp4,1644424256,1,,1,8,120,1
ijih6csa,1066,4267,14058,diss_Girl2.mp4,1644424294,1,,1,8,120,0
ijih6csa,1065,4271,14062,diss_car15.mp4,1644424314,1,,1,8,120,0
ijih6csa,1068,4269,14060,diss_bike3.mp4,1644424333,1,,1,8,120,0
ijih6csa,1063,4269,14060,diss_bike3.mp4,1644424352,1,,1,8,120,0
