verifToken,stimuli_id,source_id,media_a_id,source_a,created_at,source_name_vote,reversed,source_position_vote,bl,bd,nb_replay
lk9stv1b,1078,4279,14070,diss_ManRunning1.mp4,1644477989,1,,1,8,120,0
lk9stv1b,1075,4281,14072,diss_building1.mp4,1644478011,1,,1,8,120,0
lk9stv1b,1077,4278,14069,diss_Girl1.mp4,1644478023,1,,1,8,120,1
lk9stv1b,1080,4280,14071,diss_Walking.mp4,1644478054,1,,1,8,120,0
lk9stv1b,1079,4283,14074,diss_truck3.mp4,1644478076,1,,1,8,120,0
lk9stv1b,1076,4282,14073,diss_car11.mp4,1644478091,1,,1,8,120,0
