verifToken,stimuli_id,source_id,media_a_id,source_a,created_at,source_name_vote,reversed,source_position_vote,bl,bd,nb_replay
ruktkfqy,1088,5568,44538,diss_car11.mp4,1644250975,1,,1,8,120,1
ruktkfqy,1096,5572,44542,diss_person22.mp4,1644251006,1,,1,8,120,1
ruktkfqy,1099,5560,44530,diss_StreetBasketball1.mp4,1644251015,1,,1,8,120,1
ruktkfqy,1097,5558,44528,diss_Soccer1.mp4,1644251029,1,,1,8,120,1
ruktkfqy,1092,5554,44524,diss_Girl1.mp4,1644251040,1,,1,8,120,1
ruktkfqy,1083,5563,44533,diss_bike3.mp4,1644251066,1,,1,8,120,1
ruktkfqy,1090,5570,44540,diss_car13.mp4,1644251089,1,,1,8,120,1
ruktkfqy,1089,5569,44539,diss_car12.mp4,1644251101,1,,1,8,120,1
ruktkfqy,1091,5571,44541,diss_car15.mp4,1644251111,1,,1,8,120,1
ruktkfqy,1084,5564,44534,diss_building1.mp4,1644251129,1,,1,8,120,1
ruktkfqy,1081,5553,44523,diss_Basketball.mp4,1644251147,1,,1,8,120,1
ruktkfqy,1086,5566,44536,diss_building3.mp4,1644251164,1,,1,8,120,1
ruktkfqy,1102,5561,44531,diss_Walking.mp4,1644251181,1,,1,8,120,1
ruktkfqy,1082,5562,44532,diss_bike2.mp4,1644251202,1,,1,8,120,1
ruktkfqy,1098,5559,44529,diss_Soccer2.mp4,1644251221,1,,1,8,120,1
ruktkfqy,1101,5574,44544,diss_truck3.mp4,1644251241,1,,1,8,120,1
ruktkfqy,1100,5573,44543,diss_truck2.mp4,1644251260,1,,1,8,120,1
ruktkfqy,1085,5565,44535,diss_building2.mp4,1644251279,1,,1,8,120,1
ruktkfqy,1095,5557,44527,diss_ManRunning2.mp4,1644251298,1,,1,8,120,1
ruktkfqy,1094,5556,44526,diss_ManRunning1.mp4,1644251317,1,,1,8,120,1
ruktkfqy,1087,5567,44537,diss_building4.mp4,1644251334,1,,1,8,120,1
ruktkfqy,1093,5555,44525,diss_Girl2.mp4,1644251366,1,,1,8,120,1
