verifToken,stimuli_id,source_id,media_a_id,source_a,created_at,source_name_vote,reversed,source_position_vote,bl,bd,nb_replay
64opikpi,1068,4269,14060,diss_bike3.mp4,1644424175,1,,1,8,120,0
64opikpi,1064,4270,14061,diss_building3.mp4,1644424207,1,,1,8,120,0
64opikpi,1065,4271,14062,diss_car15.mp4,1644424226,1,,1,8,120,1
64opikpi,1063,4269,14060,diss_bike3.mp4,1644424265,1,,1,8,120,0
64opikpi,1066,4267,14058,diss_Girl2.mp4,1644424290,1,,1,8,120,1
64opikpi,1067,4268,14059,diss_StreetBasketball1.mp4,1644424366,1,,1,8,120,0
