timestamp,stimuli_id,mouseX,mouseY,stimuli
0,1066,630.3333320617676,410,diss_Girl2.mp4
72,1066,630.3333320617676,408,diss_Girl2.mp4
152,1066,629.3333320617676,405,diss_Girl2.mp4
224,1066,626.3333320617676,398,diss_Girl2.mp4
296,1066,622.3333320617676,391,diss_Girl2.mp4
336,1066,620.3333320617676,384,diss_Girl2.mp4
432,1066,618.3333320617676,380,diss_Girl2.mp4
688,1066,615.3333320617676,382,diss_Girl2.mp4
744,1066,611.3333320617676,388,diss_Girl2.mp4
816,1066,604.3333320617676,402,diss_Girl2.mp4
888,1066,598.3333320617676,417,diss_Girl2.mp4
944,1066,593.3333320617676,423,diss_Girl2.mp4
1008,1066,591.3333320617676,426,diss_Girl2.mp4
1064,1066,589.3333320617676,427,diss_Girl2.mp4
1176,1066,584.3333320617676,430,diss_Girl2.mp4
1247,1066,583.3333320617676,430,diss_Girl2.mp4
1360,1066,582.3333320617676,430,diss_Girl2.mp4
1736,1066,580.3333320617676,430,diss_Girl2.mp4
1832,1066,579.3333320617676,427,diss_Girl2.mp4
1944,1066,576.3333320617676,424,diss_Girl2.mp4
2006,1066,575.3333320617676,424,diss_Girl2.mp4
2168,1066,573.3333320617676,423,diss_Girl2.mp4
2224,1066,570.3333320617676,422,diss_Girl2.mp4
2258,1066,568.3333320617676,422,diss_Girl2.mp4
2368,1066,550.3333320617676,424,diss_Girl2.mp4
2432,1066,536.3333320617676,430,diss_Girl2.mp4
2568,1066,518.3333320617676,436,diss_Girl2.mp4
2592,1066,516.3333320617676,436,diss_Girl2.mp4
2696,1066,516.3333320617676,436,diss_Girl2.mp4
2832,1066,573.3333320617676,411,diss_Girl2.mp4
2888,1066,606.3333320617676,400,diss_Girl2.mp4
2960,1066,626.3333320617676,395,diss_Girl2.mp4
3032,1066,636.3333320617676,393,diss_Girl2.mp4
3104,1066,655.3333320617676,388,diss_Girl2.mp4
3121,1066,656.3333320617676,388,diss_Girl2.mp4
3144,1066,659.3333320617676,388,diss_Girl2.mp4
3433,1066,651.3333320617676,390,diss_Girl2.mp4
3489,1066,643.3333320617676,391,diss_Girl2.mp4
3521,1066,641.3333320617676,391,diss_Girl2.mp4
0,1066,638.3333320617676,410,diss_Girl2.mp4
8,1066,636.3333320617676,410,diss_Girl2.mp4
80,1066,595.3333320617676,381,diss_Girl2.mp4
152,1066,571.3333320617676,351,diss_Girl2.mp4
224,1066,589.3333320617676,298,diss_Girl2.mp4
288,1066,604.3333320617676,260,diss_Girl2.mp4
304,1066,605.3333320617676,256,diss_Girl2.mp4
360,1066,608.3333320617676,250,diss_Girl2.mp4
432,1066,620.3333320617676,252,diss_Girl2.mp4
504,1066,690.3333320617676,318,diss_Girl2.mp4
568,1066,791.3333320617676,400,diss_Girl2.mp4
688,1066,824.3333320617676,440,diss_Girl2.mp4
720,1066,825.3333320617676,441,diss_Girl2.mp4
840,1066,825.3333320617676,438,diss_Girl2.mp4
888,1066,825.3333320617676,431,diss_Girl2.mp4
976,1066,829.3333320617676,426,diss_Girl2.mp4
1048,1066,845.3333320617676,416,diss_Girl2.mp4
1120,1066,851.3333320617676,406,diss_Girl2.mp4
1192,1066,851.3333320617676,395,diss_Girl2.mp4
1256,1066,835.3333320617676,384,diss_Girl2.mp4
1328,1066,798.3333320617676,368,diss_Girl2.mp4
1384,1066,758.3333320617676,356,diss_Girl2.mp4
1456,1066,718.3333320617676,348,diss_Girl2.mp4
1528,1066,690.3333320617676,343,diss_Girl2.mp4
1672,1066,642.3333320617676,343,diss_Girl2.mp4
1720,1066,619.3333320617676,343,diss_Girl2.mp4
1792,1066,585.3333320617676,343,diss_Girl2.mp4
1896,1066,472.3333320617676,343,diss_Girl2.mp4
2040,1066,432.3333320617676,343,diss_Girl2.mp4
2112,1066,379.3333320617676,346,diss_Girl2.mp4
2184,1066,306.3333320617676,357,diss_Girl2.mp4
2248,1066,252.3333320617676,367,diss_Girl2.mp4
2320,1066,210.3333320617676,372,diss_Girl2.mp4
2384,1066,199.3333320617676,373,diss_Girl2.mp4
2405,1066,198.3333320617676,373,diss_Girl2.mp4
2648,1066,203.3333320617676,371,diss_Girl2.mp4
2705,1066,210.3333320617676,366,diss_Girl2.mp4
2745,1066,211.3333320617676,364,diss_Girl2.mp4
2848,1066,213.3333320617676,356,diss_Girl2.mp4
2912,1066,220.3333320617676,342,diss_Girl2.mp4
2992,1066,245.3333320617676,325,diss_Girl2.mp4
3072,1066,258.3333320617676,321,diss_Girl2.mp4
3104,1066,260.3333320617676,320,diss_Girl2.mp4
3176,1066,263.3333320617676,320,diss_Girl2.mp4
3352,1066,274.3333320617676,323,diss_Girl2.mp4
3392,1066,275.3333320617676,323,diss_Girl2.mp4
3832,1066,270.3333320617676,324,diss_Girl2.mp4
3840,1066,269.3333320617676,324,diss_Girl2.mp4
3920,1066,249.3333320617676,328,diss_Girl2.mp4
3968,1066,238.3333320617676,331,diss_Girl2.mp4
4056,1066,229.3333320617676,332,diss_Girl2.mp4
4120,1066,225.3333320617676,332,diss_Girl2.mp4
4192,1066,224.3333320617676,332,diss_Girl2.mp4
4392,1066,229.3333320617676,325,diss_Girl2.mp4
4448,1066,242.3333320617676,315,diss_Girl2.mp4
4528,1066,254.3333320617676,307,diss_Girl2.mp4
4592,1066,260.3333320617676,303,diss_Girl2.mp4
4664,1066,263.3333320617676,301,diss_Girl2.mp4
4704,1066,264.3333320617676,301,diss_Girl2.mp4
4800,1066,268.3333320617676,301,diss_Girl2.mp4
4872,1066,272.3333320617676,301,diss_Girl2.mp4
4928,1066,279.3333320617676,304,diss_Girl2.mp4
5064,1066,290.3333320617676,315,diss_Girl2.mp4
5088,1066,291.3333320617676,317,diss_Girl2.mp4
5200,1066,291.3333320617676,320,diss_Girl2.mp4
5280,1066,282.3333320617676,324,diss_Girl2.mp4
5336,1066,272.3333320617676,327,diss_Girl2.mp4
5416,1066,271.3333320617676,331,diss_Girl2.mp4
5488,1066,309.3333320617676,342,diss_Girl2.mp4
5552,1066,384.3333320617676,356,diss_Girl2.mp4
5624,1066,485.3333320617676,367,diss_Girl2.mp4
5696,1066,549.3333320617676,367,diss_Girl2.mp4
5760,1066,583.3333320617676,367,diss_Girl2.mp4
5832,1066,616.3333320617676,362,diss_Girl2.mp4
5896,1066,636.3333320617676,357,diss_Girl2.mp4
5968,1066,656.3333320617676,354,diss_Girl2.mp4
6032,1066,662.3333320617676,351,diss_Girl2.mp4
6072,1066,663.3333320617676,350,diss_Girl2.mp4
6168,1066,668.3333320617676,345,diss_Girl2.mp4
6232,1066,666.3333320617676,340,diss_Girl2.mp4
6304,1066,646.3333320617676,333,diss_Girl2.mp4
6368,1066,623.3333320617676,328,diss_Girl2.mp4
6440,1066,608.3333320617676,322,diss_Girl2.mp4
6512,1066,606.3333320617676,320,diss_Girl2.mp4
6648,1066,848.3333320617676,285,diss_Girl2.mp4
6720,1066,984.3333320617676,283,diss_Girl2.mp4
6777,1066,1016.3333320617676,274,diss_Girl2.mp4
6800,1066,1022.3333320617676,268,diss_Girl2.mp4
6856,1066,1035.3333320617676,254,diss_Girl2.mp4
6920,1066,1048.3333320617676,241,diss_Girl2.mp4
6992,1066,1063.3333320617676,228,diss_Girl2.mp4
7056,1066,1074.3333320617676,218,diss_Girl2.mp4
7128,1066,1078.3333320617676,212,diss_Girl2.mp4
7200,1066,1070.3333320617676,210,diss_Girl2.mp4
7328,1066,1038.3333320617676,216,diss_Girl2.mp4
7464,1066,1025.3333320617676,222,diss_Girl2.mp4
7520,1066,1021.3333320617676,225,diss_Girl2.mp4
7592,1066,1018.3333320617676,230,diss_Girl2.mp4
7712,1066,1010.3333320617676,233,diss_Girl2.mp4
7728,1066,1008.3333320617676,234,diss_Girl2.mp4
7864,1066,994.3333320617676,234,diss_Girl2.mp4
7928,1066,979.3333320617676,236,diss_Girl2.mp4
8000,1066,971.3333320617676,237,diss_Girl2.mp4
8065,1066,968.3333320617676,238,diss_Girl2.mp4
8200,1066,965.3333320617676,238,diss_Girl2.mp4
8272,1066,961.3333320617676,238,diss_Girl2.mp4
8408,1066,955.3333320617676,241,diss_Girl2.mp4
8464,1066,951.3333320617676,241,diss_Girl2.mp4
8504,1066,949.3333320617676,242,diss_Girl2.mp4
8568,1066,948.3333320617676,242,diss_Girl2.mp4
8656,1066,945.3333320617676,242,diss_Girl2.mp4
9041,1066,943.3333320617676,241,diss_Girl2.mp4
9065,1066,942.3333320617676,240,diss_Girl2.mp4
9129,1066,939.3333320617676,235,diss_Girl2.mp4
9193,1066,933.3333320617676,234,diss_Girl2.mp4
9265,1066,925.3333320617676,234,diss_Girl2.mp4
9313,1066,924.3333320617676,234,diss_Girl2.mp4
9393,1066,922.3333320617676,233,diss_Girl2.mp4
9449,1066,921.3333320617676,233,diss_Girl2.mp4
9521,1066,919.3333320617676,232,diss_Girl2.mp4
9673,1066,915.3333320617676,230,diss_Girl2.mp4
9737,1066,911.3333320617676,230,diss_Girl2.mp4
9785,1066,908.3333320617676,230,diss_Girl2.mp4
9873,1066,904.3333320617676,228,diss_Girl2.mp4
9985,1066,900.3333320617676,227,diss_Girl2.mp4
10145,1066,896.3333320617676,225,diss_Girl2.mp4
10201,1066,895.3333320617676,225,diss_Girl2.mp4
10345,1066,892.3333320617676,224,diss_Girl2.mp4
10393,1066,891.3333320617676,224,diss_Girl2.mp4
10481,1066,890.3333320617676,224,diss_Girl2.mp4
10657,1066,889.3333320617676,220,diss_Girl2.mp4
10705,1066,889.3333320617676,215,diss_Girl2.mp4
10785,1066,891.3333320617676,206,diss_Girl2.mp4
10921,1066,893.3333320617676,194,diss_Girl2.mp4
11073,1066,893.3333320617676,185,diss_Girl2.mp4
11121,1066,891.3333320617676,183,diss_Girl2.mp4
11185,1066,885.3333320617676,181,diss_Girl2.mp4
11265,1066,871.3333320617676,176,diss_Girl2.mp4
11329,1066,859.3333320617676,174,diss_Girl2.mp4
11393,1066,849.3333320617676,173,diss_Girl2.mp4
11457,1066,844.3333320617676,173,diss_Girl2.mp4
11513,1066,842.3333320617676,173,diss_Girl2.mp4
11561,1066,841.3333320617676,173,diss_Girl2.mp4
11737,1066,838.3333320617676,177,diss_Girl2.mp4
11801,1066,834.3333320617676,191,diss_Girl2.mp4
11865,1066,834.3333320617676,206,diss_Girl2.mp4
11993,1066,838.3333320617676,223,diss_Girl2.mp4
12065,1066,838.3333320617676,231,diss_Girl2.mp4
12121,1066,838.3333320617676,238,diss_Girl2.mp4
12201,1066,858.3333320617676,251,diss_Girl2.mp4
12265,1066,884.3333320617676,257,diss_Girl2.mp4
12337,1066,915.3333320617676,270,diss_Girl2.mp4
12465,1066,963.3333320617676,280,diss_Girl2.mp4
12537,1066,1016.3333320617676,283,diss_Girl2.mp4
12673,1066,1102.3333320617676,280,diss_Girl2.mp4
12729,1066,1109.3333320617676,276,diss_Girl2.mp4
12793,1066,1113.3333320617676,274,diss_Girl2.mp4
12865,1066,1120.3333320617676,273,diss_Girl2.mp4
12937,1066,1126.3333320617676,267,diss_Girl2.mp4
13017,1066,1130.3333320617676,264,diss_Girl2.mp4
13073,1066,1136.3333320617676,261,diss_Girl2.mp4
13145,1066,1150.3333320617676,254,diss_Girl2.mp4
13209,1066,1153.3333320617676,243,diss_Girl2.mp4
13281,1066,1153.3333320617676,234,diss_Girl2.mp4
13345,1066,1152.3333320617676,226,diss_Girl2.mp4
13417,1066,1148.3333320617676,218,diss_Girl2.mp4
13489,1066,1148.3333320617676,213,diss_Girl2.mp4
13561,1066,1148.3333320617676,210,diss_Girl2.mp4
13697,1066,1125.3333320617676,212,diss_Girl2.mp4
13753,1066,1073.3333320617676,230,diss_Girl2.mp4
13817,1066,985.3333320617676,264,diss_Girl2.mp4
13953,1066,792.3333320617676,336,diss_Girl2.mp4
14009,1066,768.3333320617676,345,diss_Girl2.mp4
14081,1066,761.3333320617676,347,diss_Girl2.mp4
14217,1066,741.3333320617676,343,diss_Girl2.mp4
14289,1066,720.3333320617676,336,diss_Girl2.mp4
14353,1066,708.3333320617676,333,diss_Girl2.mp4
14425,1066,698.3333320617676,332,diss_Girl2.mp4
14497,1066,679.3333320617676,334,diss_Girl2.mp4
14561,1066,655.3333320617676,336,diss_Girl2.mp4
14633,1066,572.3333320617676,345,diss_Girl2.mp4
14689,1066,456.3333320617676,368,diss_Girl2.mp4
14761,1066,276.3333320617676,397,diss_Girl2.mp4
14833,1066,154.33333206176758,397,diss_Girl2.mp4
14897,1066,93.33333206176758,397,diss_Girl2.mp4
15025,1066,72.33333206176758,397,diss_Girl2.mp4
15097,1066,65.33333206176758,395,diss_Girl2.mp4
15177,1066,60.33333206176758,391,diss_Girl2.mp4
15233,1066,55.33333206176758,387,diss_Girl2.mp4
15305,1066,51.33333206176758,378,diss_Girl2.mp4
15385,1066,55.33333206176758,356,diss_Girl2.mp4
15393,1066,58.33333206176758,353,diss_Girl2.mp4
15449,1066,71.33333206176758,343,diss_Girl2.mp4
15457,1066,74.33333206176758,342,diss_Girl2.mp4
15521,1066,95.33333206176758,341,diss_Girl2.mp4
15593,1066,102.33333206176758,341,diss_Girl2.mp4
15657,1066,108.33333206176758,341,diss_Girl2.mp4
15729,1066,120.33333206176758,342,diss_Girl2.mp4
15801,1066,136.33333206176758,338,diss_Girl2.mp4
15929,1066,150.33333206176758,334,diss_Girl2.mp4
15985,1066,152.33333206176758,333,diss_Girl2.mp4
16113,1066,154.33333206176758,331,diss_Girl2.mp4
16193,1066,155.33333206176758,327,diss_Girl2.mp4
16265,1066,158.33333206176758,320,diss_Girl2.mp4
16329,1066,162.33333206176758,308,diss_Girl2.mp4
16401,1066,164.33333206176758,303,diss_Girl2.mp4
16465,1066,168.33333206176758,296,diss_Girl2.mp4
16593,1066,169.33333206176758,294,diss_Girl2.mp4
16729,1066,173.33333206176758,288,diss_Girl2.mp4
16809,1066,176.33333206176758,285,diss_Girl2.mp4
16841,1066,178.33333206176758,285,diss_Girl2.mp4
17025,1066,178.33333206176758,284,diss_Girl2.mp4
17097,1066,179.33333206176758,284,diss_Girl2.mp4
17385,1066,180.3333320617676,284,diss_Girl2.mp4
17497,1066,180.3333320617676,286,diss_Girl2.mp4
17633,1066,180.3333320617676,293,diss_Girl2.mp4
17690,1066,179.33333206176758,297,diss_Girl2.mp4
17753,1066,176.33333206176758,301,diss_Girl2.mp4
17810,1066,176.33333206176758,302,diss_Girl2.mp4
17882,1066,174.33333206176758,303,diss_Girl2.mp4
17969,1066,172.33333206176758,305,diss_Girl2.mp4
18098,1066,162.33333206176758,310,diss_Girl2.mp4
18177,1066,152.33333206176758,316,diss_Girl2.mp4
18241,1066,138.33333206176758,327,diss_Girl2.mp4
18313,1066,118.33333206176758,341,diss_Girl2.mp4
18385,1066,111.33333206176758,345,diss_Girl2.mp4
18473,1066,109.33333206176758,347,diss_Girl2.mp4
18577,1066,108.33333206176758,350,diss_Girl2.mp4
18641,1066,106.33333206176758,352,diss_Girl2.mp4
18713,1066,108.33333206176758,358,diss_Girl2.mp4
18721,1066,108.33333206176758,361,diss_Girl2.mp4
18857,1066,139.33333206176758,413,diss_Girl2.mp4
18930,1066,211.3333320617676,483,diss_Girl2.mp4
19001,1066,465.3333320617676,651,diss_Girl2.mp4
19057,1066,688.3333320617676,753,diss_Girl2.mp4
19377,1066,994.3333320617676,751,diss_Girl2.mp4
19433,1066,1028.3333320617676,706,diss_Girl2.mp4
19441,1066,1033.3333320617676,700,diss_Girl2.mp4
19586,1066,1112.3333320617676,597,diss_Girl2.mp4
19650,1066,1141.3333320617676,535,diss_Girl2.mp4
19785,1066,1178.3333320617676,421,diss_Girl2.mp4
19858,1066,1170.3333320617676,375,diss_Girl2.mp4
19922,1066,1142.3333320617676,347,diss_Girl2.mp4
19994,1066,1102.3333320617676,340,diss_Girl2.mp4
20066,1066,1069.3333320617676,332,diss_Girl2.mp4
20138,1066,1023.3333320617676,325,diss_Girl2.mp4
20202,1066,994.3333320617676,317,diss_Girl2.mp4
20274,1066,976.3333320617676,314,diss_Girl2.mp4
20338,1066,953.3333320617676,314,diss_Girl2.mp4
20410,1066,898.3333320617676,324,diss_Girl2.mp4
20482,1066,861.3333320617676,333,diss_Girl2.mp4
20546,1066,854.3333320617676,334,diss_Girl2.mp4
20570,1066,853.3333320617676,334,diss_Girl2.mp4
20674,1066,851.3333320617676,334,diss_Girl2.mp4
20730,1066,843.3333320617676,334,diss_Girl2.mp4
0,1067,625.3333320617676,420,diss_StreetBasketball1.mp4
56,1067,632.3333320617676,436,diss_StreetBasketball1.mp4
136,1067,645.3333320617676,462,diss_StreetBasketball1.mp4
200,1067,651.3333320617676,474,diss_StreetBasketball1.mp4
272,1067,650.3333320617676,483,diss_StreetBasketball1.mp4
336,1067,642.3333320617676,505,diss_StreetBasketball1.mp4
408,1067,638.3333320617676,526,diss_StreetBasketball1.mp4
480,1067,634.3333320617676,538,diss_StreetBasketball1.mp4
544,1067,634.3333320617676,544,diss_StreetBasketball1.mp4
616,1067,634.3333320617676,553,diss_StreetBasketball1.mp4
688,1067,634.3333320617676,564,diss_StreetBasketball1.mp4
736,1067,633.3333320617676,568,diss_StreetBasketball1.mp4
825,1067,633.3333320617676,572,diss_StreetBasketball1.mp4
880,1067,633.3333320617676,576,diss_StreetBasketball1.mp4
952,1067,633.3333320617676,581,diss_StreetBasketball1.mp4
1032,1067,624.3333320617676,582,diss_StreetBasketball1.mp4
1105,1067,594.3333320617676,582,diss_StreetBasketball1.mp4
1169,1067,536.3333320617676,582,diss_StreetBasketball1.mp4
1241,1067,479.3333320617676,582,diss_StreetBasketball1.mp4
1313,1067,426.3333320617676,582,diss_StreetBasketball1.mp4
1385,1067,382.3333320617676,582,diss_StreetBasketball1.mp4
1449,1067,359.3333320617676,578,diss_StreetBasketball1.mp4
1513,1067,348.3333320617676,576,diss_StreetBasketball1.mp4
1545,1067,345.3333320617676,575,diss_StreetBasketball1.mp4
1585,1067,344.3333320617676,575,diss_StreetBasketball1.mp4
1713,1067,344.3333320617676,570,diss_StreetBasketball1.mp4
1841,1067,353.3333320617676,556,diss_StreetBasketball1.mp4
1921,1067,356.3333320617676,553,diss_StreetBasketball1.mp4
1993,1067,360.3333320617676,544,diss_StreetBasketball1.mp4
2065,1067,375.3333320617676,473,diss_StreetBasketball1.mp4
2129,1067,401.3333320617676,414,diss_StreetBasketball1.mp4
2201,1067,416.3333320617676,366,diss_StreetBasketball1.mp4
2273,1067,422.3333320617676,335,diss_StreetBasketball1.mp4
2337,1067,422.3333320617676,321,diss_StreetBasketball1.mp4
2401,1067,421.3333320617676,305,diss_StreetBasketball1.mp4
2481,1067,416.3333320617676,292,diss_StreetBasketball1.mp4
2553,1067,401.3333320617676,284,diss_StreetBasketball1.mp4
2601,1067,395.3333320617676,280,diss_StreetBasketball1.mp4
2641,1067,396.3333320617676,281,diss_StreetBasketball1.mp4
2825,1067,398.3333320617676,282,diss_StreetBasketball1.mp4
2889,1067,403.3333320617676,283,diss_StreetBasketball1.mp4
2961,1067,442.3333320617676,306,diss_StreetBasketball1.mp4
3001,1067,453.3333320617676,314,diss_StreetBasketball1.mp4
3097,1067,433.3333320617676,323,diss_StreetBasketball1.mp4
3169,1067,375.3333320617676,331,diss_StreetBasketball1.mp4
3241,1067,323.3333320617676,331,diss_StreetBasketball1.mp4
3297,1067,311.3333320617676,331,diss_StreetBasketball1.mp4
3369,1067,303.3333320617676,324,diss_StreetBasketball1.mp4
3393,1067,302.3333320617676,323,diss_StreetBasketball1.mp4
3513,1067,334.3333320617676,356,diss_StreetBasketball1.mp4
3577,1067,386.3333320617676,417,diss_StreetBasketball1.mp4
3713,1067,451.3333320617676,455,diss_StreetBasketball1.mp4
3777,1067,456.3333320617676,456,diss_StreetBasketball1.mp4
3857,1067,461.3333320617676,456,diss_StreetBasketball1.mp4
3913,1067,463.3333320617676,456,diss_StreetBasketball1.mp4
3985,1067,472.3333320617676,456,diss_StreetBasketball1.mp4
4065,1067,478.3333320617676,456,diss_StreetBasketball1.mp4
4113,1067,482.3333320617676,455,diss_StreetBasketball1.mp4
4338,1067,483.3333320617676,462,diss_StreetBasketball1.mp4
4353,1067,483.3333320617676,467,diss_StreetBasketball1.mp4
4417,1067,486.3333320617676,487,diss_StreetBasketball1.mp4
4489,1067,491.3333320617676,510,diss_StreetBasketball1.mp4
4561,1067,499.3333320617676,522,diss_StreetBasketball1.mp4
4617,1067,503.3333320617676,525,diss_StreetBasketball1.mp4
4697,1067,510.3333320617676,525,diss_StreetBasketball1.mp4
4761,1067,528.3333320617676,518,diss_StreetBasketball1.mp4
4769,1067,532.3333320617676,516,diss_StreetBasketball1.mp4
4833,1067,555.3333320617676,506,diss_StreetBasketball1.mp4
4889,1067,566.3333320617676,502,diss_StreetBasketball1.mp4
4969,1067,576.3333320617676,497,diss_StreetBasketball1.mp4
5041,1067,581.3333320617676,495,diss_StreetBasketball1.mp4
5113,1067,586.3333320617676,492,diss_StreetBasketball1.mp4
5169,1067,590.3333320617676,491,diss_StreetBasketball1.mp4
5241,1067,598.3333320617676,490,diss_StreetBasketball1.mp4
5313,1067,611.3333320617676,486,diss_StreetBasketball1.mp4
5361,1067,620.3333320617676,484,diss_StreetBasketball1.mp4
5513,1067,631.3333320617676,481,diss_StreetBasketball1.mp4
5561,1067,633.3333320617676,480,diss_StreetBasketball1.mp4
5625,1067,635.3333320617676,478,diss_StreetBasketball1.mp4
5697,1067,639.3333320617676,477,diss_StreetBasketball1.mp4
5777,1067,642.3333320617676,476,diss_StreetBasketball1.mp4
5913,1067,648.3333320617676,472,diss_StreetBasketball1.mp4
5977,1067,656.3333320617676,455,diss_StreetBasketball1.mp4
6041,1067,690.3333320617676,370,diss_StreetBasketball1.mp4
6121,1067,714.3333320617676,278,diss_StreetBasketball1.mp4
6249,1067,736.3333320617676,227,diss_StreetBasketball1.mp4
6321,1067,752.3333320617676,207,diss_StreetBasketball1.mp4
6393,1067,765.3333320617676,193,diss_StreetBasketball1.mp4
6465,1067,771.3333320617676,188,diss_StreetBasketball1.mp4
6537,1067,781.3333320617676,184,diss_StreetBasketball1.mp4
6593,1067,788.3333320617676,180,diss_StreetBasketball1.mp4
6665,1067,791.3333320617676,178,diss_StreetBasketball1.mp4
6777,1067,792.3333320617676,178,diss_StreetBasketball1.mp4
6849,1067,795.3333320617676,178,diss_StreetBasketball1.mp4
6873,1067,796.3333320617676,178,diss_StreetBasketball1.mp4
6929,1067,799.3333320617676,188,diss_StreetBasketball1.mp4
7001,1067,802.3333320617676,206,diss_StreetBasketball1.mp4
7073,1067,804.3333320617676,212,diss_StreetBasketball1.mp4
7137,1067,806.3333320617676,213,diss_StreetBasketball1.mp4
0,1067,633.3333320617676,413,diss_StreetBasketball1.mp4
8,1067,636.3333320617676,407,diss_StreetBasketball1.mp4
88,1067,694.3333320617676,320,diss_StreetBasketball1.mp4
160,1067,743.3333320617676,273,diss_StreetBasketball1.mp4
216,1067,753.3333320617676,258,diss_StreetBasketball1.mp4
304,1067,752.3333320617676,258,diss_StreetBasketball1.mp4
360,1067,711.3333320617676,316,diss_StreetBasketball1.mp4
432,1067,648.3333320617676,397,diss_StreetBasketball1.mp4
488,1067,621.3333320617676,431,diss_StreetBasketball1.mp4
560,1067,605.3333320617676,458,diss_StreetBasketball1.mp4
696,1067,610.3333320617676,486,diss_StreetBasketball1.mp4
760,1067,640.3333320617676,493,diss_StreetBasketball1.mp4
824,1067,678.3333320617676,494,diss_StreetBasketball1.mp4
888,1067,699.3333320617676,500,diss_StreetBasketball1.mp4
960,1067,713.3333320617676,503,diss_StreetBasketball1.mp4
1096,1067,740.3333320617676,503,diss_StreetBasketball1.mp4
1152,1067,748.3333320617676,503,diss_StreetBasketball1.mp4
1192,1067,750.3333320617676,503,diss_StreetBasketball1.mp4
1288,1067,741.3333320617676,506,diss_StreetBasketball1.mp4
1360,1067,716.3333320617676,516,diss_StreetBasketball1.mp4
1424,1067,706.3333320617676,521,diss_StreetBasketball1.mp4
1688,1067,705.3333320617676,521,diss_StreetBasketball1.mp4
1768,1067,671.3333320617676,526,diss_StreetBasketball1.mp4
1776,1067,662.3333320617676,528,diss_StreetBasketball1.mp4
1848,1067,560.3333320617676,542,diss_StreetBasketball1.mp4
1912,1067,479.3333320617676,518,diss_StreetBasketball1.mp4
1984,1067,441.3333320617676,491,diss_StreetBasketball1.mp4
2048,1067,424.3333320617676,478,diss_StreetBasketball1.mp4
2128,1067,419.3333320617676,475,diss_StreetBasketball1.mp4
2192,1067,400.3333320617676,473,diss_StreetBasketball1.mp4
2200,1067,395.3333320617676,473,diss_StreetBasketball1.mp4
2264,1067,354.3333320617676,478,diss_StreetBasketball1.mp4
2336,1067,324.3333320617676,487,diss_StreetBasketball1.mp4
2392,1067,319.3333320617676,487,diss_StreetBasketball1.mp4
2481,1067,303.3333320617676,495,diss_StreetBasketball1.mp4
2536,1067,292.3333320617676,500,diss_StreetBasketball1.mp4
2680,1067,288.3333320617676,488,diss_StreetBasketball1.mp4
2729,1067,285.3333320617676,486,diss_StreetBasketball1.mp4
2760,1067,285.3333320617676,485,diss_StreetBasketball1.mp4
2936,1067,281.3333320617676,484,diss_StreetBasketball1.mp4
3008,1067,274.3333320617676,484,diss_StreetBasketball1.mp4
3080,1067,269.3333320617676,484,diss_StreetBasketball1.mp4
3152,1067,253.3333320617676,458,diss_StreetBasketball1.mp4
3224,1067,252.3333320617676,430,diss_StreetBasketball1.mp4
3296,1067,255.3333320617676,417,diss_StreetBasketball1.mp4
3312,1067,260.3333320617676,412,diss_StreetBasketball1.mp4
3368,1067,269.3333320617676,404,diss_StreetBasketball1.mp4
3432,1067,275.3333320617676,402,diss_StreetBasketball1.mp4
3504,1067,288.3333320617676,401,diss_StreetBasketball1.mp4
3568,1067,301.3333320617676,406,diss_StreetBasketball1.mp4
3640,1067,305.3333320617676,407,diss_StreetBasketball1.mp4
3704,1067,319.3333320617676,394,diss_StreetBasketball1.mp4
3776,1067,329.3333320617676,393,diss_StreetBasketball1.mp4
3912,1067,381.3333320617676,447,diss_StreetBasketball1.mp4
3984,1067,410.3333320617676,491,diss_StreetBasketball1.mp4
4048,1067,426.3333320617676,512,diss_StreetBasketball1.mp4
4112,1067,440.3333320617676,522,diss_StreetBasketball1.mp4
4184,1067,455.3333320617676,520,diss_StreetBasketball1.mp4
4248,1067,472.3333320617676,507,diss_StreetBasketball1.mp4
4320,1067,490.3333320617676,485,diss_StreetBasketball1.mp4
4384,1067,494.3333320617676,478,diss_StreetBasketball1.mp4
4448,1067,496.3333320617676,472,diss_StreetBasketball1.mp4
4520,1067,498.3333320617676,465,diss_StreetBasketball1.mp4
4592,1067,500.3333320617676,455,diss_StreetBasketball1.mp4
4664,1067,503.3333320617676,451,diss_StreetBasketball1.mp4
4720,1067,508.3333320617676,450,diss_StreetBasketball1.mp4
4800,1067,513.3333320617676,450,diss_StreetBasketball1.mp4
4872,1067,533.3333320617676,461,diss_StreetBasketball1.mp4
4944,1067,570.3333320617676,476,diss_StreetBasketball1.mp4
5008,1067,613.3333320617676,483,diss_StreetBasketball1.mp4
5080,1067,661.3333320617676,471,diss_StreetBasketball1.mp4
5152,1067,692.3333320617676,455,diss_StreetBasketball1.mp4
5224,1067,716.3333320617676,405,diss_StreetBasketball1.mp4
5288,1067,722.3333320617676,377,diss_StreetBasketball1.mp4
5360,1067,723.3333320617676,351,diss_StreetBasketball1.mp4
5432,1067,723.3333320617676,318,diss_StreetBasketball1.mp4
5497,1067,726.3333320617676,282,diss_StreetBasketball1.mp4
5568,1067,722.3333320617676,242,diss_StreetBasketball1.mp4
5632,1067,710.3333320617676,210,diss_StreetBasketball1.mp4
5704,1067,698.3333320617676,188,diss_StreetBasketball1.mp4
5832,1067,692.3333320617676,187,diss_StreetBasketball1.mp4
5904,1067,676.3333320617676,192,diss_StreetBasketball1.mp4
5976,1067,655.3333320617676,201,diss_StreetBasketball1.mp4
6048,1067,640.3333320617676,206,diss_StreetBasketball1.mp4
6112,1067,632.3333320617676,208,diss_StreetBasketball1.mp4
6184,1067,618.3333320617676,212,diss_StreetBasketball1.mp4
6256,1067,596.3333320617676,216,diss_StreetBasketball1.mp4
6312,1067,581.3333320617676,220,diss_StreetBasketball1.mp4
6384,1067,565.3333320617676,225,diss_StreetBasketball1.mp4
6440,1067,561.3333320617676,227,diss_StreetBasketball1.mp4
6488,1067,560.3333320617676,228,diss_StreetBasketball1.mp4
6584,1067,562.3333320617676,234,diss_StreetBasketball1.mp4
6656,1067,576.3333320617676,243,diss_StreetBasketball1.mp4
6712,1067,589.3333320617676,246,diss_StreetBasketball1.mp4
6848,1067,626.3333320617676,242,diss_StreetBasketball1.mp4
6880,1067,629.3333320617676,242,diss_StreetBasketball1.mp4
7176,1067,631.3333320617676,242,diss_StreetBasketball1.mp4
7232,1067,641.3333320617676,240,diss_StreetBasketball1.mp4
7312,1067,660.3333320617676,250,diss_StreetBasketball1.mp4
7360,1067,665.3333320617676,280,diss_StreetBasketball1.mp4
7576,1067,664.3333320617676,278,diss_StreetBasketball1.mp4
7640,1067,692.3333320617676,260,diss_StreetBasketball1.mp4
7704,1067,738.3333320617676,220,diss_StreetBasketball1.mp4
7768,1067,785.3333320617676,151,diss_StreetBasketball1.mp4
0,1065,619.3333320617676,418,diss_car15.mp4
8,1065,616.3333320617676,421,diss_car15.mp4
88,1065,601.3333320617676,453,diss_car15.mp4
160,1065,583.3333320617676,484,diss_car15.mp4
232,1065,576.3333320617676,498,diss_car15.mp4
288,1065,575.3333320617676,505,diss_car15.mp4
360,1065,575.3333320617676,514,diss_car15.mp4
408,1065,575.3333320617676,518,diss_car15.mp4
457,1065,575.3333320617676,520,diss_car15.mp4
712,1065,570.3333320617676,526,diss_car15.mp4
768,1065,556.3333320617676,535,diss_car15.mp4
848,1065,548.3333320617676,543,diss_car15.mp4
904,1065,543.3333320617676,547,diss_car15.mp4
976,1065,539.3333320617676,557,diss_car15.mp4
1040,1065,533.3333320617676,567,diss_car15.mp4
1088,1065,531.3333320617676,572,diss_car15.mp4
1320,1065,530.3333320617676,572,diss_car15.mp4
1376,1065,539.3333320617676,562,diss_car15.mp4
1448,1065,561.3333320617676,553,diss_car15.mp4
1512,1065,570.3333320617676,553,diss_car15.mp4
1720,1065,572.3333320617676,552,diss_car15.mp4
1776,1065,576.3333320617676,552,diss_car15.mp4
1848,1065,586.3333320617676,552,diss_car15.mp4
2272,1065,586.3333320617676,557,diss_car15.mp4
2320,1065,584.3333320617676,562,diss_car15.mp4
2400,1065,580.3333320617676,563,diss_car15.mp4
2480,1065,575.3333320617676,564,diss_car15.mp4
2544,1065,554.3333320617676,573,diss_car15.mp4
2616,1065,512.3333320617676,614,diss_car15.mp4
2624,1065,506.3333320617676,621,diss_car15.mp4
2736,1065,473.3333320617676,667,diss_car15.mp4
2808,1065,472.3333320617676,670,diss_car15.mp4
2832,1065,471.3333320617676,671,diss_car15.mp4
3144,1065,466.3333320617676,671,diss_car15.mp4
3192,1065,455.3333320617676,670,diss_car15.mp4
3264,1065,428.3333320617676,658,diss_car15.mp4
3286,1065,424.3333320617676,656,diss_car15.mp4
3336,1065,415.3333320617676,647,diss_car15.mp4
3408,1065,405.3333320617676,640,diss_car15.mp4
3464,1065,400.3333320617676,631,diss_car15.mp4
3544,1065,395.3333320617676,626,diss_car15.mp4
3688,1065,373.3333320617676,595,diss_car15.mp4
3744,1065,355.3333320617676,573,diss_car15.mp4
3808,1065,340.3333320617676,546,diss_car15.mp4
3880,1065,320.3333320617676,496,diss_car15.mp4
3944,1065,313.3333320617676,450,diss_car15.mp4
4016,1065,313.3333320617676,398,diss_car15.mp4
4080,1065,311.3333320617676,367,diss_car15.mp4
4160,1065,329.3333320617676,366,diss_car15.mp4
4416,1065,323.3333320617676,345,diss_car15.mp4
4424,1065,320.3333320617676,337,diss_car15.mp4
4496,1065,312.3333320617676,303,diss_car15.mp4
4568,1065,304.3333320617676,283,diss_car15.mp4
4632,1065,299.3333320617676,281,diss_car15.mp4
4712,1065,291.3333320617676,276,diss_car15.mp4
4784,1065,275.3333320617676,270,diss_car15.mp4
4848,1065,254.3333320617676,255,diss_car15.mp4
4920,1065,220.3333320617676,235,diss_car15.mp4
4993,1065,204.3333320617676,225,diss_car15.mp4
5064,1065,194.3333320617676,217,diss_car15.mp4
5112,1065,190.3333320617676,213,diss_car15.mp4
5136,1065,189.3333320617676,212,diss_car15.mp4
5208,1065,181.3333320617676,208,diss_car15.mp4
5264,1065,173.33333206176758,204,diss_car15.mp4
5336,1065,165.33333206176758,195,diss_car15.mp4
5408,1065,161.33333206176758,186,diss_car15.mp4
5480,1065,163.33333206176758,174,diss_car15.mp4
5544,1065,169.33333206176758,165,diss_car15.mp4
5608,1065,179.33333206176758,158,diss_car15.mp4
5680,1065,193.3333320617676,153,diss_car15.mp4
5752,1065,220.3333320617676,142,diss_car15.mp4
5816,1065,250.3333320617676,134,diss_car15.mp4
5888,1065,281.3333320617676,127,diss_car15.mp4
5952,1065,312.3333320617676,123,diss_car15.mp4
6024,1065,342.3333320617676,121,diss_car15.mp4
6088,1065,376.3333320617676,118,diss_car15.mp4
6160,1065,410.3333320617676,113,diss_car15.mp4
6304,1065,462.3333320617676,110,diss_car15.mp4
6368,1065,483.3333320617676,106,diss_car15.mp4
6440,1065,512.3333320617676,105,diss_car15.mp4
6513,1065,546.3333320617676,105,diss_car15.mp4
6584,1065,580.3333320617676,105,diss_car15.mp4
6648,1065,630.3333320617676,113,diss_car15.mp4
6720,1065,664.3333320617676,116,diss_car15.mp4
6792,1065,689.3333320617676,118,diss_car15.mp4
6856,1065,706.3333320617676,123,diss_car15.mp4
6928,1065,731.3333320617676,127,diss_car15.mp4
6992,1065,755.3333320617676,132,diss_car15.mp4
7065,1065,793.3333320617676,140,diss_car15.mp4
7128,1065,822.3333320617676,140,diss_car15.mp4
7201,1065,859.3333320617676,140,diss_car15.mp4
7273,1065,893.3333320617676,141,diss_car15.mp4
7336,1065,924.3333320617676,141,diss_car15.mp4
7416,1065,952.3333320617676,141,diss_car15.mp4
7489,1065,970.3333320617676,141,diss_car15.mp4
7553,1065,990.3333320617676,145,diss_car15.mp4
7624,1065,1011.3333320617676,150,diss_car15.mp4
7697,1065,1048.3333320617676,157,diss_car15.mp4
7761,1065,1074.3333320617676,166,diss_car15.mp4
7825,1065,1093.3333320617676,176,diss_car15.mp4
7897,1065,1105.3333320617676,185,diss_car15.mp4
7968,1065,1128.3333320617676,200,diss_car15.mp4
8041,1065,1153.3333320617676,212,diss_car15.mp4
8113,1065,1168.3333320617676,221,diss_car15.mp4
8249,1065,1170.3333320617676,224,diss_car15.mp4
8321,1065,1146.3333320617676,235,diss_car15.mp4
8393,1065,1108.3333320617676,250,diss_car15.mp4
8465,1065,1053.3333320617676,265,diss_car15.mp4
8521,1065,1008.3333320617676,274,diss_car15.mp4
8593,1065,935.3333320617676,286,diss_car15.mp4
8657,1065,865.3333320617676,287,diss_car15.mp4
8801,1065,756.3333320617676,293,diss_car15.mp4
8865,1065,743.3333320617676,296,diss_car15.mp4
8937,1065,729.3333320617676,302,diss_car15.mp4
9009,1065,714.3333320617676,305,diss_car15.mp4
9073,1065,704.3333320617676,307,diss_car15.mp4
9137,1065,694.3333320617676,310,diss_car15.mp4
9217,1065,686.3333320617676,311,diss_car15.mp4
9281,1065,682.3333320617676,311,diss_car15.mp4
9425,1065,662.3333320617676,306,diss_car15.mp4
9481,1065,658.3333320617676,304,diss_car15.mp4
9553,1065,654.3333320617676,302,diss_car15.mp4
9625,1065,645.3333320617676,297,diss_car15.mp4
9697,1065,635.3333320617676,297,diss_car15.mp4
9753,1065,629.3333320617676,297,diss_car15.mp4
9827,1065,619.3333320617676,300,diss_car15.mp4
9897,1065,582.3333320617676,307,diss_car15.mp4
9961,1065,514.3333320617676,322,diss_car15.mp4
10033,1065,461.3333320617676,335,diss_car15.mp4
10097,1065,430.3333320617676,342,diss_car15.mp4
10161,1065,415.3333320617676,344,diss_car15.mp4
10241,1065,408.3333320617676,346,diss_car15.mp4
10313,1065,391.3333320617676,351,diss_car15.mp4
10449,1065,353.3333320617676,360,diss_car15.mp4
10465,1065,348.3333320617676,361,diss_car15.mp4
10521,1065,329.3333320617676,364,diss_car15.mp4
10585,1065,319.3333320617676,366,diss_car15.mp4
10641,1065,313.3333320617676,368,diss_car15.mp4
10721,1065,312.3333320617676,372,diss_car15.mp4
10865,1065,355.3333320617676,470,diss_car15.mp4
10937,1065,382.3333320617676,502,diss_car15.mp4
11009,1065,399.3333320617676,523,diss_car15.mp4
11081,1065,408.3333320617676,540,diss_car15.mp4
11153,1065,411.3333320617676,555,diss_car15.mp4
11233,1065,414.3333320617676,570,diss_car15.mp4
11297,1065,420.3333320617676,577,diss_car15.mp4
11377,1065,424.3333320617676,583,diss_car15.mp4
11433,1065,426.3333320617676,584,diss_car15.mp4
11505,1065,431.3333320617676,586,diss_car15.mp4
11577,1065,444.3333320617676,594,diss_car15.mp4
11713,1065,490.3333320617676,616,diss_car15.mp4
11785,1065,510.3333320617676,623,diss_car15.mp4
11849,1065,522.3333320617676,623,diss_car15.mp4
11897,1065,525.3333320617676,623,diss_car15.mp4
11945,1065,526.3333320617676,623,diss_car15.mp4
12065,1065,521.3333320617676,617,diss_car15.mp4
12137,1065,508.3333320617676,610,diss_car15.mp4
12201,1065,496.3333320617676,603,diss_car15.mp4
12217,1065,495.3333320617676,602,diss_car15.mp4
12313,1065,495.3333320617676,601,diss_car15.mp4
12529,1065,500.3333320617676,605,diss_car15.mp4
12585,1065,515.3333320617676,623,diss_car15.mp4
12657,1065,551.3333320617676,656,diss_car15.mp4
12721,1065,570.3333320617676,667,diss_car15.mp4
12793,1065,582.3333320617676,675,diss_car15.mp4
12857,1065,589.3333320617676,678,diss_car15.mp4
12921,1065,595.3333320617676,681,diss_car15.mp4
12993,1065,601.3333320617676,682,diss_car15.mp4
13075,1065,606.3333320617676,682,diss_car15.mp4
13137,1065,615.3333320617676,677,diss_car15.mp4
13209,1065,626.3333320617676,666,diss_car15.mp4
13281,1065,641.3333320617676,655,diss_car15.mp4
13353,1065,656.3333320617676,622,diss_car15.mp4
13417,1065,662.3333320617676,603,diss_car15.mp4
13489,1065,670.3333320617676,568,diss_car15.mp4
13553,1065,689.3333320617676,523,diss_car15.mp4
13625,1065,701.3333320617676,476,diss_car15.mp4
13681,1065,704.3333320617676,460,diss_car15.mp4
13753,1065,705.3333320617676,448,diss_car15.mp4
13833,1065,705.3333320617676,442,diss_car15.mp4
13889,1065,705.3333320617676,438,diss_car15.mp4
13969,1065,705.3333320617676,433,diss_car15.mp4
14041,1065,705.3333320617676,428,diss_car15.mp4
14113,1065,705.3333320617676,421,diss_car15.mp4
14169,1065,705.3333320617676,414,diss_car15.mp4
14249,1065,705.3333320617676,407,diss_car15.mp4
14321,1065,706.3333320617676,400,diss_car15.mp4
14393,1065,704.3333320617676,392,diss_car15.mp4
14529,1065,693.3333320617676,351,diss_car15.mp4
14673,1065,672.3333320617676,172,diss_car15.mp4
14729,1065,662.3333320617676,143,diss_car15.mp4
14737,1065,661.3333320617676,141,diss_car15.mp4
14785,1065,655.3333320617676,127,diss_car15.mp4
14865,1065,651.3333320617676,118,diss_car15.mp4
14937,1065,648.3333320617676,114,diss_car15.mp4
15009,1065,644.3333320617676,107,diss_car15.mp4
15145,1065,641.3333320617676,104,diss_car15.mp4
15209,1065,640.3333320617676,104,diss_car15.mp4
0,1065,646.3333320617676,414,diss_car15.mp4
472,1065,640.3333320617676,374,diss_car15.mp4
488,1065,632.3333320617676,340,diss_car15.mp4
560,1065,623.3333320617676,222,diss_car15.mp4
632,1065,629.3333320617676,182,diss_car15.mp4
640,1065,629.3333320617676,180,diss_car15.mp4
768,1065,629.3333320617676,158,diss_car15.mp4
824,1065,628.3333320617676,155,diss_car15.mp4
888,1065,626.3333320617676,151,diss_car15.mp4
968,1065,629.3333320617676,141,diss_car15.mp4
1040,1065,633.3333320617676,131,diss_car15.mp4
1104,1065,636.3333320617676,124,diss_car15.mp4
1184,1065,639.3333320617676,114,diss_car15.mp4
1248,1065,636.3333320617676,104,diss_car15.mp4
1304,1065,635.3333320617676,101,diss_car15.mp4
1368,1065,634.3333320617676,97,diss_car15.mp4
1456,1065,638.3333320617676,91,diss_car15.mp4
1520,1065,646.3333320617676,85,diss_car15.mp4
1600,1065,651.3333320617676,81,diss_car15.mp4
1640,1065,652.3333320617676,80,diss_car15.mp4
1872,1065,661.3333320617676,80,diss_car15.mp4
1992,1065,680.3333320617676,97,diss_car15.mp4
2056,1065,689.3333320617676,134,diss_car15.mp4
2072,1065,690.3333320617676,142,diss_car15.mp4
2136,1065,705.3333320617676,207,diss_car15.mp4
2208,1065,724.3333320617676,241,diss_car15.mp4
2336,1065,759.3333320617676,270,diss_car15.mp4
2456,1065,773.3333320617676,282,diss_car15.mp4
2584,1065,781.3333320617676,290,diss_car15.mp4
2784,1065,809.3333320617676,302,diss_car15.mp4
2840,1065,823.3333320617676,307,diss_car15.mp4
2904,1065,841.3333320617676,311,diss_car15.mp4
3048,1065,872.3333320617676,311,diss_car15.mp4
3128,1065,883.3333320617676,313,diss_car15.mp4
3208,1065,895.3333320617676,325,diss_car15.mp4
3256,1065,902.3333320617676,334,diss_car15.mp4
3328,1065,911.3333320617676,345,diss_car15.mp4
3400,1065,920.3333320617676,357,diss_car15.mp4
3456,1065,929.3333320617676,362,diss_car15.mp4
3536,1065,938.3333320617676,368,diss_car15.mp4
3608,1065,948.3333320617676,380,diss_car15.mp4
3680,1065,964.3333320617676,395,diss_car15.mp4
3744,1065,992.3333320617676,418,diss_car15.mp4
3816,1065,1028.3333320617676,447,diss_car15.mp4
3888,1065,1056.3333320617676,472,diss_car15.mp4
3960,1065,1074.3333320617676,492,diss_car15.mp4
4024,1065,1082.3333320617676,508,diss_car15.mp4
4040,1065,1083.3333320617676,512,diss_car15.mp4
4104,1065,1089.3333320617676,536,diss_car15.mp4
4176,1065,1089.3333320617676,561,diss_car15.mp4
4248,1065,1085.3333320617676,583,diss_car15.mp4
4312,1065,1078.3333320617676,597,diss_car15.mp4
4456,1065,1030.3333320617676,613,diss_car15.mp4
4504,1065,1000.3333320617676,621,diss_car15.mp4
4640,1065,951.3333320617676,631,diss_car15.mp4
4712,1065,931.3333320617676,635,diss_car15.mp4
4784,1065,900.3333320617676,641,diss_car15.mp4
4792,1065,896.3333320617676,642,diss_car15.mp4
4856,1065,866.3333320617676,647,diss_car15.mp4
4928,1065,828.3333320617676,655,diss_car15.mp4
5056,1065,742.3333320617676,670,diss_car15.mp4
5128,1065,711.3333320617676,671,diss_car15.mp4
5200,1065,691.3333320617676,673,diss_car15.mp4
5264,1065,679.3333320617676,675,diss_car15.mp4
5336,1065,670.3333320617676,676,diss_car15.mp4
5408,1065,660.3333320617676,676,diss_car15.mp4
5464,1065,652.3333320617676,677,diss_car15.mp4
5544,1065,641.3333320617676,680,diss_car15.mp4
5616,1065,632.3333320617676,680,diss_car15.mp4
5688,1065,621.3333320617676,680,diss_car15.mp4
5752,1065,611.3333320617676,680,diss_car15.mp4
5816,1065,603.3333320617676,680,diss_car15.mp4
5889,1065,593.3333320617676,678,diss_car15.mp4
5944,1065,582.3333320617676,676,diss_car15.mp4
6032,1065,563.3333320617676,675,diss_car15.mp4
6056,1065,556.3333320617676,675,diss_car15.mp4
6104,1065,540.3333320617676,671,diss_car15.mp4
6168,1065,520.3333320617676,668,diss_car15.mp4
6248,1065,508.3333320617676,668,diss_car15.mp4
6376,1065,489.3333320617676,665,diss_car15.mp4
6432,1065,480.3333320617676,663,diss_car15.mp4
6512,1065,469.3333320617676,655,diss_car15.mp4
6664,1065,446.3333320617676,651,diss_car15.mp4
6768,1065,429.3333320617676,650,diss_car15.mp4
6840,1065,415.3333320617676,648,diss_car15.mp4
6912,1065,394.3333320617676,640,diss_car15.mp4
6976,1065,381.3333320617676,620,diss_car15.mp4
7120,1065,359.3333320617676,576,diss_car15.mp4
7184,1065,355.3333320617676,560,diss_car15.mp4
7280,1065,355.3333320617676,545,diss_car15.mp4
7320,1065,355.3333320617676,541,diss_car15.mp4
7392,1065,356.3333320617676,531,diss_car15.mp4
7472,1065,361.3333320617676,521,diss_car15.mp4
7528,1065,366.3333320617676,515,diss_car15.mp4
7600,1065,374.3333320617676,510,diss_car15.mp4
7672,1065,381.3333320617676,505,diss_car15.mp4
7720,1065,388.3333320617676,501,diss_car15.mp4
7808,1065,400.3333320617676,494,diss_car15.mp4
7872,1065,412.3333320617676,483,diss_car15.mp4
7944,1065,419.3333320617676,474,diss_car15.mp4
8008,1065,423.3333320617676,467,diss_car15.mp4
8064,1065,425.3333320617676,463,diss_car15.mp4
8160,1065,402.3333320617676,465,diss_car15.mp4
8224,1065,353.3333320617676,475,diss_car15.mp4
8352,1065,326.3333320617676,480,diss_car15.mp4
8432,1065,330.3333320617676,475,diss_car15.mp4
8512,1065,366.3333320617676,453,diss_car15.mp4
8569,1065,389.3333320617676,445,diss_car15.mp4
8704,1065,405.3333320617676,456,diss_car15.mp4
8776,1065,406.3333320617676,501,diss_car15.mp4
8801,1065,406.3333320617676,517,diss_car15.mp4
8856,1065,406.3333320617676,545,diss_car15.mp4
8921,1065,411.3333320617676,562,diss_car15.mp4
8992,1065,420.3333320617676,571,diss_car15.mp4
9057,1065,438.3333320617676,575,diss_car15.mp4
9120,1065,459.3333320617676,572,diss_car15.mp4
9265,1065,494.3333320617676,563,diss_car15.mp4
9321,1065,500.3333320617676,562,diss_car15.mp4
9392,1065,516.3333320617676,558,diss_car15.mp4
9457,1065,531.3333320617676,557,diss_car15.mp4
9593,1065,575.3333320617676,570,diss_car15.mp4
9673,1065,611.3333320617676,590,diss_car15.mp4
9737,1065,639.3333320617676,602,diss_car15.mp4
9785,1065,665.3333320617676,616,diss_car15.mp4
9865,1065,709.3333320617676,637,diss_car15.mp4
9993,1065,735.3333320617676,648,diss_car15.mp4
10041,1065,738.3333320617676,648,diss_car15.mp4
10105,1065,740.3333320617676,648,diss_car15.mp4
10265,1065,748.3333320617676,647,diss_car15.mp4
10329,1065,761.3333320617676,633,diss_car15.mp4
10393,1065,779.3333320617676,580,diss_car15.mp4
10457,1065,780.3333320617676,511,diss_car15.mp4
10529,1065,766.3333320617676,454,diss_car15.mp4
10601,1065,762.3333320617676,442,diss_car15.mp4
10625,1065,762.3333320617676,441,diss_car15.mp4
10977,1065,744.3333320617676,420,diss_car15.mp4
11025,1065,710.3333320617676,393,diss_car15.mp4
11113,1065,661.3333320617676,382,diss_car15.mp4
11177,1065,653.3333320617676,381,diss_car15.mp4
11249,1065,635.3333320617676,381,diss_car15.mp4
11321,1065,593.3333320617676,381,diss_car15.mp4
11385,1065,543.3333320617676,373,diss_car15.mp4
11457,1065,501.3333320617676,365,diss_car15.mp4
11529,1065,470.3333320617676,358,diss_car15.mp4
11609,1065,455.3333320617676,355,diss_car15.mp4
11665,1065,445.3333320617676,352,diss_car15.mp4
11713,1065,438.3333320617676,348,diss_car15.mp4
11785,1065,429.3333320617676,345,diss_car15.mp4
11841,1065,423.3333320617676,343,diss_car15.mp4
11937,1065,416.3333320617676,341,diss_car15.mp4
11993,1065,414.3333320617676,341,diss_car15.mp4
12065,1065,410.3333320617676,340,diss_car15.mp4
12129,1065,406.3333320617676,337,diss_car15.mp4
12185,1065,403.3333320617676,337,diss_car15.mp4
12225,1065,402.3333320617676,336,diss_car15.mp4
12345,1065,401.3333320617676,334,diss_car15.mp4
12481,1065,386.3333320617676,337,diss_car15.mp4
12617,1065,374.3333320617676,347,diss_car15.mp4
12633,1065,373.3333320617676,348,diss_car15.mp4
12881,1065,405.3333320617676,330,diss_car15.mp4
12929,1065,410.3333320617676,326,diss_car15.mp4
13009,1065,423.3333320617676,320,diss_car15.mp4
13065,1065,435.3333320617676,313,diss_car15.mp4
13137,1065,456.3333320617676,302,diss_car15.mp4
13201,1065,471.3333320617676,294,diss_car15.mp4
13345,1065,504.3333320617676,268,diss_car15.mp4
13353,1065,506.3333320617676,268,diss_car15.mp4
13417,1065,516.3333320617676,262,diss_car15.mp4
13481,1065,524.3333320617676,257,diss_car15.mp4
13561,1065,536.3333320617676,253,diss_car15.mp4
13697,1065,572.3333320617676,238,diss_car15.mp4
13705,1065,578.3333320617676,236,diss_car15.mp4
13777,1065,596.3333320617676,225,diss_car15.mp4
13841,1065,603.3333320617676,221,diss_car15.mp4
13905,1065,614.3333320617676,217,diss_car15.mp4
14041,1065,636.3333320617676,213,diss_car15.mp4
14057,1065,642.3333320617676,213,diss_car15.mp4
14121,1065,663.3333320617676,213,diss_car15.mp4
14185,1065,692.3333320617676,218,diss_car15.mp4
14257,1065,718.3333320617676,228,diss_car15.mp4
14321,1065,722.3333320617676,236,diss_car15.mp4
14401,1065,596.3333320617676,281,diss_car15.mp4
14473,1065,456.3333320617676,307,diss_car15.mp4
14545,1065,351.3333320617676,310,diss_car15.mp4
14673,1065,206.3333320617676,303,diss_car15.mp4
14737,1065,152.33333206176758,301,diss_car15.mp4
14801,1065,132.33333206176758,297,diss_car15.mp4
14945,1065,105.33333206176758,288,diss_car15.mp4
15017,1065,94.33333206176758,285,diss_car15.mp4
15081,1065,80.33333206176758,285,diss_car15.mp4
15145,1065,65.33333206176758,285,diss_car15.mp4
15193,1065,59.33333206176758,285,diss_car15.mp4
15345,1065,53.33333206176758,301,diss_car15.mp4
15401,1065,51.33333206176758,324,diss_car15.mp4
15473,1065,53.33333206176758,365,diss_car15.mp4
15545,1065,54.33333206176758,415,diss_car15.mp4
15609,1065,54.33333206176758,484,diss_car15.mp4
15745,1065,105.33333206176758,655,diss_car15.mp4
15801,1065,152.33333206176758,691,diss_car15.mp4
0,1064,635.3333320617676,420,diss_building3.mp4
16,1064,632.3333320617676,421,diss_building3.mp4
88,1064,606.3333320617676,432,diss_building3.mp4
160,1064,571.3333320617676,467,diss_building3.mp4
232,1064,566.3333320617676,544,diss_building3.mp4
304,1064,582.3333320617676,611,diss_building3.mp4
376,1064,609.3333320617676,670,diss_building3.mp4
448,1064,632.3333320617676,705,diss_building3.mp4
464,1064,638.3333320617676,712,diss_building3.mp4
584,1064,652.3333320617676,722,diss_building3.mp4
656,1064,664.3333320617676,722,diss_building3.mp4
728,1064,693.3333320617676,717,diss_building3.mp4
736,1064,698.3333320617676,716,diss_building3.mp4
800,1064,733.3333320617676,710,diss_building3.mp4
872,1064,773.3333320617676,702,diss_building3.mp4
944,1064,820.3333320617676,691,diss_building3.mp4
1016,1064,846.3333320617676,683,diss_building3.mp4
1088,1064,871.3333320617676,672,diss_building3.mp4
1160,1064,913.3333320617676,644,diss_building3.mp4
1224,1064,956.3333320617676,604,diss_building3.mp4
1296,1064,992.3333320617676,560,diss_building3.mp4
1432,1064,1005.3333320617676,542,diss_building3.mp4
1488,1064,1009.3333320617676,537,diss_building3.mp4
1592,1064,1011.3333320617676,534,diss_building3.mp4
1680,1064,1011.3333320617676,531,diss_building3.mp4
1752,1064,1012.3333320617676,524,diss_building3.mp4
1816,1064,1014.3333320617676,514,diss_building3.mp4
1960,1064,1020.3333320617676,473,diss_building3.mp4
2024,1064,1019.3333320617676,465,diss_building3.mp4
2088,1064,1016.3333320617676,461,diss_building3.mp4
2160,1064,1005.3333320617676,443,diss_building3.mp4
2296,1064,825.3333320617676,327,diss_building3.mp4
2368,1064,775.3333320617676,308,diss_building3.mp4
2440,1064,732.3333320617676,301,diss_building3.mp4
2512,1064,688.3333320617676,291,diss_building3.mp4
2576,1064,659.3333320617676,285,diss_building3.mp4
2712,1064,618.3333320617676,283,diss_building3.mp4
2736,1064,610.3333320617676,283,diss_building3.mp4
2784,1064,588.3333320617676,283,diss_building3.mp4
2856,1064,536.3333320617676,284,diss_building3.mp4
2928,1064,511.3333320617676,288,diss_building3.mp4
2992,1064,493.3333320617676,295,diss_building3.mp4
3064,1064,478.3333320617676,304,diss_building3.mp4
3128,1064,459.3333320617676,314,diss_building3.mp4
3208,1064,419.3333320617676,366,diss_building3.mp4
3272,1064,394.3333320617676,445,diss_building3.mp4
3416,1064,370.3333320617676,533,diss_building3.mp4
3480,1064,364.3333320617676,542,diss_building3.mp4
3552,1064,358.3333320617676,548,diss_building3.mp4
3624,1064,348.3333320617676,555,diss_building3.mp4
3688,1064,338.3333320617676,563,diss_building3.mp4
3760,1064,331.3333320617676,568,diss_building3.mp4
3832,1064,325.3333320617676,573,diss_building3.mp4
3904,1064,321.3333320617676,576,diss_building3.mp4
3960,1064,316.3333320617676,577,diss_building3.mp4
4040,1064,303.3333320617676,581,diss_building3.mp4
4104,1064,298.3333320617676,582,diss_building3.mp4
4176,1064,289.3333320617676,585,diss_building3.mp4
4249,1064,282.3333320617676,588,diss_building3.mp4
4328,1064,270.3333320617676,597,diss_building3.mp4
4378,1064,256.3333320617676,608,diss_building3.mp4
4448,1064,242.3333320617676,626,diss_building3.mp4
4528,1064,229.3333320617676,645,diss_building3.mp4
4640,1064,223.3333320617676,652,diss_building3.mp4
4720,1064,221.3333320617676,654,diss_building3.mp4
4784,1064,219.3333320617676,654,diss_building3.mp4
4864,1064,215.3333320617676,655,diss_building3.mp4
5032,1064,213.3333320617676,655,diss_building3.mp4
5184,1064,230.3333320617676,646,diss_building3.mp4
5256,1064,310.3333320617676,598,diss_building3.mp4
5312,1064,364.3333320617676,565,diss_building3.mp4
5384,1064,426.3333320617676,527,diss_building3.mp4
5456,1064,449.3333320617676,507,diss_building3.mp4
5528,1064,461.3333320617676,492,diss_building3.mp4
5600,1064,470.3333320617676,477,diss_building3.mp4
5672,1064,480.3333320617676,463,diss_building3.mp4
5736,1064,486.3333320617676,446,diss_building3.mp4
5800,1064,491.3333320617676,428,diss_building3.mp4
5880,1064,498.3333320617676,417,diss_building3.mp4
5952,1064,503.3333320617676,408,diss_building3.mp4
6024,1064,506.3333320617676,398,diss_building3.mp4
6088,1064,508.3333320617676,385,diss_building3.mp4
6160,1064,508.3333320617676,366,diss_building3.mp4
6224,1064,508.3333320617676,357,diss_building3.mp4
6280,1064,508.3333320617676,354,diss_building3.mp4
6368,1064,509.3333320617676,352,diss_building3.mp4
6440,1064,510.3333320617676,352,diss_building3.mp4
6512,1064,514.3333320617676,351,diss_building3.mp4
6576,1064,521.3333320617676,350,diss_building3.mp4
6648,1064,530.3333320617676,347,diss_building3.mp4
6792,1064,555.3333320617676,342,diss_building3.mp4
6840,1064,565.3333320617676,340,diss_building3.mp4
6904,1064,581.3333320617676,336,diss_building3.mp4
7040,1064,639.3333320617676,314,diss_building3.mp4
7104,1064,661.3333320617676,301,diss_building3.mp4
7176,1064,683.3333320617676,291,diss_building3.mp4
7312,1064,745.3333320617676,303,diss_building3.mp4
7368,1064,824.3333320617676,348,diss_building3.mp4
7440,1064,960.3333320617676,425,diss_building3.mp4
7576,1064,1053.3333320617676,467,diss_building3.mp4
7624,1064,1060.3333320617676,472,diss_building3.mp4
7704,1064,1066.3333320617676,475,diss_building3.mp4
7840,1064,1082.3333320617676,482,diss_building3.mp4
7896,1064,1091.3333320617676,485,diss_building3.mp4
7968,1064,1110.3333320617676,494,diss_building3.mp4
8040,1064,1129.3333320617676,503,diss_building3.mp4
8088,1064,1133.3333320617676,506,diss_building3.mp4
8240,1064,1111.3333320617676,518,diss_building3.mp4
8304,1064,1095.3333320617676,522,diss_building3.mp4
8440,1064,1043.3333320617676,528,diss_building3.mp4
8520,1064,971.3333320617676,543,diss_building3.mp4
8584,1064,924.3333320617676,553,diss_building3.mp4
8648,1064,849.3333320617676,568,diss_building3.mp4
8776,1064,742.3333320617676,590,diss_building3.mp4
8832,1064,725.3333320617676,595,diss_building3.mp4
8904,1064,712.3333320617676,601,diss_building3.mp4
8968,1064,698.3333320617676,606,diss_building3.mp4
9040,1064,690.3333320617676,610,diss_building3.mp4
9168,1064,671.3333320617676,615,diss_building3.mp4
9224,1064,665.3333320617676,616,diss_building3.mp4
9296,1064,655.3333320617676,618,diss_building3.mp4
9432,1064,644.3333320617676,622,diss_building3.mp4
9504,1064,635.3333320617676,623,diss_building3.mp4
9568,1064,624.3333320617676,625,diss_building3.mp4
9640,1064,610.3333320617676,628,diss_building3.mp4
9704,1064,601.3333320617676,631,diss_building3.mp4
9841,1064,583.3333320617676,638,diss_building3.mp4
9904,1064,578.3333320617676,643,diss_building3.mp4
9969,1064,566.3333320617676,652,diss_building3.mp4
10041,1064,561.3333320617676,657,diss_building3.mp4
10088,1064,558.3333320617676,661,diss_building3.mp4
10176,1064,558.3333320617676,665,diss_building3.mp4
10248,1064,561.3333320617676,670,diss_building3.mp4
10313,1064,573.3333320617676,674,diss_building3.mp4
10385,1064,599.3333320617676,681,diss_building3.mp4
10457,1064,630.3333320617676,686,diss_building3.mp4
10577,1064,663.3333320617676,690,diss_building3.mp4
10641,1064,673.3333320617676,690,diss_building3.mp4
10665,1064,674.3333320617676,690,diss_building3.mp4
10737,1064,682.3333320617676,688,diss_building3.mp4
10801,1064,708.3333320617676,660,diss_building3.mp4
10865,1064,749.3333320617676,602,diss_building3.mp4
10937,1064,778.3333320617676,541,diss_building3.mp4
11001,1064,795.3333320617676,476,diss_building3.mp4
11145,1064,814.3333320617676,411,diss_building3.mp4
11217,1064,829.3333320617676,398,diss_building3.mp4
11289,1064,852.3333320617676,391,diss_building3.mp4
11354,1064,873.3333320617676,390,diss_building3.mp4
11425,1064,891.3333320617676,390,diss_building3.mp4
11489,1064,900.3333320617676,390,diss_building3.mp4
11553,1064,903.3333320617676,390,diss_building3.mp4
11609,1064,904.3333320617676,390,diss_building3.mp4
11697,1064,906.3333320617676,390,diss_building3.mp4
11769,1064,909.3333320617676,391,diss_building3.mp4
11825,1064,911.3333320617676,392,diss_building3.mp4
11921,1064,913.3333320617676,394,diss_building3.mp4
11977,1064,915.3333320617676,396,diss_building3.mp4
12057,1064,916.3333320617676,400,diss_building3.mp4
12161,1064,914.3333320617676,423,diss_building3.mp4
12201,1064,908.3333320617676,441,diss_building3.mp4
12265,1064,902.3333320617676,456,diss_building3.mp4
12337,1064,901.3333320617676,462,diss_building3.mp4
12409,1064,899.3333320617676,470,diss_building3.mp4
12473,1064,896.3333320617676,477,diss_building3.mp4
12545,1064,894.3333320617676,484,diss_building3.mp4
12617,1064,891.3333320617676,494,diss_building3.mp4
12681,1064,886.3333320617676,503,diss_building3.mp4
12737,1064,883.3333320617676,510,diss_building3.mp4
12873,1064,876.3333320617676,530,diss_building3.mp4
12945,1064,875.3333320617676,540,diss_building3.mp4
13017,1064,874.3333320617676,547,diss_building3.mp4
13089,1064,872.3333320617676,565,diss_building3.mp4
13161,1064,863.3333320617676,587,diss_building3.mp4
13233,1064,844.3333320617676,618,diss_building3.mp4
13305,1064,834.3333320617676,646,diss_building3.mp4
13369,1064,832.3333320617676,660,diss_building3.mp4
13497,1064,825.3333320617676,682,diss_building3.mp4
13561,1064,823.3333320617676,690,diss_building3.mp4
13625,1064,821.3333320617676,695,diss_building3.mp4
13697,1064,821.3333320617676,700,diss_building3.mp4
13825,1064,819.3333320617676,707,diss_building3.mp4
13913,1064,822.3333320617676,711,diss_building3.mp4
13985,1064,841.3333320617676,712,diss_building3.mp4
14057,1064,889.3333320617676,706,diss_building3.mp4
14121,1064,910.3333320617676,702,diss_building3.mp4
14193,1064,928.3333320617676,694,diss_building3.mp4
14257,1064,940.3333320617676,686,diss_building3.mp4
14345,1064,948.3333320617676,661,diss_building3.mp4
14473,1064,945.3333320617676,617,diss_building3.mp4
14537,1064,936.3333320617676,604,diss_building3.mp4
14601,1064,928.3333320617676,592,diss_building3.mp4
14673,1064,923.3333320617676,582,diss_building3.mp4
14737,1064,921.3333320617676,577,diss_building3.mp4
14865,1064,916.3333320617676,570,diss_building3.mp4
14937,1064,915.3333320617676,568,diss_building3.mp4
15001,1064,914.3333320617676,566,diss_building3.mp4
15081,1064,911.3333320617676,564,diss_building3.mp4
15161,1064,906.3333320617676,557,diss_building3.mp4
15233,1064,903.3333320617676,552,diss_building3.mp4
15361,1064,890.3333320617676,505,diss_building3.mp4
15417,1064,878.3333320617676,474,diss_building3.mp4
15489,1064,871.3333320617676,438,diss_building3.mp4
15625,1064,875.3333320617676,391,diss_building3.mp4
15689,1064,878.3333320617676,375,diss_building3.mp4
15753,1064,874.3333320617676,357,diss_building3.mp4
15889,1064,853.3333320617676,327,diss_building3.mp4
16009,1064,848.3333320617676,317,diss_building3.mp4
16081,1064,845.3333320617676,312,diss_building3.mp4
16105,1064,844.3333320617676,311,diss_building3.mp4
16449,1064,845.3333320617676,310,diss_building3.mp4
16513,1064,856.3333320617676,304,diss_building3.mp4
16585,1064,880.3333320617676,297,diss_building3.mp4
16649,1064,896.3333320617676,295,diss_building3.mp4
16721,1064,914.3333320617676,301,diss_building3.mp4
16777,1064,933.3333320617676,316,diss_building3.mp4
16849,1064,962.3333320617676,345,diss_building3.mp4
16921,1064,970.3333320617676,355,diss_building3.mp4
16945,1064,972.3333320617676,356,diss_building3.mp4
17049,1064,974.3333320617676,358,diss_building3.mp4
17177,1064,978.3333320617676,358,diss_building3.mp4
17241,1064,980.3333320617676,358,diss_building3.mp4
17329,1064,983.3333320617676,358,diss_building3.mp4
17393,1064,988.3333320617676,353,diss_building3.mp4
17465,1064,978.3333320617676,303,diss_building3.mp4
17537,1064,950.3333320617676,258,diss_building3.mp4
17601,1064,931.3333320617676,235,diss_building3.mp4
17609,1064,930.3333320617676,233,diss_building3.mp4
17673,1064,920.3333320617676,226,diss_building3.mp4
17745,1064,908.3333320617676,221,diss_building3.mp4
17809,1064,898.3333320617676,216,diss_building3.mp4
17889,1064,889.3333320617676,214,diss_building3.mp4
17945,1064,884.3333320617676,214,diss_building3.mp4
18009,1064,875.3333320617676,214,diss_building3.mp4
18089,1064,863.3333320617676,215,diss_building3.mp4
18153,1064,849.3333320617676,215,diss_building3.mp4
18225,1064,824.3333320617676,215,diss_building3.mp4
18297,1064,801.3333320617676,215,diss_building3.mp4
18361,1064,775.3333320617676,217,diss_building3.mp4
18433,1064,735.3333320617676,220,diss_building3.mp4
18505,1064,712.3333320617676,225,diss_building3.mp4
18641,1064,663.3333320617676,310,diss_building3.mp4
18681,1064,662.3333320617676,334,diss_building3.mp4
18769,1064,680.3333320617676,410,diss_building3.mp4
18905,1064,779.3333320617676,516,diss_building3.mp4
18961,1064,799.3333320617676,536,diss_building3.mp4
19033,1064,816.3333320617676,551,diss_building3.mp4
19089,1064,820.3333320617676,554,diss_building3.mp4
19153,1064,823.3333320617676,556,diss_building3.mp4
19305,1064,832.3333320617676,561,diss_building3.mp4
19361,1064,836.3333320617676,562,diss_building3.mp4
19433,1064,843.3333320617676,564,diss_building3.mp4
19497,1064,846.3333320617676,566,diss_building3.mp4
19569,1064,852.3333320617676,582,diss_building3.mp4
19705,1064,866.3333320617676,622,diss_building3.mp4
19769,1064,871.3333320617676,631,diss_building3.mp4
19817,1064,873.3333320617676,635,diss_building3.mp4
19969,1064,876.3333320617676,636,diss_building3.mp4
20025,1064,880.3333320617676,635,diss_building3.mp4
20097,1064,892.3333320617676,630,diss_building3.mp4
20161,1064,904.3333320617676,615,diss_building3.mp4
20233,1064,922.3333320617676,586,diss_building3.mp4
20369,1064,942.3333320617676,558,diss_building3.mp4
20425,1064,946.3333320617676,553,diss_building3.mp4
20561,1064,953.3333320617676,543,diss_building3.mp4
20633,1064,958.3333320617676,540,diss_building3.mp4
20769,1064,973.3333320617676,531,diss_building3.mp4
20841,1064,990.3333320617676,521,diss_building3.mp4
20914,1064,1013.3333320617676,494,diss_building3.mp4
20986,1064,1030.3333320617676,457,diss_building3.mp4
21049,1064,1032.3333320617676,452,diss_building3.mp4
21057,1064,1033.3333320617676,451,diss_building3.mp4
21122,1064,1035.3333320617676,446,diss_building3.mp4
21202,1064,1040.3333320617676,440,diss_building3.mp4
21266,1064,1046.3333320617676,433,diss_building3.mp4
21410,1064,1069.3333320617676,420,diss_building3.mp4
21474,1064,1075.3333320617676,411,diss_building3.mp4
21530,1064,1079.3333320617676,404,diss_building3.mp4
21610,1064,1080.3333320617676,403,diss_building3.mp4
21683,1064,1084.3333320617676,402,diss_building3.mp4
21754,1064,1092.3333320617676,402,diss_building3.mp4
21890,1064,1061.3333320617676,341,diss_building3.mp4
21962,1064,1013.3333320617676,325,diss_building3.mp4
22034,1064,835.3333320617676,282,diss_building3.mp4
22106,1064,676.3333320617676,271,diss_building3.mp4
22170,1064,565.3333320617676,290,diss_building3.mp4
22242,1064,446.3333320617676,316,diss_building3.mp4
22298,1064,380.3333320617676,331,diss_building3.mp4
22370,1064,329.3333320617676,341,diss_building3.mp4
22378,1064,324.3333320617676,342,diss_building3.mp4
22442,1064,302.3333320617676,347,diss_building3.mp4
22514,1064,288.3333320617676,351,diss_building3.mp4
22586,1064,276.3333320617676,356,diss_building3.mp4
22650,1064,268.3333320617676,362,diss_building3.mp4
22714,1064,264.3333320617676,367,diss_building3.mp4
22858,1064,246.3333320617676,375,diss_building3.mp4
22922,1064,228.3333320617676,377,diss_building3.mp4
23058,1064,182.3333320617676,375,diss_building3.mp4
23122,1064,168.33333206176758,378,diss_building3.mp4
23194,1064,156.33333206176758,380,diss_building3.mp4
23266,1064,128.33333206176758,350,diss_building3.mp4
23338,1064,112.33333206176758,304,diss_building3.mp4
23410,1064,112.33333206176758,274,diss_building3.mp4
23482,1064,124.33333206176758,228,diss_building3.mp4
23546,1064,130.33333206176758,211,diss_building3.mp4
23610,1064,135.33333206176758,196,diss_building3.mp4
23674,1064,143.33333206176758,168,diss_building3.mp4
23746,1064,152.33333206176758,147,diss_building3.mp4
23818,1064,162.33333206176758,134,diss_building3.mp4
23890,1064,178.33333206176758,128,diss_building3.mp4
23962,1064,199.3333320617676,126,diss_building3.mp4
24026,1064,233.3333320617676,128,diss_building3.mp4
24098,1064,296.3333320617676,143,diss_building3.mp4
24170,1064,369.3333320617676,171,diss_building3.mp4
24226,1064,421.3333320617676,191,diss_building3.mp4
24306,1064,465.3333320617676,208,diss_building3.mp4
24370,1064,486.3333320617676,214,diss_building3.mp4
24442,1064,509.3333320617676,223,diss_building3.mp4
24514,1064,525.3333320617676,230,diss_building3.mp4
24586,1064,540.3333320617676,234,diss_building3.mp4
24722,1064,612.3333320617676,268,diss_building3.mp4
24746,1064,625.3333320617676,280,diss_building3.mp4
25050,1064,640.3333320617676,283,diss_building3.mp4
25106,1064,685.3333320617676,294,diss_building3.mp4
25162,1064,734.3333320617676,307,diss_building3.mp4
25234,1064,820.3333320617676,341,diss_building3.mp4
25306,1064,883.3333320617676,381,diss_building3.mp4
25378,1064,920.3333320617676,421,diss_building3.mp4
25450,1064,939.3333320617676,442,diss_building3.mp4
25514,1064,988.3333320617676,483,diss_building3.mp4
25586,1064,1072.3333320617676,542,diss_building3.mp4
25658,1064,1141.3333320617676,576,diss_building3.mp4
25730,1064,1160.3333320617676,584,diss_building3.mp4
25802,1064,1166.3333320617676,586,diss_building3.mp4
26002,1064,1171.3333320617676,597,diss_building3.mp4
26066,1064,1179.3333320617676,618,diss_building3.mp4
26122,1064,1189.3333320617676,651,diss_building3.mp4
26194,1064,1200.3333320617676,677,diss_building3.mp4
26258,1064,1202.3333320617676,683,diss_building3.mp4
26275,1064,1202.3333320617676,684,diss_building3.mp4
26338,1064,1191.3333320617676,684,diss_building3.mp4
26410,1064,1149.3333320617676,670,diss_building3.mp4
26482,1064,1131.3333320617676,660,diss_building3.mp4
26618,1064,1110.3333320617676,651,diss_building3.mp4
26682,1064,1103.3333320617676,645,diss_building3.mp4
26818,1064,1089.3333320617676,611,diss_building3.mp4
26890,1064,1076.3333320617676,552,diss_building3.mp4
26962,1064,1059.3333320617676,498,diss_building3.mp4
27026,1064,1048.3333320617676,482,diss_building3.mp4
27090,1064,1016.3333320617676,450,diss_building3.mp4
27106,1064,1011.3333320617676,445,diss_building3.mp4
27178,1064,953.3333320617676,394,diss_building3.mp4
0,1068,644.3333320617676,417,diss_bike3.mp4
88,1068,644.3333320617676,416,diss_bike3.mp4
280,1068,643.3333320617676,416,diss_bike3.mp4
344,1068,631.3333320617676,415,diss_bike3.mp4
416,1068,585.3333320617676,388,diss_bike3.mp4
488,1068,562.3333320617676,348,diss_bike3.mp4
560,1068,561.3333320617676,298,diss_bike3.mp4
624,1068,569.3333320617676,281,diss_bike3.mp4
696,1068,581.3333320617676,260,diss_bike3.mp4
768,1068,589.3333320617676,247,diss_bike3.mp4
832,1068,596.3333320617676,231,diss_bike3.mp4
896,1068,599.3333320617676,220,diss_bike3.mp4
968,1068,599.3333320617676,213,diss_bike3.mp4
1032,1068,599.3333320617676,204,diss_bike3.mp4
1096,1068,594.3333320617676,195,diss_bike3.mp4
1184,1068,588.3333320617676,180,diss_bike3.mp4
1312,1068,570.3333320617676,144,diss_bike3.mp4
1368,1068,561.3333320617676,133,diss_bike3.mp4
1440,1068,556.3333320617676,131,diss_bike3.mp4
1584,1068,549.3333320617676,133,diss_bike3.mp4
1648,1068,538.3333320617676,162,diss_bike3.mp4
1712,1068,533.3333320617676,237,diss_bike3.mp4
1792,1068,584.3333320617676,338,diss_bike3.mp4
1856,1068,650.3333320617676,413,diss_bike3.mp4
2128,1068,808.3333320617676,628,diss_bike3.mp4
2184,1068,811.3333320617676,650,diss_bike3.mp4
2248,1068,808.3333320617676,652,diss_bike3.mp4
2312,1068,802.3333320617676,651,diss_bike3.mp4
2448,1068,781.3333320617676,633,diss_bike3.mp4
2520,1068,740.3333320617676,608,diss_bike3.mp4
2600,1068,719.3333320617676,592,diss_bike3.mp4
2664,1068,712.3333320617676,574,diss_bike3.mp4
2672,1068,712.3333320617676,572,diss_bike3.mp4
2737,1068,708.3333320617676,547,diss_bike3.mp4
2808,1068,705.3333320617676,524,diss_bike3.mp4
2880,1068,705.3333320617676,511,diss_bike3.mp4
2944,1068,710.3333320617676,500,diss_bike3.mp4
3080,1068,729.3333320617676,493,diss_bike3.mp4
3144,1068,746.3333320617676,506,diss_bike3.mp4
3208,1068,773.3333320617676,527,diss_bike3.mp4
3280,1068,805.3333320617676,562,diss_bike3.mp4
3360,1068,821.3333320617676,585,diss_bike3.mp4
3464,1068,835.3333320617676,601,diss_bike3.mp4
3608,1068,853.3333320617676,608,diss_bike3.mp4
3672,1068,868.3333320617676,617,diss_bike3.mp4
3744,1068,882.3333320617676,623,diss_bike3.mp4
3808,1068,890.3333320617676,626,diss_bike3.mp4
3880,1068,894.3333320617676,625,diss_bike3.mp4
4016,1068,861.3333320617676,557,diss_bike3.mp4
4072,1068,838.3333320617676,536,diss_bike3.mp4
4146,1068,755.3333320617676,475,diss_bike3.mp4
4208,1068,710.3333320617676,451,diss_bike3.mp4
4280,1068,693.3333320617676,443,diss_bike3.mp4
4368,1068,690.3333320617676,441,diss_bike3.mp4
4459,1068,690.3333320617676,440,diss_bike3.mp4
4528,1068,688.3333320617676,437,diss_bike3.mp4
4624,1068,688.3333320617676,435,diss_bike3.mp4
4736,1068,690.3333320617676,431,diss_bike3.mp4
4800,1068,700.3333320617676,430,diss_bike3.mp4
5064,1068,705.3333320617676,431,diss_bike3.mp4
5120,1068,739.3333320617676,424,diss_bike3.mp4
5200,1068,809.3333320617676,417,diss_bike3.mp4
5272,1068,831.3333320617676,411,diss_bike3.mp4
5336,1068,843.3333320617676,401,diss_bike3.mp4
5392,1068,851.3333320617676,387,diss_bike3.mp4
5464,1068,858.3333320617676,372,diss_bike3.mp4
5528,1068,861.3333320617676,364,diss_bike3.mp4
5656,1068,861.3333320617676,348,diss_bike3.mp4
5728,1068,861.3333320617676,340,diss_bike3.mp4
5808,1068,861.3333320617676,333,diss_bike3.mp4
5856,1068,861.3333320617676,323,diss_bike3.mp4
5928,1068,862.3333320617676,302,diss_bike3.mp4
5992,1068,862.3333320617676,290,diss_bike3.mp4
6056,1068,862.3333320617676,284,diss_bike3.mp4
6112,1068,862.3333320617676,281,diss_bike3.mp4
6264,1068,865.3333320617676,278,diss_bike3.mp4
6336,1068,878.3333320617676,276,diss_bike3.mp4
6408,1068,895.3333320617676,273,diss_bike3.mp4
6472,1068,913.3333320617676,270,diss_bike3.mp4
6544,1068,930.3333320617676,266,diss_bike3.mp4
6608,1068,935.3333320617676,265,diss_bike3.mp4
6664,1068,939.3333320617676,265,diss_bike3.mp4
6744,1068,949.3333320617676,275,diss_bike3.mp4
6888,1068,999.3333320617676,343,diss_bike3.mp4
6952,1068,1022.3333320617676,365,diss_bike3.mp4
7016,1068,1034.3333320617676,375,diss_bike3.mp4
7088,1068,1039.3333320617676,381,diss_bike3.mp4
7160,1068,1048.3333320617676,387,diss_bike3.mp4
7232,1068,1056.3333320617676,394,diss_bike3.mp4
7240,1068,1058.3333320617676,394,diss_bike3.mp4
7305,1068,1065.3333320617676,400,diss_bike3.mp4
7352,1068,1072.3333320617676,403,diss_bike3.mp4
7400,1068,1075.3333320617676,404,diss_bike3.mp4
7488,1068,1076.3333320617676,404,diss_bike3.mp4
7600,1068,1078.3333320617676,404,diss_bike3.mp4
7712,1068,1078.3333320617676,401,diss_bike3.mp4
7760,1068,1075.3333320617676,394,diss_bike3.mp4
7832,1068,1073.3333320617676,393,diss_bike3.mp4
7920,1068,1068.3333320617676,393,diss_bike3.mp4
7969,1068,1063.3333320617676,394,diss_bike3.mp4
8056,1068,1055.3333320617676,396,diss_bike3.mp4
8192,1068,1042.3333320617676,394,diss_bike3.mp4
8264,1068,1038.3333320617676,392,diss_bike3.mp4
8304,1068,1034.3333320617676,392,diss_bike3.mp4
8360,1068,1033.3333320617676,392,diss_bike3.mp4
8448,1068,1030.3333320617676,391,diss_bike3.mp4
8480,1068,1029.3333320617676,390,diss_bike3.mp4
8600,1068,1028.3333320617676,386,diss_bike3.mp4
8648,1068,1026.3333320617676,382,diss_bike3.mp4
8808,1068,1026.3333320617676,372,diss_bike3.mp4
8928,1068,1030.3333320617676,366,diss_bike3.mp4
8984,1068,1032.3333320617676,365,diss_bike3.mp4
9080,1068,1038.3333320617676,364,diss_bike3.mp4
9144,1068,1043.3333320617676,363,diss_bike3.mp4
9216,1068,1046.3333320617676,362,diss_bike3.mp4
9296,1068,1053.3333320617676,362,diss_bike3.mp4
9408,1068,1064.3333320617676,363,diss_bike3.mp4
9488,1068,1069.3333320617676,367,diss_bike3.mp4
9561,1068,1074.3333320617676,373,diss_bike3.mp4
9632,1068,1079.3333320617676,376,diss_bike3.mp4
9712,1068,1085.3333320617676,377,diss_bike3.mp4
9777,1068,1091.3333320617676,380,diss_bike3.mp4
9841,1068,1099.3333320617676,385,diss_bike3.mp4
9912,1068,1113.3333320617676,395,diss_bike3.mp4
9976,1068,1126.3333320617676,404,diss_bike3.mp4
9992,1068,1129.3333320617676,405,diss_bike3.mp4
10185,1068,1101.3333320617676,396,diss_bike3.mp4
10241,1068,1051.3333320617676,383,diss_bike3.mp4
10312,1068,944.3333320617676,360,diss_bike3.mp4
10377,1068,804.3333320617676,333,diss_bike3.mp4
10441,1068,735.3333320617676,320,diss_bike3.mp4
10512,1068,686.3333320617676,317,diss_bike3.mp4
10585,1068,639.3333320617676,327,diss_bike3.mp4
10648,1068,606.3333320617676,336,diss_bike3.mp4
10721,1068,594.3333320617676,336,diss_bike3.mp4
10793,1068,562.3333320617676,338,diss_bike3.mp4
10929,1068,520.3333320617676,338,diss_bike3.mp4
11001,1068,468.3333320617676,337,diss_bike3.mp4
11065,1068,430.3333320617676,330,diss_bike3.mp4
11137,1068,398.3333320617676,326,diss_bike3.mp4
11201,1068,361.3333320617676,326,diss_bike3.mp4
11273,1068,320.3333320617676,333,diss_bike3.mp4
11345,1068,290.3333320617676,344,diss_bike3.mp4
11353,1068,286.3333320617676,345,diss_bike3.mp4
11425,1068,270.3333320617676,354,diss_bike3.mp4
11481,1068,266.3333320617676,360,diss_bike3.mp4
11553,1068,264.3333320617676,364,diss_bike3.mp4
11769,1068,259.3333320617676,333,diss_bike3.mp4
11825,1068,251.3333320617676,326,diss_bike3.mp4
11889,1068,249.3333320617676,303,diss_bike3.mp4
11961,1068,264.3333320617676,220,diss_bike3.mp4
12033,1068,302.3333320617676,163,diss_bike3.mp4
12041,1068,306.3333320617676,160,diss_bike3.mp4
12105,1068,326.3333320617676,144,diss_bike3.mp4
12177,1068,346.3333320617676,133,diss_bike3.mp4
12241,1068,361.3333320617676,126,diss_bike3.mp4
12377,1068,394.3333320617676,123,diss_bike3.mp4
12441,1068,409.3333320617676,133,diss_bike3.mp4
12521,1068,432.3333320617676,155,diss_bike3.mp4
12585,1068,438.3333320617676,174,diss_bike3.mp4
12657,1068,438.3333320617676,194,diss_bike3.mp4
12721,1068,436.3333320617676,216,diss_bike3.mp4
12793,1068,430.3333320617676,263,diss_bike3.mp4
12873,1068,429.3333320617676,315,diss_bike3.mp4
12937,1068,429.3333320617676,346,diss_bike3.mp4
13009,1068,433.3333320617676,370,diss_bike3.mp4
13081,1068,442.3333320617676,385,diss_bike3.mp4
13145,1068,456.3333320617676,392,diss_bike3.mp4
13209,1068,475.3333320617676,393,diss_bike3.mp4
13345,1068,539.3333320617676,350,diss_bike3.mp4
13417,1068,553.3333320617676,294,diss_bike3.mp4
13489,1068,570.3333320617676,255,diss_bike3.mp4
13561,1068,591.3333320617676,215,diss_bike3.mp4
13625,1068,605.3333320617676,197,diss_bike3.mp4
13633,1068,608.3333320617676,196,diss_bike3.mp4
13697,1068,629.3333320617676,190,diss_bike3.mp4
13769,1068,661.3333320617676,186,diss_bike3.mp4
13841,1068,676.3333320617676,187,diss_bike3.mp4
13913,1068,686.3333320617676,201,diss_bike3.mp4
13969,1068,696.3333320617676,235,diss_bike3.mp4
14041,1068,706.3333320617676,290,diss_bike3.mp4
14177,1068,710.3333320617676,358,diss_bike3.mp4
14241,1068,710.3333320617676,401,diss_bike3.mp4
0,1063,644.3333320617676,404,diss_bike3.mp4
88,1063,643.3333320617676,405,diss_bike3.mp4
160,1063,642.3333320617676,406,diss_bike3.mp4
416,1063,641.3333320617676,407,diss_bike3.mp4
488,1063,640.3333320617676,407,diss_bike3.mp4
552,1063,632.3333320617676,405,diss_bike3.mp4
624,1063,603.3333320617676,388,diss_bike3.mp4
688,1063,590.3333320617676,368,diss_bike3.mp4
696,1063,590.3333320617676,366,diss_bike3.mp4
760,1063,584.3333320617676,337,diss_bike3.mp4
832,1063,575.3333320617676,313,diss_bike3.mp4
904,1063,575.3333320617676,261,diss_bike3.mp4
984,1063,575.3333320617676,197,diss_bike3.mp4
1048,1063,571.3333320617676,181,diss_bike3.mp4
1112,1063,568.3333320617676,180,diss_bike3.mp4
1440,1063,566.3333320617676,172,diss_bike3.mp4
1488,1063,561.3333320617676,160,diss_bike3.mp4
1568,1063,556.3333320617676,154,diss_bike3.mp4
1633,1063,518.3333320617676,137,diss_bike3.mp4
1704,1063,451.3333320617676,125,diss_bike3.mp4
1776,1063,361.3333320617676,126,diss_bike3.mp4
1848,1063,290.3333320617676,146,diss_bike3.mp4
1912,1063,250.3333320617676,174,diss_bike3.mp4
1984,1063,219.3333320617676,213,diss_bike3.mp4
2056,1063,202.3333320617676,252,diss_bike3.mp4
2128,1063,202.3333320617676,300,diss_bike3.mp4
2136,1063,204.3333320617676,305,diss_bike3.mp4
2201,1063,239.3333320617676,346,diss_bike3.mp4
2272,1063,308.3333320617676,387,diss_bike3.mp4
2408,1063,482.3333320617676,410,diss_bike3.mp4
2464,1063,542.3333320617676,410,diss_bike3.mp4
2537,1063,621.3333320617676,397,diss_bike3.mp4
2609,1063,671.3333320617676,388,diss_bike3.mp4
2680,1063,705.3333320617676,380,diss_bike3.mp4
2745,1063,744.3333320617676,365,diss_bike3.mp4
2817,1063,769.3333320617676,342,diss_bike3.mp4
2897,1063,790.3333320617676,327,diss_bike3.mp4
3025,1063,822.3333320617676,302,diss_bike3.mp4
3089,1063,831.3333320617676,298,diss_bike3.mp4
3193,1063,832.3333320617676,298,diss_bike3.mp4
3313,1063,833.3333320617676,298,diss_bike3.mp4
3433,1063,834.3333320617676,298,diss_bike3.mp4
3497,1063,840.3333320617676,296,diss_bike3.mp4
3553,1063,846.3333320617676,295,diss_bike3.mp4
3625,1063,860.3333320617676,295,diss_bike3.mp4
3682,1063,873.3333320617676,295,diss_bike3.mp4
3753,1063,883.3333320617676,305,diss_bike3.mp4
3825,1063,902.3333320617676,327,diss_bike3.mp4
3889,1063,916.3333320617676,345,diss_bike3.mp4
3969,1063,926.3333320617676,365,diss_bike3.mp4
4033,1063,933.3333320617676,377,diss_bike3.mp4
4113,1063,941.3333320617676,395,diss_bike3.mp4
4169,1063,946.3333320617676,406,diss_bike3.mp4
4313,1063,991.3333320617676,323,diss_bike3.mp4
4385,1063,1012.3333320617676,296,diss_bike3.mp4
4457,1063,1016.3333320617676,266,diss_bike3.mp4
4529,1063,1018.3333320617676,251,diss_bike3.mp4
4585,1063,1010.3333320617676,236,diss_bike3.mp4
4657,1063,996.3333320617676,231,diss_bike3.mp4
4785,1063,965.3333320617676,231,diss_bike3.mp4
4865,1063,955.3333320617676,242,diss_bike3.mp4
4937,1063,935.3333320617676,294,diss_bike3.mp4
5001,1063,935.3333320617676,340,diss_bike3.mp4
5065,1063,935.3333320617676,386,diss_bike3.mp4
5209,1063,938.3333320617676,450,diss_bike3.mp4
5281,1063,949.3333320617676,481,diss_bike3.mp4
5353,1063,968.3333320617676,501,diss_bike3.mp4
5417,1063,984.3333320617676,514,diss_bike3.mp4
5489,1063,1004.3333320617676,527,diss_bike3.mp4
5561,1063,1021.3333320617676,538,diss_bike3.mp4
5633,1063,1031.3333320617676,553,diss_bike3.mp4
5697,1063,1039.3333320617676,571,diss_bike3.mp4
5761,1063,1042.3333320617676,586,diss_bike3.mp4
5889,1063,1006.3333320617676,608,diss_bike3.mp4
5961,1063,983.3333320617676,616,diss_bike3.mp4
6033,1063,943.3333320617676,623,diss_bike3.mp4
6105,1063,899.3333320617676,631,diss_bike3.mp4
6169,1063,874.3333320617676,640,diss_bike3.mp4
6193,1063,859.3333320617676,644,diss_bike3.mp4
6259,1063,841.3333320617676,647,diss_bike3.mp4
6313,1063,835.3333320617676,647,diss_bike3.mp4
6385,1063,831.3333320617676,647,diss_bike3.mp4
6417,1063,830.3333320617676,647,diss_bike3.mp4
6521,1063,842.3333320617676,633,diss_bike3.mp4
6585,1063,874.3333320617676,618,diss_bike3.mp4
6657,1063,923.3333320617676,612,diss_bike3.mp4
6793,1063,1035.3333320617676,567,diss_bike3.mp4
6841,1063,1032.3333320617676,543,diss_bike3.mp4
6921,1063,971.3333320617676,502,diss_bike3.mp4
6985,1063,924.3333320617676,488,diss_bike3.mp4
7121,1063,860.3333320617676,455,diss_bike3.mp4
7129,1063,860.3333320617676,453,diss_bike3.mp4
7201,1063,856.3333320617676,437,diss_bike3.mp4
7265,1063,856.3333320617676,417,diss_bike3.mp4
7337,1063,854.3333320617676,394,diss_bike3.mp4
7401,1063,838.3333320617676,367,diss_bike3.mp4
7473,1063,793.3333320617676,334,diss_bike3.mp4
7545,1063,712.3333320617676,296,diss_bike3.mp4
7609,1063,666.3333320617676,271,diss_bike3.mp4
7681,1063,649.3333320617676,257,diss_bike3.mp4
7753,1063,624.3333320617676,245,diss_bike3.mp4
7817,1063,608.3333320617676,240,diss_bike3.mp4
7962,1063,589.3333320617676,234,diss_bike3.mp4
8033,1063,576.3333320617676,228,diss_bike3.mp4
8097,1063,566.3333320617676,227,diss_bike3.mp4
8169,1063,558.3333320617676,227,diss_bike3.mp4
8241,1063,538.3333320617676,236,diss_bike3.mp4
8313,1063,515.3333320617676,244,diss_bike3.mp4
8377,1063,499.3333320617676,247,diss_bike3.mp4
8449,1063,473.3333320617676,252,diss_bike3.mp4
8521,1063,445.3333320617676,252,diss_bike3.mp4
8585,1063,416.3333320617676,252,diss_bike3.mp4
8601,1063,410.3333320617676,252,diss_bike3.mp4
8673,1063,378.3333320617676,252,diss_bike3.mp4
8737,1063,352.3333320617676,252,diss_bike3.mp4
8801,1063,335.3333320617676,248,diss_bike3.mp4
8937,1063,316.3333320617676,211,diss_bike3.mp4
8945,1063,315.3333320617676,207,diss_bike3.mp4
9009,1063,313.3333320617676,191,diss_bike3.mp4
9073,1063,312.3333320617676,182,diss_bike3.mp4
9121,1063,311.3333320617676,178,diss_bike3.mp4
9154,1063,311.3333320617676,177,diss_bike3.mp4
9361,1063,316.3333320617676,176,diss_bike3.mp4
9417,1063,338.3333320617676,176,diss_bike3.mp4
9553,1063,475.3333320617676,176,diss_bike3.mp4
9633,1063,561.3333320617676,194,diss_bike3.mp4
9697,1063,592.3333320617676,197,diss_bike3.mp4
9761,1063,598.3333320617676,195,diss_bike3.mp4
9825,1063,601.3333320617676,193,diss_bike3.mp4
9905,1063,605.3333320617676,190,diss_bike3.mp4
9969,1063,611.3333320617676,186,diss_bike3.mp4
10033,1063,616.3333320617676,183,diss_bike3.mp4
10065,1063,618.3333320617676,181,diss_bike3.mp4
10185,1063,619.3333320617676,200,diss_bike3.mp4
10257,1063,619.3333320617676,248,diss_bike3.mp4
10273,1063,619.3333320617676,258,diss_bike3.mp4
10329,1063,619.3333320617676,285,diss_bike3.mp4
10393,1063,619.3333320617676,304,diss_bike3.mp4
10457,1063,619.3333320617676,316,diss_bike3.mp4
10473,1063,620.3333320617676,317,diss_bike3.mp4
10657,1063,619.3333320617676,317,diss_bike3.mp4
10737,1063,610.3333320617676,313,diss_bike3.mp4
10794,1063,603.3333320617676,307,diss_bike3.mp4
10865,1063,591.3333320617676,304,diss_bike3.mp4
10929,1063,573.3333320617676,300,diss_bike3.mp4
11057,1063,551.3333320617676,298,diss_bike3.mp4
11137,1063,546.3333320617676,315,diss_bike3.mp4
11209,1063,534.3333320617676,372,diss_bike3.mp4
11273,1063,516.3333320617676,422,diss_bike3.mp4
11345,1063,500.3333320617676,458,diss_bike3.mp4
11417,1063,498.3333320617676,482,diss_bike3.mp4
11489,1063,508.3333320617676,491,diss_bike3.mp4
11561,1063,566.3333320617676,486,diss_bike3.mp4
11625,1063,631.3333320617676,480,diss_bike3.mp4
11697,1063,676.3333320617676,478,diss_bike3.mp4
11769,1063,695.3333320617676,482,diss_bike3.mp4
11841,1063,718.3333320617676,494,diss_bike3.mp4
11905,1063,750.3333320617676,504,diss_bike3.mp4
11985,1063,820.3333320617676,511,diss_bike3.mp4
12049,1063,892.3333320617676,500,diss_bike3.mp4
12121,1063,932.3333320617676,494,diss_bike3.mp4
12194,1063,949.3333320617676,491,diss_bike3.mp4
12257,1063,963.3333320617676,472,diss_bike3.mp4
12329,1063,973.3333320617676,460,diss_bike3.mp4
12401,1063,979.3333320617676,437,diss_bike3.mp4
12457,1063,979.3333320617676,432,diss_bike3.mp4
12530,1063,980.3333320617676,423,diss_bike3.mp4
12601,1063,981.3333320617676,417,diss_bike3.mp4
12673,1063,981.3333320617676,410,diss_bike3.mp4
12745,1063,979.3333320617676,394,diss_bike3.mp4
12809,1063,972.3333320617676,376,diss_bike3.mp4
12881,1063,960.3333320617676,361,diss_bike3.mp4
12953,1063,954.3333320617676,355,diss_bike3.mp4
12961,1063,953.3333320617676,355,diss_bike3.mp4
13210,1063,958.3333320617676,355,diss_bike3.mp4
13266,1063,986.3333320617676,377,diss_bike3.mp4
13281,1063,993.3333320617676,382,diss_bike3.mp4
13345,1063,1014.3333320617676,396,diss_bike3.mp4
13418,1063,1036.3333320617676,408,diss_bike3.mp4
13482,1063,1054.3333320617676,417,diss_bike3.mp4
13554,1063,1076.3333320617676,425,diss_bike3.mp4
13618,1063,1090.3333320617676,430,diss_bike3.mp4
13754,1063,1111.3333320617676,451,diss_bike3.mp4
13818,1063,1115.3333320617676,466,diss_bike3.mp4
13882,1063,1119.3333320617676,485,diss_bike3.mp4
13954,1063,1123.3333320617676,498,diss_bike3.mp4
14090,1063,1142.3333320617676,527,diss_bike3.mp4
14154,1063,1151.3333320617676,538,diss_bike3.mp4
14218,1063,1158.3333320617676,544,diss_bike3.mp4
14250,1063,1160.3333320617676,546,diss_bike3.mp4
14426,1063,1133.3333320617676,493,diss_bike3.mp4
14498,1063,1089.3333320617676,440,diss_bike3.mp4
14562,1063,1081.3333320617676,430,diss_bike3.mp4
