verifToken,stimuli_id,source_id,media_a_id,source_a,created_at,source_name_vote,reversed,source_position_vote,bl,bd,nb_replay
li6qvnvm,1089,5569,44539,diss_car12.mp4,1647615871,1,,1,8,180,1
li6qvnvm,1102,5561,44531,diss_Walking.mp4,1647615917,1,,1,8,180,1
li6qvnvm,1084,5564,44534,diss_building1.mp4,1647615933,1,,1,8,180,2
li6qvnvm,1094,5556,44526,diss_ManRunning1.mp4,1647615955,1,,1,8,180,1
li6qvnvm,1093,5555,44525,diss_Girl2.mp4,1647615974,1,,1,8,180,2
li6qvnvm,1096,5572,44542,diss_person22.mp4,1647615994,1,,1,8,180,2
li6qvnvm,1092,5554,44524,diss_Girl1.mp4,1647616019,1,,1,8,180,2
li6qvnvm,1100,5573,44543,diss_truck2.mp4,1647616042,1,,1,8,180,3
li6qvnvm,1099,5560,44530,diss_StreetBasketball1.mp4,1647616068,1,,1,8,180,3
li6qvnvm,1083,5563,44533,diss_bike3.mp4,1647616091,1,,1,8,180,2
li6qvnvm,1101,5574,44544,diss_truck3.mp4,1647616117,1,,1,8,180,3
li6qvnvm,1085,5565,44535,diss_building2.mp4,1647616128,1,,1,8,180,2
li6qvnvm,1088,5568,44538,diss_car11.mp4,1647616137,1,,1,8,180,2
li6qvnvm,1095,5557,44527,diss_ManRunning2.mp4,1647616149,1,,1,8,180,2
li6qvnvm,1098,5559,44529,diss_Soccer2.mp4,1647616160,1,,1,8,180,1
li6qvnvm,1082,5562,44532,diss_bike2.mp4,1647616170,1,,1,8,180,1
li6qvnvm,1097,5558,44528,diss_Soccer1.mp4,1647616181,1,,1,8,180,1
li6qvnvm,1081,5553,44523,diss_Basketball.mp4,1647616208,1,,1,8,180,1
li6qvnvm,1086,5566,44536,diss_building3.mp4,1647616231,1,,1,8,180,1
li6qvnvm,1087,5567,44537,diss_building4.mp4,1647616258,1,,1,8,180,1
li6qvnvm,1091,5571,44541,diss_car15.mp4,1647616283,1,,1,8,180,1
li6qvnvm,1090,5570,44540,diss_car13.mp4,1647616296,1,,1,8,180,2
