[gd_scene load_steps=4 format=2]

[ext_resource path="res://Assets/misc-bag-bigger-gray.svg" type="Texture" id=1]
[ext_resource path="res://Bag.gd" type="Script" id=2]

[sub_resource type="RectangleShape2D" id=2]
extents = Vector2( 8, 8 )

[node name="bag" type="Area2D"]
collision_layer = 2
collision_mask = 0
script = ExtResource( 2 )

[node name="Sprite" type="Sprite" parent="."]
position = Vector2( 2, 2 )
scale = Vector2( 0.222222, 0.315789 )
texture = ExtResource( 1 )
centered = false

[node name="CollisionShape2D" type="CollisionPolygon2D" parent="."]
polygon = PoolVector2Array( 8, 0, 16, 8, 8, 16, 0, 8 )

[node name="StaticBody2D" type="StaticBody2D" parent="."]
collision_layer = 2
collision_mask = 0

[node name="CollisionShape2D" type="CollisionShape2D" parent="StaticBody2D"]
position = Vector2( 8, 8 )
shape = SubResource( 2 )

[connection signal="body_entered" from="." to="." method="_on_bag_body_entered"]
[connection signal="body_exited" from="." to="." method="_on_bag_body_exited"]
