[gd_scene load_steps=4 format=2]

[ext_resource path="res://Assets/carezone.png" type="Texture" id=1]
[ext_resource path="res://careArea.gd" type="Script" id=2]

[sub_resource type="RectangleShape2D" id=1]
extents = Vector2( 16, 16 )

[node name="careArea" type="Node2D"]
script = ExtResource( 2 )

[node name="Sprite" type="Sprite" parent="."]
modulate = Color( 0.74902, 0.74902, 0.74902, 1 )
position = Vector2( 24, 24 )
scale = Vector2( 0.75, 0.75 )
texture = ExtResource( 1 )

[node name="Area2D" type="Area2D" parent="."]

[node name="CollisionShape2D" type="CollisionShape2D" parent="Area2D"]
position = Vector2( 24, 24 )
shape = SubResource( 1 )

[node name="Timer" type="Timer" parent="."]

[connection signal="body_entered" from="Area2D" to="." method="_on_Area2D_body_entered"]
[connection signal="body_exited" from="Area2D" to="." method="_on_Area2D_body_exited"]
[connection signal="timeout" from="Timer" to="." method="_on_Timer_timeout"]
