{
    "white":       "#000000",
    "black":       "#FFFFFF",
    "background":  "#333333",
    "text":        "#404040",
    "placeholder": "#A3A3A3",
    "border":      "#C5CCCF",
    "primary":     "#B366FF",
    "secondary":   "#CC99FF",
    "tertiary":    "#E6CCFF",
    "greenAgree":  "#5CB85C",
    "redDeny":     "#D9544E",
    "yellowSun":   "#F4C242",
    "selected":    "#F3E6FF",
    "avatar":      "#D5DCDF",
    "link":        "#4286F4"
}