{
    "DailyDummy": {
        "members": [
            { "id": 0, "name": "Cleito" },
            { "id": 1, "name": "Cazimiro" },
            { "id": 2, "name": "Eustáquio" },
            { "id": 3, "name": "Fernandinho" },
            { "id": 4, "name": "Ednaldo" }
        ]
    },
    "DayDummy": {
        "dailyList": [
            {
                "id": 1,
                "date": "01/01/0001",
                "isCompleted": true,
                "results": {}
            },
            {
                "id": 2,
                "date": "01/01/0001",
                "isCompleted": true,
                "results": {}
            },
            {
                "id": 3,
                "date": "01/01/0001",
                "isCompleted": false,
                "results": {}
            },
            {
                "id": 4,
                "date": "01/01/0001",
                "isCompleted": false,
                "results": {}
            },
            {
                "id": 5,
                "date": "01/01/0001",
                "isCompleted": false,
                "results": {}
            },
            {
                "id": 6,
                "date": "01/01/0001",
                "isCompleted": false,
                "results": {}
            },
            {
                "id": 7,
                "date": "01/01/0001",
                "isCompleted": false,
                "results": {}
            },
            {
                "id": 8,
                "date": "01/01/0001",
                "isCompleted": false,
                "results": {}
            },
            {
                "id": 9,
                "date": "01/01/0001",
                "isCompleted": false,
                "results": {}
            },
            {
                "id": 10,
                "date": "01/01/0001",
                "isCompleted": false,
                "results": {}
            }
        ]
    },
    "SprintDummy": {
        "project": "GTP",
        "sprintList": [
            {
                "id": 1,
                "date": "10/2018",
                "totalDays": "10",
                "completedDays": "10",
                "isCompleted": true
            },
            {
                "id": 2,
                "date": "11/2018",
                "totalDays": "10",
                "completedDays": "5",
                "isCompleted": false
            },
            {
                "id": 3,
                "date": "12/2018",
                "totalDays": "10",
                "completedDays": "0",
                "isCompleted": false
            },
            {
                "id": 4,
                "date": "01/2019",
                "totalDays": "10",
                "completedDays": "0",
                "isCompleted": false
            }
        ]
    },
    "ProjectDummy": {
        "projectList": [
            {
                "id": 1,
                "name": "CMD",
                "desc": "Claims Medical Discovery",
                "members": [
                    {}, {}, {}, {}, {}, {}, {}, {}
                ]
            },
            {
                "id": 2,
                "name": "GTP",
                "desc": "Global Telematics Project",
                "members": [
                    {}, {}, {}, {}, {}, {}, {}, {}
                ]
            },
            {
                "id": 3,
                "name": "CDB",
                "desc": "Contributory Database",
                "members": [
                    {}, {}, {}, {}, {}, {}, {}, {}
                ]
            }
        ]
    }
}