<svg width="22" height="16" viewBox="0 0 22 16" fill="none" xmlns="http://www.w3.org/2000/svg">
<path d="M20.9938 2.84699C20.7539 1.92316 20.047 1.19559 19.1496 0.948672C17.5229 0.5 11 0.5 11 0.5C11 0.5 4.47715 0.5 2.85041 0.948672C1.95296 1.19563 1.24613 1.92316 1.00623 2.84699C0.570358 4.52148 0.570358 8.01516 0.570358 8.01516C0.570358 8.01516 0.570358 11.5088 1.00623 13.1833C1.24613 14.1071 1.95296 14.8044 2.85041 15.0513C4.47715 15.5 11 15.5 11 15.5C11 15.5 17.5228 15.5 19.1496 15.0513C20.047 14.8044 20.7539 14.1071 20.9938 13.1833C21.4296 11.5088 21.4296 8.01516 21.4296 8.01516C21.4296 8.01516 21.4296 4.52148 20.9938 2.84699ZM8.86665 11.1871V4.84316L14.3185 8.01523L8.86665 11.1871Z" fill="#EFF7FF"/>
</svg>
