i-br-rj-rjo-bar-hl4-01,-,LCR5LIF00,Function,1,1,Normal,PERMANENT,60,NetEngine40E&80E Lawful Interception Function License,2102350AFWP0L3000059,2022-09-09
i-br-rj-rjo-bar-hl4-01,-,LCR5CLCK00,Function,1,1,Normal,PERMANENT,60,NetEngine40E&80E 1588v2 Function License,2102350AFWP0L3000059,2022-09-09
i-br-rj-rjo-bar-hl4-01,-,LCR5QS0100,Resource,32,16,Normal,PERMANENT,60,NetEngine40E Subscribers Quantity(1k Subscribers),2102350AFWP0L3000059,2022-09-09
i-br-rj-rjo-bar-hl4-01,-,LCR5EDSG00,Function,1,1,Normal,PERMANENT,60,NetEngine40E EDSG Function License,2102350AFWP0L3000059,2022-09-09
i-br-rj-rjo-bar-hl4-01,-,LCR5BASUPG00,Function,1,1,Normal,PERMANENT,60,NetEngine40E PPPoE/IPoE Function License,2102350AFWP0L3000059,2022-09-09
i-br-rj-rjo-gsr-hl4-02,-,LCR5LIF00,Function,1,1,Normal,PERMANENT,60,NetEngine40E&80E Lawful Interception Function License,2102350AFWP0L3000031,2022-09-09
i-br-rj-rjo-gsr-hl4-02,-,LCR5CLCK00,Function,1,1,Normal,PERMANENT,60,NetEngine40E&80E 1588v2 Function License,2102350AFWP0L3000031,2022-09-09
i-br-rj-rjo-gsr-hl4-02,-,LCR5QS0100,Resource,64,39,Normal,PERMANENT,60,NetEngine40E Subscribers Quantity(1k Subscribers),2102350AFWP0L3000031,2022-09-09
i-br-rj-rjo-gsr-hl4-02,-,LCR5EDSG00,Function,1,1,Normal,PERMANENT,60,NetEngine40E EDSG Function License,2102350AFWP0L3000031,2022-09-09
i-br-rj-rjo-gsr-hl4-02,-,LCR5BASUPG00,Function,1,1,Normal,PERMANENT,60,NetEngine40E PPPoE/IPoE Function License,2102350AFWP0L3000031,2022-09-09
i-br-rj-nri-nit-hl4-01,-,LCR5LIF00,Function,1,1,Normal,PERMANENT,60,NetEngine40E&80E Lawful Interception Function License,2102350AFWP0L3000057,2022-09-09
i-br-rj-nri-nit-hl4-01,-,LCR5CLCK00,Function,1,1,Normal,PERMANENT,60,NetEngine40E&80E 1588v2 Function License,2102350AFWP0L3000057,2022-09-09
i-br-rj-nri-nit-hl4-01,-,LCR5QS0100,Resource,32,1,Normal,PERMANENT,60,NetEngine40E Subscribers Quantity(1k Subscribers),2102350AFWP0L3000057,2022-09-09
i-br-rj-nri-nit-hl4-01,-,LCR5EDSG00,Function,1,1,Normal,PERMANENT,60,NetEngine40E EDSG Function License,2102350AFWP0L3000057,2022-09-09
i-br-rj-nri-nit-hl4-01,-,LCR5BASUPG00,Function,1,1,Normal,PERMANENT,60,NetEngine40E PPPoE/IPoE Function License,2102350AFWP0L3000057,2022-09-09
i-br-rj-nri-mft-hl5g-01,-,LANGL3VPN01,Function,1,1,Normal,PERMANENT,60,ATN 910C L3VPN Function License,2102350TKJ10L6000578,2022-09-09
i-br-rj-nri-mft-hl5g-01,-,LANG1588V201,Function,1,1,Normal,PERMANENT,60,ATN 910C 1588V2 Packet Synchronization Function License,2102350TKJ10L6000578,2022-09-09
i-br-rj-nri-mft-hl5g-01,-,LANGIPv601,Function,1,1,Normal,PERMANENT,60,ATN 910C IPv6 Function License,2102350TKJ10L6000578,2022-09-09
i-br-rj-nri-mft-hl5g-01,-,LANG1588ACR01,Function,1,1,Normal,PERMANENT,60,ATN 910C 1588V2 ACR Function License,2102350TKJ10L6000578,2022-09-09
i-br-rj-nri-mft-hl5g-01,-,LANGNQA00,Function,1,1,Normal,PERMANENT,60,ATN 910C NQA Function License,2102350TKJ10L6000578,2022-09-09
i-br-rj-nri-mft-hl5g-01,-,LANG8GEPAYG01,Resource,2,2,Normal,PERMANENT,60,ATN 910C Any 8GE/FE Enable License,2102350TKJ10L6000578,2022-09-09
i-br-rj-nri-mft-hl5g-01,-,LANG2XGEPAY01,Resource,2,1,Normal,PERMANENT,60,ATN 910C 2*10GE Enable License,2102350TKJ10L6000578,2022-09-09
i-br-rj-rjo-gsr-hl4-01,-,LCR5LIF00,Function,1,1,Normal,PERMANENT,60,NetEngine40E&80E Lawful Interception Function License,2102350AFWP0L1000071,2022-09-09
i-br-rj-rjo-gsr-hl4-01,-,LCR5CLCK00,Function,1,1,Normal,PERMANENT,60,NetEngine40E&80E 1588v2 Function License,2102350AFWP0L1000071,2022-09-09
i-br-rj-rjo-gsr-hl4-01,-,LCR5QS0100,Resource,32,10,Normal,PERMANENT,60,NetEngine40E Subscribers Quantity(1k Subscribers),2102350AFWP0L1000071,2022-09-09
i-br-rj-rjo-gsr-hl4-01,-,LCR5EDSG00,Function,1,1,Normal,PERMANENT,60,NetEngine40E EDSG Function License,2102350AFWP0L1000071,2022-09-09
i-br-rj-rjo-gsr-hl4-01,-,LCR5BASUPG00,Function,1,1,Normal,PERMANENT,60,NetEngine40E PPPoE/IPoE Function License,2102350AFWP0L1000071,2022-09-09
i-br-rj-rjo-gsr-hl4-03,-,LCR5LIF00,Function,1,1,Normal,PERMANENT,60,NetEngine40E&80E Lawful Interception Function License,2102350AFWP0L1000045,2022-09-09
i-br-rj-rjo-gsr-hl4-03,-,LCR5QS0100,Resource,32,3,Normal,PERMANENT,60,NetEngine40E Subscribers Quantity(1k Subscribers),2102350AFWP0L1000045,2022-09-09
i-br-rj-rjo-gsr-hl4-03,-,LCR5EDSG00,Function,1,1,Normal,PERMANENT,60,NetEngine40E EDSG Function License,2102350AFWP0L1000045,2022-09-09
i-br-rj-rjo-gsr-hl4-03,-,LCR5DAA00,Function,1,1,Normal,PERMANENT,60,NetEngine40E&80E DAA Function License,2102350AFWP0L1000045,2022-09-09
i-br-rj-rjo-gsr-hl4-03,-,LCR5BASUPG00,Function,1,1,Normal,PERMANENT,60,NetEngine40E PPPoE/IPoE Function License,2102350AFWP0L1000045,2022-09-09
i-br-rj-rjo-gsr-hl4-03,-,LCR5L2TP00,Function,1,1,Normal,PERMANENT,60,NetEngine40E&80E L2TP Function License,2102350AFWP0L1000045,2022-09-09
