Error on MMLTask_PS_AUDIT_20220426_020009.tar.gz.txt at 2022-04-26:
3 columns passed, passed data had 10196 columns

 ######################################## 
Error on MMLTask_PS_AUDIT_20220426_020009.txt at 2022-04-26:
3 columns passed, passed data had 10195 columns

 ######################################## 
Error on MMLTask_PS_AUDIT_20220426_020009.txt at 2022-04-26:
3 columns passed, passed data had 10195 columns

 ######################################## 
Error on MMLTask_PS_AUDIT_20220426_020009.txt at Unknown Hour:
unsupported operand type(s) for -: 'list' and 'int'

 ######################################## 
Error on MMLTask_PS_AUDIT_20220426_020009.txt at 2022-04-26:
list index out of range

 ######################################## 
Error on MMLTask_PS_AUDIT_20220426_020009.txt at Unknown Hour:
'tuple' object has no attribute 'strip'

 ######################################## 
Error on MMLTask_PS_AUDIT_20220426_020009.txt at Unknown Hour:
too many values to unpack (expected 2)

 ######################################## 
Error on MMLTask_PS_AUDIT_20220426_020009.txt at Unknown Hour:
too many values to unpack (expected 2)

 ######################################## 
Error on MMLTask_PS_AUDIT_20220426_020009.txt at Unknown Hour:
write() argument must be str, not tuple

 ######################################## 
Error on MMLTask_PS_AUDIT_20220426_020009.txt at Unknown Hour:
list index out of range

 ######################################## 
Error on MMLTask_PS_AUDIT_20220426_020009.txt at Unknown Hour:
list index out of range

 ######################################## 
Error on MMLTask_PS_AUDIT_20220426_020009.txt at 2022-04-27:
3 columns passed, passed data had 10195 columns

 ######################################## 
Error on MMLTask_PS_AUDIT_20220426_020009.txt at 2022-04-28:
data type 'String' not understood

 ######################################## 
Error on MMLTask_PS_AUDIT_20220428_020010.tar.gz.txt at Unknown Hour:
'list' object has no attribute 'strip'

 ######################################## 
Error on MMLTask_PS_AUDIT_20220428_020010.tar.gz.txt at 2022-05-03:
list index out of range

 ######################################## 
Error on MMLTask_PS_AUDIT_20220428_020010.tar.gz.txt at 2022-05-03:
list index out of range

 ######################################## 
Error on MMLTask_PS_AUDIT_20220428_020010.tar.gz.txt at 2022-05-03:
list index out of range

 ######################################## 
Error on MMLTask_PS_AUDIT_20220428_020010.tar.gz.txt at 2022-05-03:
list index out of range

 ######################################## 
Error on MMLTask_PS_AUDIT_20220428_020010.tar.gz.txt at 2022-05-03:
argument of type 'int' is not iterable

 ######################################## 
Error on MMLTask_PS_AUDIT_20220428_020010.tar.gz.txt at Unknown Hour:
too many values to unpack (expected 2)

 ######################################## 
Error on MMLTask_PS_AUDIT_V2_20220504_133331.tar.gz.txt at 2022-05-04 13:00:00:
3 columns passed, passed data had 6 columns

 ######################################## 
Error on MMLTask_PS_AUDIT_V2_20220504_133331.tar.gz.txt at 2022-05-04 13:00:00:
18 columns passed, passed data had 2658 columns

 ######################################## 
Error on MMLTask_PS_AUDIT_V2_20220504_133331.tar.gz.txt at 2022-05-04 13:00:00:
18 columns passed, passed data had 2658 columns

 ######################################## 
Error on MMLTask_PS_AUDIT_V2_20220504_133331.tar.gz.txt at 2022-05-04 13:00:00:
18 columns passed, passed data had 2658 columns

 ######################################## 
Error on MMLTask_PS_AUDIT_V2_20220504_171152.tar.gz.txt at 2022-05-04 17:00:00:
list index out of range

 ######################################## 
Error on MMLTask_PS_AUDIT_V2_20220504_171152.tar.gz.txt at 2022-05-04 17:00:00:
list index out of range

 ######################################## 
Error on MMLTask_PS_AUDIT_V2_20220504_171152.tar.gz.txt at 2022-05-04 17:00:00:
list index out of range

 ######################################## 
Error on MMLTask_PS_AUDIT_V2_20220504_171152.tar.gz.txt at 2022-05-04 17:00:00:
list index out of range

 ######################################## 
