<?xml version="1.0" encoding="utf-8"?>
<!-- Generator: Adobe Illustrator 22.1.0, SVG Export Plug-In . SVG Version: 6.00 Build 0)  -->
<svg version="1.1" id="Livello_1" xmlns="http://www.w3.org/2000/svg" xmlns:xlink="http://www.w3.org/1999/xlink" x="0px" y="0px"
	 viewBox="0 0 500 500" style="enable-background:new 0 0 500 500;" xml:space="preserve">
<style type="text/css">
	.st0{fill:#4446ED;}
</style>
<g>
	<g>
		
			<rect x="329.7" y="126.2" transform="matrix(0.7071 -0.7072 0.7072 0.7071 9.0986 292.2568)" class="st0" width="55.2" height="17.9"/>
	</g>
	<g>
		<path class="st0" d="M413.9,300.5c0,109.1-88.5,197.6-197.1,197.6c-109.1,0-197.6-88.5-197.6-197.6
			c0-109.1,88.5-197.6,197.6-197.6C325.3,102.9,413.9,191.4,413.9,300.5z M373.2,300.5c0-86.3-70.2-156.4-156.4-156.4
			c-86.3,0-156.4,70.1-156.4,156.4c0,86.3,70.1,157,156.4,157C303.1,457.5,373.2,386.8,373.2,300.5z"/>
	</g>
	<g>
		<path class="st0" d="M414.2,1.8c-36.8,0-66.7,29.8-66.7,66.7s29.8,66.7,66.7,66.7s66.7-29.8,66.7-66.7S451,1.8,414.2,1.8z
			 M414.2,110.8c-22.4,0-40.6-18.2-40.6-40.6s18.2-40.6,40.6-40.6s40.6,18.2,40.6,40.6S436.7,110.8,414.2,110.8z"/>
	</g>
</g>
</svg>
