<svg xmlns="http://www.w3.org/2000/svg" version="1" viewBox="0 0 128 128">
  <path d="M107 100L94 39l-1-1L66 1l-2-1-2 1-27 37-1 1-13 61v1l1 1 41 26h2l41-26 1-1v-1zm-7-12L86 63l5-16 9 41zM66 8l23 32-6 19-17-31V8zm-2 24l18 32-11 34H57L46 64l18-32zM62 8v20L45 59l-6-19L62 8zM37 47l5 16-14 25 9-41zm7 21l9 31H27l17-30zm-14 34h24l6 19-30-19zm34 18l-5-18h11l-6 18zm4 1l6-19h24l-30 19zm7-23l9-30 17 30H75z"/>
</svg>
