<?xml version="1.0" encoding="UTF-8"?>
<svg width="32px" height="32px" viewBox="0 0 32 32" version="1.1" xmlns="http://www.w3.org/2000/svg" xmlns:xlink="http://www.w3.org/1999/xlink">
    <!-- Generator: Sketch 52.1 (67048) - http://www.bohemiancoding.com/sketch -->
    <title>Avatar</title>
    <desc>Created with Sketch.</desc>
    <defs>
        <circle id="path-1" cx="16" cy="16" r="16"></circle>
    </defs>
    <g id="Page-1" stroke="none" stroke-width="1" fill="none" fill-rule="evenodd">
        <g id="Noku-Account-Logged">
            <g id="Avatar">
                <mask id="mask-2" fill="white">
                    <use xlink:href="#path-1"></use>
                </mask>
                <use id="Path" fill="#FFFFFF" xlink:href="#path-1"></use>
                <polygon id="Fill-1" fill="#A7A8FF" mask="url(#mask-2)" points="0 32 32 32 32 0 0 0"></polygon>
                <path d="M13.5009564,28.8050702 C13.0427876,28.8050702 12.6679253,29.1799324 12.6679253,29.6381013 L12.6679253,32.1371591 L14.3339876,32.1371591 L14.3339876,29.6381013 C14.3339876,29.1799324 13.9591253,28.8050702 13.5009564,28.8050702 Z M18.499072,28.8050702 C18.0409031,28.8050702 17.6660409,29.1799324 17.6660409,29.6381013 C17.6660409,30.0962347 18.0409031,30.4710969 18.499072,30.4710969 C18.9572409,30.4710969 19.3320676,30.0962347 19.3320676,29.6381013 C19.3320676,29.1799324 18.9572409,28.8050702 18.499072,28.8050702 Z M21.393792,22.2138524 C19.8370987,23.218688 17.9888142,23.8069902 16.0000142,23.8069902 C14.0111787,23.8069902 12.1629298,23.218688 10.6062009,22.2138524 C7.09196089,22.5835236 4.337792,25.5250702 4.337792,29.1382969 L4.337792,29.6381013 C4.337792,31.0177636 5.457152,32.1371591 6.83681422,32.1371591 L11.0018987,32.1371591 L11.0018987,28.8050702 C11.0018987,27.8835413 11.7463964,27.1390791 12.6679253,27.1390791 L19.3320676,27.1390791 C20.2535609,27.1390791 20.9980942,27.8835413 20.9980942,28.8050702 L20.9980942,32.1371591 L25.1631787,32.1371591 C26.5428409,32.1371591 27.6622364,31.0177636 27.6622364,29.6381013 L27.6622364,29.1382969 C27.6622364,25.5250702 24.9080676,22.5835236 21.393792,22.2138524 Z M13.5009564,16.3098524 L14.1257031,14.4355413 L16.0000142,13.8107947 L14.1257031,13.1860124 L13.5009564,11.3117369 L12.8762098,13.1860124 L11.0018987,13.8107947 L12.8762098,14.4355413 L13.5009564,16.3098524 Z M9.75236978,12.5612658 C9.75236978,11.4106524 10.8717653,10.4787413 12.2514276,10.4787413 L19.7485653,10.4787413 C21.1282631,10.4787413 22.2476231,11.4106524 22.2476231,12.5612658 L22.2476231,13.8107947 C22.2476231,16.5701547 20.0089031,18.8088747 17.2495076,18.8088747 L14.7504853,18.8088747 C11.9911253,18.8088747 9.75236978,16.5701547 9.75236978,13.8107947 L9.75236978,12.5612658 Z M7.66984533,17.142848 L8.37270756,17.142848 C9.65868089,20.0844302 12.5846542,22.140928 16.0000142,22.140928 C19.4153742,22.140928 22.341312,20.0844302 23.6272853,17.142848 L24.3301831,17.142848 C24.788352,17.142848 25.1631787,16.7680213 25.1631787,16.3098524 L25.1631787,11.3117369 C25.1631787,10.8536036 24.788352,10.4787413 24.3301831,10.4787413 L23.6272853,10.4787413 C22.341312,7.53712356 19.4153742,5.48062578 16.0000142,5.48062578 C12.5846542,5.48062578 9.65868089,7.53712356 8.37270756,10.4787413 L7.66984533,10.4787413 C7.21167644,10.4787413 6.83681422,10.8536036 6.83681422,11.3117369 L6.83681422,16.3098524 C6.83681422,16.7680213 7.21167644,17.142848 7.66984533,17.142848 Z" id="Fill-2" fill="#FFFFFF" mask="url(#mask-2)"></path>
            </g>
        </g>
    </g>
</svg>