Glenn Downing

Novak

Shakira

Ahmed Gheith

Klivans

Taylor Swift

Shakira

Selena Gomez

Alison Norman

Beyonce

Katy Perry

Novak

Sarah Abraham

Selena Gomez

Justin Bieber

Ahmed Gheith

Novak

Shakira

Taylor Swift

Sarah Abraham

Rihanna

Selena Gomez

Brad Pitt

Michael Scott

Harry Styles

Novak

Sarah Abraham

Brad Pitt

Brad Pitt
Leonardo DiCaprio
Justin Bieber
Beyonce
Taylor Swift
Tom Holland
Zendaya

Brad Pitt

Glenn Downing

Taylor Swift
