852382 8380 525
403097 299130 441
594266 402939 470
995024 680576 525
470644 362906 449
517359 426135 470
10378 785278 509
966697 691642 525
511844 779568 509
57347 478283 449
975276 288374 525
481917 98959 449
402379 498994 449
322629 200670 443
888660 858518 445
681779 927304 525
884138 775283 525
503246 155837 449
104485 766375 509
116416 993834 525
837403 893871 525
249749 887322 525
807970 821751 450
133301 755376 509
341842 720924 509
837782 541536 509
296722 551580 470
182372 451935 449
120130 960083 525
384254 936216 525
435487 141871 449
119991 159690 383
758732 542328 509
822092 313775 509
304097 194416 443
843772 616742 525
350392 824727 509
590657 267785 470
308113 599050 470
840320 934933 476
452813 523883 470
248808 580921 470
271710 72218 443
477897 560964 470
508123 559828 470
467677 962610 525
282334 162639 443
126055 100146 354
117614 236167 443
110175 924687 525
306656 774879 509
434263 866028 525
816290 432246 509
354250 283325 441
847360 511563 525
351577 269217 441
241783 733121 509
66955 25533 340
160303 385042 443
719343 408618 509
842124 673120 525
886322 528502 525
801549 699286 504
519016 478444 470
516951 518762 333
718113 370075 509
523859 152796 470
107079 854221 525
836630 266837 509
604433 218615 470
792107 463281 509
19131 971099 525
733880 783408 468
171283 540569 470
437213 64934 449
175152 357737 443
812373 259532 509
112055 114005 323
218074 679037 509
567986 439046 470
666894 409457 509
414005 586384 470
311060 808720 509
767065 971085 525
859551 87122 525
284744 564886 470
996586 458613 525
819418 221370 509
446592 246679 449
985763 977529 427
62309 630208 509
379985 257876 441
200347 422875 449
30053 693392 509
692437 393697 509
153268 960051 525
920833 157046 525
450793 640210 509
862768 587063 525
978364 615077 525
831456 917137 525
123838 809292 509
312682 714598 509
379707 821488 509
463733 919140 525
50372 514369 470
451058 147439 449
246119 446773 449
228861 514693 470
389702 614223 470
590816 151942 470
37986 835732 509
208385 981664 525
57390 994262 525
636441 432868 509
505447 78129 449
830474 441862 509
899907 26289 525
64272 781253 509
167165 967435 525
263028 487199 449
453373 560887 470
674032 913750 525
154523 796743 509
485546 733187 509
975756 793439 525
474227 22483 449
565657 842701 525
12446 428628 449
287762 195117 443
799020 289304 509
989461 853923 507
490441 500426 426
207512 950287 525
4298 868399 525
109747 110258 310
642684 662439 429
614199 591747 403
340530 91103 443
549670 869315 525
282284 467244 449
425867 775160 509
850131 896842 445
366651 266686 441
367891 429753 449
26460 384134 443
386931 744152 509
857861 986217 507
323990 601570 470
927316 407325 525
105439 505602 449
586503 266803 470
98554 225001 386
698263 278986 509
17561 100606 351
788991 62039 509
680719 345612 509
453437 624358 470
464404 869973 525
573226 419198 470
51152 512267 470
427024 601318 470
600849 946141 525
568085 393909 470
787725 943518 525
424066 279681 449
240524 122969 443
934317 66931 525
799214 789284 468
181470 749564 509
658853 979005 525
896976 479463 525
909615 366706 525
924400 900240 476
201837 258171 443
209551 553376 470
265784 499086 449
653199 60840 509
798194 761689 468
209960 312762 443
791017 336836 509
945988 944358 383
722568 255258 509
378562 973236 525
157275 289310 443
312125 586356 470
207403 145289 383
558333 715377 509
998644 946453 458
381638 219730 443
751179 928178 525
247367 208706 443
338761 119167 443
465835 277012 449
220668 666496 509
623865 202637 470
454785 377278 449
274218 961568 525
94820 995979 525
213765 750781 509
