410292 347541 449
705659 606834 509
83615 559747 470
797059 352341 509
895400 315321 525
356287 594379 470
183493 882047 525
747400 361492 509
962975 573711 525
386689 592965 470
322931 541790 470
498484 292121 449
77428 362073 443
977547 673698 525
825868 341685 509
532486 459768 470
945925 873705 507
990253 397396 525
990694 551956 525
925000 740253 525
77052 730447 509
649974 45454 509
180321 390385 443
190613 663116 509
424706 131050 449
336562 418627 449
836331 55076 509
451494 369483 449
750961 559255 509
852249 676758 525
987140 737783 525
662387 368217 509
970120 797712 525
816220 545478 509
863508 176261 525
890703 818365 525
177004 764681 509
524160 40577 470
450886 311220 449
711400 706026 380
835287 991612 525
482249 667634 509
426380 73657 449
86796 195333 383
446554 731561 509
713092 857125 525
40635 467872 449
620698 571376 447
231401 956295 525
392789 248306 441
475759 706356 509
769527 788988 437
203653 961240 525
630218 557888 509
744490 438554 509
190370 819906 509
829322 881328 525
956730 211944 525
884816 352257 525
44005 928401 525
389317 495966 449
912445 208392 525
821270 161415 509
849076 561055 525
528224 939721 525
814201 685816 504
276397 781115 509
487249 160701 449
198022 155907 383
752180 648403 504
551266 558053 421
649324 483531 509
239398 680716 509
827245 191260 509
399638 413725 449
890734 133650 525
565023 114082 470
992476 649999 525
247434 420119 449
986893 20343 525
595583 664250 509
837724 547374 509
739792 534589 509
95342 569783 470
930640 260302 525
560299 580273 421
364932 247379 441
106700 30812 354
272824 672209 509
700405 904761 525
850545 746702 525
324652 77983 443
877723 736814 525
491296 178206 449
508882 282311 449
859655 610961 525
284273 871886 525
313275 341926 384
779383 974374 525
240143 248230 368
384528 240869 441
449336 847822 525
720271 883108 525
290460 531624 470
199037 212152 373
610574 363478 470
812018 169344 509
724936 46290 509
239425 762029 509
965016 827349 525
264602 90408 443
135938 945701 525
433928 886155 525
363425 7463 443
926905 401534 525
869136 135080 525
556167 33987 470
317291 221249 443
355045 930779 525
953524 963131 414
489160 487835 382
724373 273989 509
593678 999802 525
36877 404649 443
418992 411745 387
756362 839014 525
225898 46833 386
506811 722097 509
715558 968952 525
678001 120032 509
490030 640056 509
705912 833846 468
569147 191985 470
54139 965585 525
776612 730188 468
850350 12522 525
630790 897618 525
668400 777385 504
196584 262870 443
240683 482903 449
921446 20014 525
302938 556377 470
846978 567017 525
662973 823967 504
675655 726114 504
32878 252768 443
970141 247120 525
156827 529222 470
401009 787075 509
638639 41258 509
654146 750500 504
762329 876514 525
940363 676230 525
675680 961506 525
905273 437932 525
636375 840955 525
176267 585665 470
399132 986903 525
406858 134101 443
55454 383510 443
453004 136577 449
266323 473113 449
472862 161725 449
103991 182193 383
683507 445241 509
949875 940426 383
221709 210047 386
654303 529902 509
169829 679196 509
649924 291916 509
119272 768305 509
970509 971072 458
267936 108207 443
899907 310534 525
547014 398950 470
800149 73405 509
923021 638606 525
854921 222149 525
11093 103558 351
14867 145704 375
401226 981410 525
340018 636233 509
740519 829468 468
722473 840568 525
380052 712421 509
66032 633788 509
515283 339009 470
259356 209014 443
38267 474335 449
438681 423903 387
522949 254038 470
965852 432341 525
394089 56243 443
894497 690183 525
259539 922296 525
958107 508731 525
929220 831124 525
101039 415884 449
15513 976762 525
729975 655488 504
