530476 488018 470
414021 105024 449
996500 345847 525
867743 263780 525
416230 480032 444
432399 982943 525
45563 112405 354
737780 255417 509
426093 137880 449
656606 161389 509
720180 524041 509
701472 374647 509
447994 423291 418
627460 758298 504
141526 677 354
993529 87075 525
159601 776399 509
138749 582405 470
678756 561053 509
360777 814727 509
111573 429345 449
231666 411873 449
446943 898507 525
524370 679107 509
15625 356909 443
442253 423477 418
82839 208204 383
853602 927046 476
466457 41913 449
855666 955801 507
694216 538886 509
472780 459639 444
524934 872953 525
177474 647287 509
653209 485963 509
696948 104299 509
171005 4447 383
152784 533946 470
621907 668526 509
567522 885669 525
257786 656645 509
834336 780666 468
975862 42107 525
898328 786644 525
45206 62593 340
759586 487114 509
613622 5471 470
466575 405740 449
276829 17627 443
961275 640279 525
161926 340367 443
41664 31994 324
630547 76181 509
823364 435895 509
525103 935555 525
303714 387811 441
78744 11371 351
202337 235227 443
166033 759732 509
922066 44029 525
439519 817801 509
19828 273354 443
719138 88979 509
71378 916449 525
735676 547700 509
676400 670162 385
379324 976736 525
103471 525268 470
643390 875747 525
985630 11400 525
126007 350522 443
942266 786204 525
763598 681868 504
312246 613084 470
55398 809617 509
261544 505687 449
861852 918328 476
332241 209965 443
112011 699439 509
663967 930326 525
961742 973041 458
533868 972079 525
660282 82920 509
520920 830290 509
220842 664836 509
224453 241413 443
377256 132799 443
978414 915580 507
581942 547578 421
260010 128041 443
804868 881559 525
391657 814459 509
697233 628615 442
324906 599801 470
821357 144463 509
456952 339351 449
369847 249625 441
29570 51537 324
477766 133821 449
813904 743877 468
928962 246782 525
48461 341042 443
853316 670262 525
575224 932425 525
261029 444085 449
250376 433558 449
722433 223767 509
488797 66667 449
748589 566130 509
831266 309595 509
227623 715739 509
627801 47203 509
324845 26427 443
968168 525066 525
831340 753813 468
7195 179266 383
105135 61465 351
87693 141387 354
522599 807513 509
288852 230769 407
777057 625613 509
888774 114639 525
653828 404212 509
368218 216887 443
955857 642947 525
398183 686576 509
298407 307028 371
878835 534694 525
659914 924694 525
446552 464305 444
466950 633653 509
965384 797517 525
852099 848643 357
921020 611235 525
585805 104163 470
32373 142592 375
779697 584455 509
861131 572701 525
983472 589087 525
663559 256980 509
179001 313938 443
997260 182037 525
678094 654154 442
379239 249008 441
359977 890468 525
691035 937824 525
67242 920585 525
218318 463079 449
901468 149043 525
346857 415202 449
649470 564777 509
866085 557030 525
318853 120829 443
366123 822356 509
407211 843603 525
955231 34201 525
361750 789138 509
404064 402461 343
209764 658610 509
53059 290819 443
464568 667593 509
400720 127641 443
953983 241777 525
897596 539607 525
21858 991666 525
208093 871660 525
276905 263152 407
577687 824486 509
724199 78229 509
628289 256375 509
284972 504846 449
965790 756423 525
688999 215343 509
709859 310667 509
601531 8764 470
575778 457175 470
593628 188396 470
425937 225424 449
405193 43132 443
144671 352074 443
324068 316951 371
649423 194499 509
678218 680692 380
522977 399519 470
655107 22818 509
547911 293688 470
290243 236043 407
170498 709058 509
143793 801074 509
99589 257367 443
132411 585314 470
43927 439965 449
249578 114994 443
561622 176514 470
956626 231133 525
802011 886894 525
994175 277002 525
646036 166639 509
148252 520437 470
929747 755338 525
