153771 654253 509
49650 415014 449
187868 141806 383
416037 695078 509
302854 385429 441
828550 699263 504
903531 623453 525
50434 96316 351
901824 346554 525
920981 759088 525
486292 552644 470
256744 748360 509
616788 61007 470
985343 577113 525
231955 307676 407
490328 817289 509
523680 504169 470
997691 889350 507
517007 944156 525
478850 58141 449
775766 871957 525
483942 616948 470
917828 97017 525
752818 447199 509
926610 210797 525
719812 121393 509
217407 320804 443
989620 532224 525
580895 824842 509
15429 979204 525
718114 873102 525
331980 404033 441
974325 240168 525
571823 140098 470
147040 479402 449
436313 655237 509
531367 78849 470
72811 521631 470
270171 919958 525
49932 258550 443
469477 414976 444
170888 443911 449
450419 981220 525
236788 477523 449
480262 840855 525
387416 879954 525
663347 711475 504
326648 795929 509
704907 333143 509
559807 918204 525
447251 54820 449
17220 554558 470
965680 677385 525
600854 621177 447
111891 665284 509
438024 591474 470
581176 489 470
118480 401829 443
321477 616879 470
909259 693836 525
293705 512038 470
53612 322623 443
285848 179585 443
4239 462379 449
221785 748816 509
410225 931757 525
432601 56011 449
478515 186407 449
417318 495703 444
205813 272894 443
173002 492519 449
742581 285466 509
936272 41198 525
564238 631678 509
133219 148611 375
744440 956854 525
319344 269226 407
853162 484994 525
818758 587482 509
493401 463472 426
95915 13707 351
858288 736297 525
783366 243644 509
63827 959994 525
167434 188904 365
692718 247050 509
521809 811176 509
905794 473019 525
386749 489025 449
736098 685295 504
536919 441787 470
808658 517001 509
118578 110264 349
475885 410550 444
52666 78761 351
289035 99371 443
815780 700837 504
349430 945695 525
215347 743590 509
148614 794280 509
470841 514969 470
917788 681563 525
812735 122197 509
344914 256608 407
131014 828302 509
400877 596165 470
332566 495069 449
852884 241409 525
933958 280250 525
470655 881592 525
779732 972130 525
337785 540592 470
492574 120520 449
323266 469522 449
315051 453288 449
453921 572970 470
811518 366518 509
241958 280409 407
201065 734232 509
900805 38666 525
934199 608305 525
251705 617492 470
644429 443736 509
57172 927886 525
782515 610889 509
612106 241499 470
959349 166122 525
693186 75906 509
564451 271455 470
388119 843003 525
419416 5088 449
751485 535355 509
325171 607755 470
933689 444701 525
264494 286417 407
544766 690219 509
815312 66850 509
668864 133651 509
428733 737466 509
730363 42524 509
655586 230471 509
696797 417033 509
187390 979919 525
924191 126677 525
654372 971586 525
919863 540147 525
73926 781062 509
836264 350330 509
517735 989894 525
277274 26429 443
546727 306843 470
338552 890444 525
294814 587340 470
389647 714948 509
579119 120773 470
437375 893771 525
784250 513894 509
304645 30401 443
892614 782297 525
475317 80405 449
85627 869005 525
966668 862180 507
326568 985635 525
78170 680300 509
515374 927043 525
831939 504101 509
121008 58165 354
823643 629322 504
69665 432415 449
95012 167961 383
742609 321232 509
668054 779798 504
887391 163675 525
396509 863495 525
955016 780864 525
640779 62091 509
572582 406386 470
672986 295007 509
901179 360024 525
145850 342041 443
744175 109662 509
548371 247057 470
682817 809733 504
606081 97937 470
139352 664281 509
538134 316735 470
428005 139353 449
64443 892306 525
998596 544226 525
133783 753818 509
397468 342710 441
67009 212077 383
280882 988557 525
241144 324721 407
602624 225399 470
915027 789682 525
357543 652284 509
826878 835702 419
503455 58019 449
994100 229406 525
