1286 2541 209
6938 5546 262
7023 3312 262
4368 4539 215
4449 890 238
2819 6701 262
7692 6939 257
6355 2188 262
5767 7525 262
3526 4931 238
3098 2461 217
6235 3527 262
4936 6330 262
4134 6687 262
6662 3939 262
2689 7947 262
6479 5979 262
5493 5501 130
5642 6212 262
6391 2090 262
3453 5561 238
791 3144 217
4499 3497 238
1684 6617 262
3022 5209 238
3547 2471 217
4021 1781 238
2349 5308 238
4462 6482 262
3995 3123 238
2420 3035 217
7422 898 262
5365 1266 238
2750 3007 217
7477 1140 262
5096 7282 262
6701 5886 262
2425 7551 262
1383 460 182
6168 756 238
5668 6066 218
3226 6040 238
4199 5575 236
3348 660 217
4056 3694 238
135 2828 209
6728 7556 257
3725 4093 189
5173 2827 238
3451 1001 217
318 546 144
282 3370 217
2784 7059 262
2921 518 217
7518 5440 262
1273 5186 238
7857 4498 262
3225 4055 238
6424 2924 262
1067 2480 209
6617 5553 262
5307 1697 238
1460 5383 238
5789 6632 262
4561 5591 236
3984 4879 215
6136 4266 236
248 5271 238
3324 7520 262
5788 2841 238
4959 3412 238
4378 1168 238
7910 3955 262
1574 6333 262
6878 6992 257
5164 1847 238
4544 6822 262
3543 6003 238
557 5683 238
986 5117 238
3273 4970 238
6347 5760 262
5587 6595 262
3031 5262 238
6114 5170 236
4454 7425 262
582 832 171
592 4843 238
1138 6517 262
7527 4367 262
5509 4691 210
6213 2052 262
7864 1755 262
4407 4772 197
3789 1744 238
6241 7061 257
3065 4587 238
1173 651 182
7533 555 262
2264 1999 183
5724 6718 262
5775 2657 238
3901 2718 238
7499 5038 262
1234 7026 262
1404 6742 262
68 3969 238
5146 4283 215
2075 5904 238
1055 5864 238
7647 3647 262
1276 2712 209
4585 2448 238
7714 4118 262
7354 6330 257
6116 1430 238
5047 242 238
4086 5299 215
2959 3585 199
6688 4192 262
6962 91 262
2934 3381 199
411 4431 238
7663 2486 262
2334 5069 238
349 1980 182
715 1624 182
1043 1652 182
424 5109 238
5769 7777 262
3438 236 217
1206 484 182
477 1644 182
2134 3435 217
1580 821 182
3978 541 238
5263 3263 238
3921 5674 236
7693 7935 221
159 2026 182
1356 507 182
358 6422 262
6482 5752 262
73 3257 217
2860 5841 238
7386 6297 257
2428 591 183
3132 2904 217
6586 5265 262
2690 165 209
6085 3020 238
705 3348 217
6282 977 262
1021 5975 238
5264 5531 192
4352 6619 262
2389 1061 183
5040 870 238
6813 5113 262
4127 1672 238
2953 7864 262
7969 1733 262
4806 3100 238
988 3392 217
4717 3678 238
3556 2801 217
6697 4261 262
2500 1330 209
1589 7872 262
3656 6852 262
5402 8 238
5470 7790 262
5420 2510 238
5012 4232 215
7622 5490 262
2256 6926 262
5353 6576 262
658 2158 182
1675 1646 180
5549 2743 238
1675 1105 182
5544 4723 210
1717 4395 238
6052 7657 262
4267 6060 236
6509 1668 262
6067 330 238
5810 7838 262
7191 2821 262
422 3164 217
4662 2677 238
2090 2014 157
1252 7099 262
4171 7278 262
5096 6072 236
2021 3122 217
3528 3916 238
4196 5244 215
310 6600 262
1252 4576 238

