%YAML 1.1
%TAG !u! tag:unity3d.com,2011:
--- !u!29 &1
OcclusionCullingSettings:
  m_ObjectHideFlags: 0
  serializedVersion: 2
  m_OcclusionBakeSettings:
    smallestOccluder: 5
    smallestHole: 0.25
    backfaceThreshold: 100
  m_SceneGUID: 00000000000000000000000000000000
  m_OcclusionCullingData: {fileID: 0}
--- !u!104 &2
RenderSettings:
  m_ObjectHideFlags: 0
  serializedVersion: 9
  m_Fog: 0
  m_FogColor: {r: 0.5, g: 0.5, b: 0.5, a: 1}
  m_FogMode: 3
  m_FogDensity: 0.01
  m_LinearFogStart: 0
  m_LinearFogEnd: 300
  m_AmbientSkyColor: {r: 0.212, g: 0.227, b: 0.259, a: 1}
  m_AmbientEquatorColor: {r: 0.114, g: 0.125, b: 0.133, a: 1}
  m_AmbientGroundColor: {r: 0.047, g: 0.043, b: 0.035, a: 1}
  m_AmbientIntensity: 1
  m_AmbientMode: 0
  m_SubtractiveShadowColor: {r: 0.42, g: 0.478, b: 0.627, a: 1}
  m_SkyboxMaterial: {fileID: 10304, guid: 0000000000000000f000000000000000, type: 0}
  m_HaloStrength: 0.5
  m_FlareStrength: 1
  m_FlareFadeSpeed: 3
  m_HaloTexture: {fileID: 0}
  m_SpotCookie: {fileID: 10001, guid: 0000000000000000e000000000000000, type: 0}
  m_DefaultReflectionMode: 0
  m_DefaultReflectionResolution: 128
  m_ReflectionBounces: 1
  m_ReflectionIntensity: 1
  m_CustomReflection: {fileID: 0}
  m_Sun: {fileID: 0}
  m_IndirectSpecularColor: {r: 0.12731749, g: 0.13414757, b: 0.1210787, a: 1}
  m_UseRadianceAmbientProbe: 0
--- !u!157 &3
LightmapSettings:
  m_ObjectHideFlags: 0
  serializedVersion: 12
  m_GIWorkflowMode: 1
  m_GISettings:
    serializedVersion: 2
    m_BounceScale: 1
    m_IndirectOutputScale: 1
    m_AlbedoBoost: 1
    m_EnvironmentLightingMode: 0
    m_EnableBakedLightmaps: 1
    m_EnableRealtimeLightmaps: 0
  m_LightmapEditorSettings:
    serializedVersion: 12
    m_Resolution: 2
    m_BakeResolution: 40
    m_AtlasSize: 1024
    m_AO: 0
    m_AOMaxDistance: 1
    m_CompAOExponent: 1
    m_CompAOExponentDirect: 0
    m_ExtractAmbientOcclusion: 0
    m_Padding: 2
    m_LightmapParameters: {fileID: 0}
    m_LightmapsBakeMode: 1
    m_TextureCompression: 1
    m_FinalGather: 0
    m_FinalGatherFiltering: 1
    m_FinalGatherRayCount: 256
    m_ReflectionCompression: 2
    m_MixedBakeMode: 2
    m_BakeBackend: 1
    m_PVRSampling: 1
    m_PVRDirectSampleCount: 32
    m_PVRSampleCount: 512
    m_PVRBounces: 2
    m_PVREnvironmentSampleCount: 256
    m_PVREnvironmentReferencePointCount: 2048
    m_PVRFilteringMode: 1
    m_PVRDenoiserTypeDirect: 1
    m_PVRDenoiserTypeIndirect: 1
    m_PVRDenoiserTypeAO: 1
    m_PVRFilterTypeDirect: 0
    m_PVRFilterTypeIndirect: 0
    m_PVRFilterTypeAO: 0
    m_PVREnvironmentMIS: 1
    m_PVRCulling: 1
    m_PVRFilteringGaussRadiusDirect: 1
    m_PVRFilteringGaussRadiusIndirect: 5
    m_PVRFilteringGaussRadiusAO: 2
    m_PVRFilteringAtrousPositionSigmaDirect: 0.5
    m_PVRFilteringAtrousPositionSigmaIndirect: 2
    m_PVRFilteringAtrousPositionSigmaAO: 1
    m_ExportTrainingData: 0
    m_TrainingDataDestination: TrainingData
    m_LightProbeSampleCountMultiplier: 4
  m_LightingDataAsset: {fileID: 0}
  m_LightingSettings: {fileID: 0}
--- !u!196 &4
NavMeshSettings:
  serializedVersion: 2
  m_ObjectHideFlags: 0
  m_BuildSettings:
    serializedVersion: 2
    agentTypeID: 0
    agentRadius: 0.5
    agentHeight: 2
    agentSlope: 45
    agentClimb: 0.4
    ledgeDropHeight: 0
    maxJumpAcrossDistance: 0
    minRegionArea: 2
    manualCellSize: 0
    cellSize: 0.16666667
    manualTileSize: 0
    tileSize: 256
    accuratePlacement: 0
    maxJobWorkers: 0
    preserveTilesOutsideBounds: 0
    debug:
      m_Flags: 0
  m_NavMeshData: {fileID: 0}
--- !u!1 &167167012
GameObject:
  m_ObjectHideFlags: 0
  m_CorrespondingSourceObject: {fileID: 0}
  m_PrefabInstance: {fileID: 0}
  m_PrefabAsset: {fileID: 0}
  serializedVersion: 6
  m_Component:
  - component: {fileID: 167167013}
  m_Layer: 0
  m_Name: RoomsTransforms
  m_TagString: Untagged
  m_Icon: {fileID: 0}
  m_NavMeshLayer: 0
  m_StaticEditorFlags: 0
  m_IsActive: 1
--- !u!4 &167167013
Transform:
  m_ObjectHideFlags: 0
  m_CorrespondingSourceObject: {fileID: 0}
  m_PrefabInstance: {fileID: 0}
  m_PrefabAsset: {fileID: 0}
  m_GameObject: {fileID: 167167012}
  m_LocalRotation: {x: 0, y: 0, z: 0, w: 1}
  m_LocalPosition: {x: 0, y: 0, z: 0}
  m_LocalScale: {x: 1, y: 1, z: 1}
  m_ConstrainProportionsScale: 0
  m_Children:
  - {fileID: 369038675}
  - {fileID: 333938920}
  m_Father: {fileID: 0}
  m_RootOrder: 5
  m_LocalEulerAnglesHint: {x: 0, y: 0, z: 0}
--- !u!1 &333938919
GameObject:
  m_ObjectHideFlags: 0
  m_CorrespondingSourceObject: {fileID: 0}
  m_PrefabInstance: {fileID: 0}
  m_PrefabAsset: {fileID: 0}
  serializedVersion: 6
  m_Component:
  - component: {fileID: 333938920}
  m_Layer: 0
  m_Name: CameraCyberPunk
  m_TagString: Untagged
  m_Icon: {fileID: 0}
  m_NavMeshLayer: 0
  m_StaticEditorFlags: 0
  m_IsActive: 1
--- !u!4 &333938920
Transform:
  m_ObjectHideFlags: 0
  m_CorrespondingSourceObject: {fileID: 0}
  m_PrefabInstance: {fileID: 0}
  m_PrefabAsset: {fileID: 0}
  m_GameObject: {fileID: 333938919}
  m_LocalRotation: {x: -0, y: 1, z: -0, w: 0.0000029504295}
  m_LocalPosition: {x: -0.12302649, y: 0.2104932, z: 0.5053196}
  m_LocalScale: {x: 0.4, y: 0.4, z: 0.4}
  m_ConstrainProportionsScale: 1
  m_Children: []
  m_Father: {fileID: 167167013}
  m_RootOrder: 1
  m_LocalEulerAnglesHint: {x: 0, y: 180, z: 0}
--- !u!1 &369038674
GameObject:
  m_ObjectHideFlags: 0
  m_CorrespondingSourceObject: {fileID: 0}
  m_PrefabInstance: {fileID: 0}
  m_PrefabAsset: {fileID: 0}
  serializedVersion: 6
  m_Component:
  - component: {fileID: 369038675}
  m_Layer: 0
  m_Name: CameraLiberty
  m_TagString: Untagged
  m_Icon: {fileID: 0}
  m_NavMeshLayer: 0
  m_StaticEditorFlags: 0
  m_IsActive: 1
--- !u!4 &369038675
Transform:
  m_ObjectHideFlags: 0
  m_CorrespondingSourceObject: {fileID: 0}
  m_PrefabInstance: {fileID: 0}
  m_PrefabAsset: {fileID: 0}
  m_GameObject: {fileID: 369038674}
  m_LocalRotation: {x: 0, y: 0, z: 0, w: 1}
  m_LocalPosition: {x: 1.953, y: 0, z: -0.513}
  m_LocalScale: {x: 0.15, y: 0.15, z: 0.15}
  m_ConstrainProportionsScale: 1
  m_Children: []
  m_Father: {fileID: 167167013}
  m_RootOrder: 0
  m_LocalEulerAnglesHint: {x: 0, y: 0, z: 0}
--- !u!20 &538280016 stripped
Camera:
  m_CorrespondingSourceObject: {fileID: 6729733697846145658, guid: 3588d1b03be1afb4aa2728c947bb3db3,
    type: 3}
  m_PrefabInstance: {fileID: 1670359486}
  m_PrefabAsset: {fileID: 0}
--- !u!1 &1493599300
GameObject:
  m_ObjectHideFlags: 0
  m_CorrespondingSourceObject: {fileID: 0}
  m_PrefabInstance: {fileID: 0}
  m_PrefabAsset: {fileID: 0}
  serializedVersion: 6
  m_Component:
  - component: {fileID: 1493599304}
  - component: {fileID: 1493599303}
  - component: {fileID: 1493599302}
  - component: {fileID: 1493599301}
  m_Layer: 0
  m_Name: Ground
  m_TagString: Untagged
  m_Icon: {fileID: 0}
  m_NavMeshLayer: 0
  m_StaticEditorFlags: 0
  m_IsActive: 1
--- !u!64 &1493599301
MeshCollider:
  m_ObjectHideFlags: 0
  m_CorrespondingSourceObject: {fileID: 0}
  m_PrefabInstance: {fileID: 0}
  m_PrefabAsset: {fileID: 0}
  m_GameObject: {fileID: 1493599300}
  m_Material: {fileID: 0}
  m_IsTrigger: 0
  m_Enabled: 1
  serializedVersion: 4
  m_Convex: 0
  m_CookingOptions: 30
  m_Mesh: {fileID: 10209, guid: 0000000000000000e000000000000000, type: 0}
--- !u!23 &1493599302
MeshRenderer:
  m_ObjectHideFlags: 0
  m_CorrespondingSourceObject: {fileID: 0}
  m_PrefabInstance: {fileID: 0}
  m_PrefabAsset: {fileID: 0}
  m_GameObject: {fileID: 1493599300}
  m_Enabled: 1
  m_CastShadows: 1
  m_ReceiveShadows: 1
  m_DynamicOccludee: 1
  m_StaticShadowCaster: 0
  m_MotionVectors: 1
  m_LightProbeUsage: 1
  m_ReflectionProbeUsage: 1
  m_RayTracingMode: 2
  m_RayTraceProcedural: 0
  m_RenderingLayerMask: 1
  m_RendererPriority: 0
  m_Materials:
  - {fileID: 2100000, guid: 31321ba15b8f8eb4c954353edc038b1d, type: 2}
  m_StaticBatchInfo:
    firstSubMesh: 0
    subMeshCount: 0
  m_StaticBatchRoot: {fileID: 0}
  m_ProbeAnchor: {fileID: 0}
  m_LightProbeVolumeOverride: {fileID: 0}
  m_ScaleInLightmap: 1
  m_ReceiveGI: 1
  m_PreserveUVs: 0
  m_IgnoreNormalsForChartDetection: 0
  m_ImportantGI: 0
  m_StitchLightmapSeams: 1
  m_SelectedEditorRenderState: 3
  m_MinimumChartSize: 4
  m_AutoUVMaxDistance: 0.5
  m_AutoUVMaxAngle: 89
  m_LightmapParameters: {fileID: 0}
  m_SortingLayerID: 0
  m_SortingLayer: 0
  m_SortingOrder: 0
  m_AdditionalVertexStreams: {fileID: 0}
--- !u!33 &1493599303
MeshFilter:
  m_ObjectHideFlags: 0
  m_CorrespondingSourceObject: {fileID: 0}
  m_PrefabInstance: {fileID: 0}
  m_PrefabAsset: {fileID: 0}
  m_GameObject: {fileID: 1493599300}
  m_Mesh: {fileID: 10209, guid: 0000000000000000e000000000000000, type: 0}
--- !u!4 &1493599304
Transform:
  m_ObjectHideFlags: 0
  m_CorrespondingSourceObject: {fileID: 0}
  m_PrefabInstance: {fileID: 0}
  m_PrefabAsset: {fileID: 0}
  m_GameObject: {fileID: 1493599300}
  m_LocalRotation: {x: 0, y: 0, z: 0, w: 1}
  m_LocalPosition: {x: 0, y: 0, z: 0}
  m_LocalScale: {x: 0.5, y: 0.5, z: 0.5}
  m_ConstrainProportionsScale: 1
  m_Children: []
  m_Father: {fileID: 0}
  m_RootOrder: 2
  m_LocalEulerAnglesHint: {x: 0, y: 0, z: 0}
--- !u!1001 &1670359486
PrefabInstance:
  m_ObjectHideFlags: 0
  serializedVersion: 2
  m_Modification:
    m_TransformParent: {fileID: 0}
    m_Modifications:
    - target: {fileID: 1636572264, guid: 3588d1b03be1afb4aa2728c947bb3db3, type: 3}
      propertyPath: m_Height
      value: 1.7
      objectReference: {fileID: 0}
    - target: {fileID: 826823419066366457, guid: 3588d1b03be1afb4aa2728c947bb3db3,
        type: 3}
      propertyPath: m_Enabled
      value: 0
      objectReference: {fileID: 0}
    - target: {fileID: 2598001724698844548, guid: 3588d1b03be1afb4aa2728c947bb3db3,
        type: 3}
      propertyPath: m_Enabled
      value: 0
      objectReference: {fileID: 0}
    - target: {fileID: 3389612738078385292, guid: 3588d1b03be1afb4aa2728c947bb3db3,
        type: 3}
      propertyPath: m_Enabled
      value: 1
      objectReference: {fileID: 0}
    - target: {fileID: 3389612738078385292, guid: 3588d1b03be1afb4aa2728c947bb3db3,
        type: 3}
      propertyPath: m_RightHandSnapTurnAction.m_Reference
      value: 
      objectReference: {fileID: -8525429354371678379, guid: c348712bda248c246b8c49b3db54643f,
        type: 3}
    - target: {fileID: 3389612738078385292, guid: 3588d1b03be1afb4aa2728c947bb3db3,
        type: 3}
      propertyPath: m_RightHandSnapTurnAction.m_UseReference
      value: 1
      objectReference: {fileID: 0}
    - target: {fileID: 3979543390820169209, guid: 3588d1b03be1afb4aa2728c947bb3db3,
        type: 3}
      propertyPath: m_Name
      value: Player
      objectReference: {fileID: 0}
    - target: {fileID: 4937322553788792489, guid: 3588d1b03be1afb4aa2728c947bb3db3,
        type: 3}
      propertyPath: m_LocalPosition.z
      value: 0
      objectReference: {fileID: 0}
    - target: {fileID: 4937322553788792489, guid: 3588d1b03be1afb4aa2728c947bb3db3,
        type: 3}
      propertyPath: m_LocalRotation.w
      value: 1
      objectReference: {fileID: 0}
    - target: {fileID: 4937322553788792489, guid: 3588d1b03be1afb4aa2728c947bb3db3,
        type: 3}
      propertyPath: m_LocalRotation.x
      value: 0
      objectReference: {fileID: 0}
    - target: {fileID: 4937322553788792489, guid: 3588d1b03be1afb4aa2728c947bb3db3,
        type: 3}
      propertyPath: m_LocalRotation.y
      value: 0
      objectReference: {fileID: 0}
    - target: {fileID: 4937322553788792489, guid: 3588d1b03be1afb4aa2728c947bb3db3,
        type: 3}
      propertyPath: m_LocalRotation.z
      value: 0
      objectReference: {fileID: 0}
    - target: {fileID: 4937322553788792489, guid: 3588d1b03be1afb4aa2728c947bb3db3,
        type: 3}
      propertyPath: m_LocalEulerAnglesHint.y
      value: 0
      objectReference: {fileID: 0}
    - target: {fileID: 5077381893996809725, guid: 3588d1b03be1afb4aa2728c947bb3db3,
        type: 3}
      propertyPath: m_RootOrder
      value: 0
      objectReference: {fileID: 0}
    - target: {fileID: 5077381893996809725, guid: 3588d1b03be1afb4aa2728c947bb3db3,
        type: 3}
      propertyPath: m_LocalPosition.x
      value: 0
      objectReference: {fileID: 0}
    - target: {fileID: 5077381893996809725, guid: 3588d1b03be1afb4aa2728c947bb3db3,
        type: 3}
      propertyPath: m_LocalPosition.y
      value: 0
      objectReference: {fileID: 0}
    - target: {fileID: 5077381893996809725, guid: 3588d1b03be1afb4aa2728c947bb3db3,
        type: 3}
      propertyPath: m_LocalPosition.z
      value: -1
      objectReference: {fileID: 0}
    - target: {fileID: 5077381893996809725, guid: 3588d1b03be1afb4aa2728c947bb3db3,
        type: 3}
      propertyPath: m_LocalRotation.w
      value: 1
      objectReference: {fileID: 0}
    - target: {fileID: 5077381893996809725, guid: 3588d1b03be1afb4aa2728c947bb3db3,
        type: 3}
      propertyPath: m_LocalRotation.x
      value: 0
      objectReference: {fileID: 0}
    - target: {fileID: 5077381893996809725, guid: 3588d1b03be1afb4aa2728c947bb3db3,
        type: 3}
      propertyPath: m_LocalRotation.y
      value: 0
      objectReference: {fileID: 0}
    - target: {fileID: 5077381893996809725, guid: 3588d1b03be1afb4aa2728c947bb3db3,
        type: 3}
      propertyPath: m_LocalRotation.z
      value: 0
      objectReference: {fileID: 0}
    - target: {fileID: 5077381893996809725, guid: 3588d1b03be1afb4aa2728c947bb3db3,
        type: 3}
      propertyPath: m_LocalEulerAnglesHint.x
      value: 0
      objectReference: {fileID: 0}
    - target: {fileID: 5077381893996809725, guid: 3588d1b03be1afb4aa2728c947bb3db3,
        type: 3}
      propertyPath: m_LocalEulerAnglesHint.y
      value: 0
      objectReference: {fileID: 0}
    - target: {fileID: 5077381893996809725, guid: 3588d1b03be1afb4aa2728c947bb3db3,
        type: 3}
      propertyPath: m_LocalEulerAnglesHint.z
      value: 0
      objectReference: {fileID: 0}
    m_RemovedComponents: []
  m_SourcePrefab: {fileID: 100100000, guid: 3588d1b03be1afb4aa2728c947bb3db3, type: 3}
--- !u!1 &2035020854
GameObject:
  m_ObjectHideFlags: 0
  m_CorrespondingSourceObject: {fileID: 0}
  m_PrefabInstance: {fileID: 0}
  m_PrefabAsset: {fileID: 0}
  serializedVersion: 6
  m_Component:
  - component: {fileID: 2035020857}
  - component: {fileID: 2035020856}
  - component: {fileID: 2035020858}
  m_Layer: 0
  m_Name: EventSystem
  m_TagString: Untagged
  m_Icon: {fileID: 0}
  m_NavMeshLayer: 0
  m_StaticEditorFlags: 0
  m_IsActive: 1
--- !u!114 &2035020856
MonoBehaviour:
  m_ObjectHideFlags: 0
  m_CorrespondingSourceObject: {fileID: 0}
  m_PrefabInstance: {fileID: 0}
  m_PrefabAsset: {fileID: 0}
  m_GameObject: {fileID: 2035020854}
  m_Enabled: 1
  m_EditorHideFlags: 0
  m_Script: {fileID: 11500000, guid: 76c392e42b5098c458856cdf6ecaaaa1, type: 3}
  m_Name: 
  m_EditorClassIdentifier: 
  m_FirstSelected: {fileID: 0}
  m_sendNavigationEvents: 1
  m_DragThreshold: 10
--- !u!4 &2035020857
Transform:
  m_ObjectHideFlags: 0
  m_CorrespondingSourceObject: {fileID: 0}
  m_PrefabInstance: {fileID: 0}
  m_PrefabAsset: {fileID: 0}
  m_GameObject: {fileID: 2035020854}
  m_LocalRotation: {x: 0, y: 0, z: 0, w: 1}
  m_LocalPosition: {x: 0, y: 0, z: 0}
  m_LocalScale: {x: 1, y: 1, z: 1}
  m_ConstrainProportionsScale: 0
  m_Children: []
  m_Father: {fileID: 0}
  m_RootOrder: 4
  m_LocalEulerAnglesHint: {x: 0, y: 0, z: 0}
--- !u!114 &2035020858
MonoBehaviour:
  m_ObjectHideFlags: 0
  m_CorrespondingSourceObject: {fileID: 0}
  m_PrefabInstance: {fileID: 0}
  m_PrefabAsset: {fileID: 0}
  m_GameObject: {fileID: 2035020854}
  m_Enabled: 1
  m_EditorHideFlags: 0
  m_Script: {fileID: 11500000, guid: ab68ce6587aab0146b8dabefbd806791, type: 3}
  m_Name: 
  m_EditorClassIdentifier: 
  m_SendPointerHoverToParent: 1
  m_ClickSpeed: 0.3
  m_MoveDeadzone: 0.6
  m_RepeatDelay: 0.5
  m_RepeatRate: 0.1
  m_TrackedDeviceDragThresholdMultiplier: 1.4
  m_TrackedScrollDeltaMultiplier: 5
  m_ActiveInputMode: 1
  m_MaxTrackedDeviceRaycastDistance: 1000
  m_EnableXRInput: 1
  m_EnableMouseInput: 1
  m_EnableTouchInput: 1
  m_PointAction: {fileID: 2869410428622933342, guid: c348712bda248c246b8c49b3db54643f,
    type: 3}
  m_LeftClickAction: {fileID: 1855836014308820768, guid: c348712bda248c246b8c49b3db54643f,
    type: 3}
  m_MiddleClickAction: {fileID: -6289560987278519447, guid: c348712bda248c246b8c49b3db54643f,
    type: 3}
  m_RightClickAction: {fileID: -2562941478296515153, guid: c348712bda248c246b8c49b3db54643f,
    type: 3}
  m_ScrollWheelAction: {fileID: 5825226938762934180, guid: c348712bda248c246b8c49b3db54643f,
    type: 3}
  m_NavigateAction: {fileID: -7967456002180160679, guid: c348712bda248c246b8c49b3db54643f,
    type: 3}
  m_SubmitAction: {fileID: 3994978066732806534, guid: c348712bda248c246b8c49b3db54643f,
    type: 3}
  m_CancelAction: {fileID: 2387711382375263438, guid: c348712bda248c246b8c49b3db54643f,
    type: 3}
  m_EnableBuiltinActionsAsFallback: 1
  m_EnableGamepadInput: 1
  m_EnableJoystickInput: 1
  m_HorizontalAxis: Horizontal
  m_VerticalAxis: Vertical
  m_SubmitButton: Submit
  m_CancelButton: Cancel
--- !u!1001 &2088014184
PrefabInstance:
  m_ObjectHideFlags: 0
  serializedVersion: 2
  m_Modification:
    m_TransformParent: {fileID: 0}
    m_Modifications:
    - target: {fileID: 4800151344633587198, guid: 4188fe90520808b41b23c5cf99a0a2f2,
        type: 3}
      propertyPath: m_Name
      value: NonNativeKeyboard_ARtistaVariant
      objectReference: {fileID: 0}
    - target: {fileID: 4800151344644828682, guid: 4188fe90520808b41b23c5cf99a0a2f2,
        type: 3}
      propertyPath: m_Pivot.x
      value: 0.5
      objectReference: {fileID: 0}
    - target: {fileID: 4800151344644828682, guid: 4188fe90520808b41b23c5cf99a0a2f2,
        type: 3}
      propertyPath: m_Pivot.y
      value: 0.5
      objectReference: {fileID: 0}
    - target: {fileID: 4800151344644828682, guid: 4188fe90520808b41b23c5cf99a0a2f2,
        type: 3}
      propertyPath: m_RootOrder
      value: 1
      objectReference: {fileID: 0}
    - target: {fileID: 4800151344644828682, guid: 4188fe90520808b41b23c5cf99a0a2f2,
        type: 3}
      propertyPath: m_AnchorMax.x
      value: 0
      objectReference: {fileID: 0}
    - target: {fileID: 4800151344644828682, guid: 4188fe90520808b41b23c5cf99a0a2f2,
        type: 3}
      propertyPath: m_AnchorMax.y
      value: 0
      objectReference: {fileID: 0}
    - target: {fileID: 4800151344644828682, guid: 4188fe90520808b41b23c5cf99a0a2f2,
        type: 3}
      propertyPath: m_AnchorMin.x
      value: 0
      objectReference: {fileID: 0}
    - target: {fileID: 4800151344644828682, guid: 4188fe90520808b41b23c5cf99a0a2f2,
        type: 3}
      propertyPath: m_AnchorMin.y
      value: 0
      objectReference: {fileID: 0}
    - target: {fileID: 4800151344644828682, guid: 4188fe90520808b41b23c5cf99a0a2f2,
        type: 3}
      propertyPath: m_SizeDelta.x
      value: 1250
      objectReference: {fileID: 0}
    - target: {fileID: 4800151344644828682, guid: 4188fe90520808b41b23c5cf99a0a2f2,
        type: 3}
      propertyPath: m_SizeDelta.y
      value: 480
      objectReference: {fileID: 0}
    - target: {fileID: 4800151344644828682, guid: 4188fe90520808b41b23c5cf99a0a2f2,
        type: 3}
      propertyPath: m_LocalScale.x
      value: 0.001
      objectReference: {fileID: 0}
    - target: {fileID: 4800151344644828682, guid: 4188fe90520808b41b23c5cf99a0a2f2,
        type: 3}
      propertyPath: m_LocalScale.y
      value: 0.001
      objectReference: {fileID: 0}
    - target: {fileID: 4800151344644828682, guid: 4188fe90520808b41b23c5cf99a0a2f2,
        type: 3}
      propertyPath: m_LocalScale.z
      value: 0.001
      objectReference: {fileID: 0}
    - target: {fileID: 4800151344644828682, guid: 4188fe90520808b41b23c5cf99a0a2f2,
        type: 3}
      propertyPath: m_LocalPosition.x
      value: 0
      objectReference: {fileID: 0}
    - target: {fileID: 4800151344644828682, guid: 4188fe90520808b41b23c5cf99a0a2f2,
        type: 3}
      propertyPath: m_LocalPosition.y
      value: 0
      objectReference: {fileID: 0}
    - target: {fileID: 4800151344644828682, guid: 4188fe90520808b41b23c5cf99a0a2f2,
        type: 3}
      propertyPath: m_LocalPosition.z
      value: 0.025
      objectReference: {fileID: 0}
    - target: {fileID: 4800151344644828682, guid: 4188fe90520808b41b23c5cf99a0a2f2,
        type: 3}
      propertyPath: m_LocalRotation.w
      value: 0.965926
      objectReference: {fileID: 0}
    - target: {fileID: 4800151344644828682, guid: 4188fe90520808b41b23c5cf99a0a2f2,
        type: 3}
      propertyPath: m_LocalRotation.x
      value: 0.25881863
      objectReference: {fileID: 0}
    - target: {fileID: 4800151344644828682, guid: 4188fe90520808b41b23c5cf99a0a2f2,
        type: 3}
      propertyPath: m_LocalRotation.y
      value: 0.0000014528632
      objectReference: {fileID: 0}
    - target: {fileID: 4800151344644828682, guid: 4188fe90520808b41b23c5cf99a0a2f2,
        type: 3}
      propertyPath: m_LocalRotation.z
      value: -0.00000039115548
      objectReference: {fileID: 0}
    - target: {fileID: 4800151344644828682, guid: 4188fe90520808b41b23c5cf99a0a2f2,
        type: 3}
      propertyPath: m_AnchoredPosition.x
      value: 0
      objectReference: {fileID: 0}
    - target: {fileID: 4800151344644828682, guid: 4188fe90520808b41b23c5cf99a0a2f2,
        type: 3}
      propertyPath: m_AnchoredPosition.y
      value: 0.7
      objectReference: {fileID: 0}
    - target: {fileID: 4800151344644828682, guid: 4188fe90520808b41b23c5cf99a0a2f2,
        type: 3}
      propertyPath: m_LocalEulerAnglesHint.x
      value: 30
      objectReference: {fileID: 0}
    - target: {fileID: 4800151344644828682, guid: 4188fe90520808b41b23c5cf99a0a2f2,
        type: 3}
      propertyPath: m_LocalEulerAnglesHint.y
      value: 0
      objectReference: {fileID: 0}
    - target: {fileID: 4800151344644828682, guid: 4188fe90520808b41b23c5cf99a0a2f2,
        type: 3}
      propertyPath: m_LocalEulerAnglesHint.z
      value: 0
      objectReference: {fileID: 0}
    - target: {fileID: 4800151344644828682, guid: 4188fe90520808b41b23c5cf99a0a2f2,
        type: 3}
      propertyPath: m_ConstrainProportionsScale
      value: 1
      objectReference: {fileID: 0}
    m_RemovedComponents: []
  m_SourcePrefab: {fileID: 100100000, guid: 4188fe90520808b41b23c5cf99a0a2f2, type: 3}
--- !u!1001 &6175494609478358309
PrefabInstance:
  m_ObjectHideFlags: 0
  serializedVersion: 2
  m_Modification:
    m_TransformParent: {fileID: 0}
    m_Modifications:
    - target: {fileID: 6175494608952614096, guid: e4984de5ef50bcf46bf19b7efb36edf4,
        type: 3}
      propertyPath: m_Name
      value: ARtistaSetupGUI
      objectReference: {fileID: 0}
    - target: {fileID: 6175494608952614108, guid: e4984de5ef50bcf46bf19b7efb36edf4,
        type: 3}
      propertyPath: m_Pivot.x
      value: 0.5
      objectReference: {fileID: 0}
    - target: {fileID: 6175494608952614108, guid: e4984de5ef50bcf46bf19b7efb36edf4,
        type: 3}
      propertyPath: m_Pivot.y
      value: 0.5
      objectReference: {fileID: 0}
    - target: {fileID: 6175494608952614108, guid: e4984de5ef50bcf46bf19b7efb36edf4,
        type: 3}
      propertyPath: m_RootOrder
      value: 3
      objectReference: {fileID: 0}
    - target: {fileID: 6175494608952614108, guid: e4984de5ef50bcf46bf19b7efb36edf4,
        type: 3}
      propertyPath: m_AnchorMax.x
      value: 0
      objectReference: {fileID: 0}
    - target: {fileID: 6175494608952614108, guid: e4984de5ef50bcf46bf19b7efb36edf4,
        type: 3}
      propertyPath: m_AnchorMax.y
      value: 0
      objectReference: {fileID: 0}
    - target: {fileID: 6175494608952614108, guid: e4984de5ef50bcf46bf19b7efb36edf4,
        type: 3}
      propertyPath: m_AnchorMin.x
      value: 0
      objectReference: {fileID: 0}
    - target: {fileID: 6175494608952614108, guid: e4984de5ef50bcf46bf19b7efb36edf4,
        type: 3}
      propertyPath: m_AnchorMin.y
      value: 0
      objectReference: {fileID: 0}
    - target: {fileID: 6175494608952614108, guid: e4984de5ef50bcf46bf19b7efb36edf4,
        type: 3}
      propertyPath: m_SizeDelta.x
      value: 570
      objectReference: {fileID: 0}
    - target: {fileID: 6175494608952614108, guid: e4984de5ef50bcf46bf19b7efb36edf4,
        type: 3}
      propertyPath: m_SizeDelta.y
      value: 550
      objectReference: {fileID: 0}
    - target: {fileID: 6175494608952614108, guid: e4984de5ef50bcf46bf19b7efb36edf4,
        type: 3}
      propertyPath: m_LocalPosition.x
      value: 0
      objectReference: {fileID: 0}
    - target: {fileID: 6175494608952614108, guid: e4984de5ef50bcf46bf19b7efb36edf4,
        type: 3}
      propertyPath: m_LocalPosition.y
      value: 0
      objectReference: {fileID: 0}
    - target: {fileID: 6175494608952614108, guid: e4984de5ef50bcf46bf19b7efb36edf4,
        type: 3}
      propertyPath: m_LocalPosition.z
      value: 0.25
      objectReference: {fileID: 0}
    - target: {fileID: 6175494608952614108, guid: e4984de5ef50bcf46bf19b7efb36edf4,
        type: 3}
      propertyPath: m_LocalRotation.w
      value: 0.99144495
      objectReference: {fileID: 0}
    - target: {fileID: 6175494608952614108, guid: e4984de5ef50bcf46bf19b7efb36edf4,
        type: 3}
      propertyPath: m_LocalRotation.x
      value: 0.13052596
      objectReference: {fileID: 0}
    - target: {fileID: 6175494608952614108, guid: e4984de5ef50bcf46bf19b7efb36edf4,
        type: 3}
      propertyPath: m_LocalRotation.y
      value: -0
      objectReference: {fileID: 0}
    - target: {fileID: 6175494608952614108, guid: e4984de5ef50bcf46bf19b7efb36edf4,
        type: 3}
      propertyPath: m_LocalRotation.z
      value: -0
      objectReference: {fileID: 0}
    - target: {fileID: 6175494608952614108, guid: e4984de5ef50bcf46bf19b7efb36edf4,
        type: 3}
      propertyPath: m_AnchoredPosition.x
      value: 0
      objectReference: {fileID: 0}
    - target: {fileID: 6175494608952614108, guid: e4984de5ef50bcf46bf19b7efb36edf4,
        type: 3}
      propertyPath: m_AnchoredPosition.y
      value: 1.25
      objectReference: {fileID: 0}
    - target: {fileID: 6175494608952614108, guid: e4984de5ef50bcf46bf19b7efb36edf4,
        type: 3}
      propertyPath: m_LocalEulerAnglesHint.x
      value: 15
      objectReference: {fileID: 0}
    - target: {fileID: 6175494608952614108, guid: e4984de5ef50bcf46bf19b7efb36edf4,
        type: 3}
      propertyPath: m_LocalEulerAnglesHint.y
      value: 0
      objectReference: {fileID: 0}
    - target: {fileID: 6175494608952614108, guid: e4984de5ef50bcf46bf19b7efb36edf4,
        type: 3}
      propertyPath: m_LocalEulerAnglesHint.z
      value: 0
      objectReference: {fileID: 0}
    - target: {fileID: 6175494608952614109, guid: e4984de5ef50bcf46bf19b7efb36edf4,
        type: 3}
      propertyPath: m_Camera
      value: 
      objectReference: {fileID: 538280016}
    - target: {fileID: 6175494608952614111, guid: e4984de5ef50bcf46bf19b7efb36edf4,
        type: 3}
      propertyPath: roomsTransform.Array.data[0]
      value: 
      objectReference: {fileID: 369038675}
    - target: {fileID: 6175494608952614111, guid: e4984de5ef50bcf46bf19b7efb36edf4,
        type: 3}
      propertyPath: roomsTransform.Array.data[1]
      value: 
      objectReference: {fileID: 333938920}
    m_RemovedComponents: []
  m_SourcePrefab: {fileID: 100100000, guid: e4984de5ef50bcf46bf19b7efb36edf4, type: 3}
