# Blender 3.5.1 MTL File: 'VRlowpoly.blend'
# www.blender.org

newmtl Lenti
Ns 250.000000
Ka 1.000000 1.000000 1.000000
Kd 0.800000 0.800000 0.800000
Ks 0.500000 0.500000 0.500000
Ke 0.000000 0.000000 0.000000
Ni 1.450000
d 1.000000
illum 2

newmtl Material
Ns 250.000000
Ka 1.000000 1.000000 1.000000
Kd 0.800000 0.800000 0.800000
Ks 0.500000 0.500000 0.500000
Ke 0.000000 0.000000 0.000000
Ni 1.450000
d 1.000000
illum 3

newmtl Scocca
Ns 387.789276
Ka 1.000000 1.000000 1.000000
Kd 0.015995 0.014875 0.014539
Ks 0.672727 0.672727 0.672727
Ke 0.000000 0.000000 0.000000
Ni 1.450000
d 1.000000
illum 2
