k_ovdal_tungr = {
	1000.1.1 = { change_development_level = 20 }
	950.7.17 = {
		government = republic_government
		holder = 95 #Ordan Minesmiter
	}
}

c_ovdal_tungr = {
	950.7.17 = {
		holder = 95 #Ordan Minesmiter
	}
}