#k_jotuntar
##d_norjotuntar
###c_jotuntar
989 = {		#Jotuntar

    # Misc
    culture = taric
    religion = taric_faith
	holding = tribal_holding

    # History
}
2708 = {

    # Misc
    holding = none

    # History

}
2709 = {

    # Misc
    holding = none

    # History

}
2710 = {

    # Misc
    holding = none

    # History

}

###c_jotunsmerg
987 = {		#Jotunsmerg

    # Misc
    culture = taric
    religion = taric_faith
	holding = tribal_holding

    # History
}
2705 = {

    # Misc
    holding = none

    # History

}
2706 = {

    # Misc
    holding = none

    # History

}
2707 = {

    # Misc
    holding = none

    # History

}

###c_myrk
988 = {		#Myrk

    # Misc
    culture = taric
    religion = taric_faith
	holding = tribal_holding

    # History
}
2704 = {

    # Misc
    holding = none

    # History

}

##d_sudjotuntar
###c_dvergdal
992 = {		#Dvergdal

    # Misc
    culture = taric
    religion = taric_faith
	holding = tribal_holding

    # History
}
2702 = {

    # Misc
    holding = none

    # History

}
2703 = {

    # Misc
    holding = none

    # History

}

###c_jawud
991 = {		#Jawud

    # Misc
    culture = taric
    religion = taric_faith
	holding = tribal_holding

    # History
}
2701 = {

    # Misc
    holding = none

    # History

}

###c_jotunsob
990 = {		#Jotunsob

    # Misc
    culture = taric
    religion = taric_faith
	holding = tribal_holding

    # History
}
2699 = {

    # Misc
    holding = none

    # History

}
2700 = {

    # Misc
    holding = none

    # History

}