175 = {

    # Misc
    culture = redscale
    religion = kobold_dragon_cult
	holding = tribal_holding

    # History
}

176 = {

    # Misc
    culture = redscale
    religion = kobold_dragon_cult
	holding = tribal_holding

    # History
}

177 = {

    # Misc
    culture = redscale
    religion = kobold_dragon_cult
	holding = tribal_holding

    # History
}

178 = {

    # Misc
    culture = redscale
    religion = kobold_dragon_cult
	holding = tribal_holding

    # History
}

179 = {

    # Misc
    culture = redscale
    religion = kobold_dragon_cult
	holding = tribal_holding

    # History
	1000.1.1 = {
		special_building_slot = norbit_mines_01
	}
}
6424={
    # Misc
    holding = none

    # History
}
6425={
    # Misc
    holding = none

    # History
}
6426={
    # Misc
    holding = none

    # History
}
6427={
    # Misc
    holding = none

    # History
}
6417={
    # Misc
    holding = none

    # History
}
6418={
    # Misc
    holding = none

    # History
}
6419={
    # Misc
    holding = none

    # History
}
6420={
    # Misc
    holding = none

    # History
}
6421={
    # Misc
    holding = none

    # History
}
6422={
    # Misc
    holding = none

    # History
}
6423={
    # Misc
    holding = none

    # History
}
6432={
    # Misc
    holding = none

    # History
}