{
  "Comment.nvim": { "branch": "master", "commit": "e30b7f2008e52442154b66f7c519bfd2f1e32acb" },
  "LuaSnip": { "branch": "master", "commit": "e808bee352d1a6fcf902ca1a71cee76e60e24071" },
  "bufferline.nvim": { "branch": "main", "commit": "2e3c8cc5a57ddd32f1edd2ffd2ccb10c09421f6c" },
  "cmp-nvim-lsp": { "branch": "main", "commit": "39e2eda76828d88b773cc27a3f61d2ad782c922d" },
  "decay": { "branch": "main", "commit": "457014541ebcfb29bd660592a0b02f22c9e2d0e2" },
  "lazy.nvim": { "branch": "main", "commit": "077102c5bfc578693f12377846d427f49bc50076" },
  "lsp-zero.nvim": { "branch": "v3.x", "commit": "56db3d5ce5476b183783160e6045f7337ba12b83" },
  "lualine.nvim": { "branch": "master", "commit": "b431d228b7bbcdaea818bdc3e25b8cdbe861f056" },
  "markdown-preview.nvim": { "branch": "master", "commit": "a923f5fc5ba36a3b17e289dc35dc17f66d0548ee" },
  "mason-lspconfig.nvim": { "branch": "main", "commit": "25c11854aa25558ee6c03432edfa0df0217324be" },
  "mason.nvim": { "branch": "main", "commit": "e2f7f9044ec30067bc11800a9e266664b88cda22" },
  "misery.nvim": { "branch": "main", "commit": "944137e7a3bbdfa1fd6b6a4d283a11dbe805a78f" },
  "nvim": { "branch": "main", "commit": "7be452ee067978cdc8b2c5f3411f0c71ffa612b9" },
  "nvim-autopairs": { "branch": "master", "commit": "ee297f215e95a60b01fde33275cc3c820eddeebe" },
  "nvim-cmp": { "branch": "main", "commit": "ae644feb7b67bf1ce4260c231d1d4300b19c6f30" },
  "nvim-highlight-colors": { "branch": "main", "commit": "a411550ef85cae467b889ba7d1a96bd78332d90e" },
  "nvim-lspconfig": { "branch": "master", "commit": "ff69ecca55d83ffc70657f260a799f79a5637831" },
  "nvim-tree.lua": { "branch": "master", "commit": "4a9e82d10a3715d0c3845e1d2f66ddfb8b711253" },
  "nvim-treesitter": { "branch": "master", "commit": "9b1e607298dd5fc2ee6549488324cc92dafb99c0" },
  "nvim-web-devicons": { "branch": "master", "commit": "56f17def81478e406e3a8ec4aa727558e79786f3" },
  "onedarkpro.nvim": { "branch": "main", "commit": "ada0798b1bf6d0bde1fbf239c22de778bf5efbd1" },
  "plenary.nvim": { "branch": "master", "commit": "2d9b06177a975543726ce5c73fca176cedbffe9d" },
  "startup.nvim": { "branch": "master", "commit": "81222a9956148eebf10363726d8bccf8793aa41f" },
  "telescope-file-browser.nvim": { "branch": "master", "commit": "3b8a1e17187cfeedb31decbd625da62398a8ff34" },
  "telescope.nvim": { "branch": "0.1.x", "commit": "a0bbec21143c7bc5f8bb02e0005fa0b982edc026" },
  "toggleterm.nvim": { "branch": "main", "commit": "48be57eaba817f038d61bbf64d2c597f578c0827" }
}
