<?xml version="1.0" encoding="iso-8859-1"?>
<!-- Generator: Adobe Illustrator 19.0.0, SVG Export Plug-In . SVG Version: 6.00 Build 0)  -->
<svg version="1.1" id="Layer_1" xmlns="http://www.w3.org/2000/svg" xmlns:xlink="http://www.w3.org/1999/xlink" x="0px" y="0px"
	 viewBox="0 0 512 512" style="enable-background:new 0 0 512 512;" xml:space="preserve">
<g>
	<g>
		<path d="M42.633,90.713C19.088,90.713,0,109.801,0,133.346v245.309c0,23.544,19.088,42.632,42.633,42.632h72.011V90.713H42.633z
			 M57.322,392.904c-9.22,0-16.696-7.475-16.696-16.696s7.475-16.696,16.696-16.696c9.22,0,16.696,7.475,16.696,16.696
			S66.542,392.904,57.322,392.904z M57.322,332.8c-9.22,0-16.696-7.475-16.696-16.696c0-9.22,7.475-16.696,16.696-16.696
			c9.22,0,16.696,7.475,16.696,16.696C74.017,325.325,66.542,332.8,57.322,332.8z M57.322,272.696
			c-9.22,0-16.696-7.475-16.696-16.696s7.475-16.696,16.696-16.696c9.22,0,16.696,7.475,16.696,16.696
			S66.542,272.696,57.322,272.696z M57.322,212.591c-9.22,0-16.696-7.475-16.696-16.696c0-0.188,0.022-0.371,0.028-0.557
			c0.296-8.961,7.634-16.139,16.668-16.139c9.032,0,16.372,7.178,16.668,16.139c0.007,0.186,0.028,0.368,0.028,0.557
			C74.017,205.116,66.542,212.591,57.322,212.591z M57.322,152.487c-9.22,0-16.696-7.475-16.696-16.696
			c0-0.188,0.022-0.371,0.028-0.557c0.296-8.961,7.634-16.139,16.668-16.139c9.032,0,16.372,7.178,16.668,16.139
			c0.007,0.186,0.028,0.368,0.028,0.557C74.017,145.012,66.542,152.487,57.322,152.487z"/>
	</g>
</g>
<g>
	<g>
		<path d="M469.148,179.2H512v-26.713h-42.852c-9.22,0-16.696-7.475-16.696-16.696s7.475-16.696,16.696-16.696h40.403
			c-5.865-16.536-21.638-28.383-40.184-28.383h-54.202v330.574h54.202c18.547,0,34.32-11.846,40.184-28.383h-40.403
			c-9.22,0-16.696-7.475-16.696-16.696s7.475-16.696,16.696-16.696H512V332.8h-42.852c-9.22,0-16.696-7.475-16.696-16.696
			c0-9.22,7.475-16.696,16.696-16.696H512v-26.713h-42.852c-9.22,0-16.696-7.475-16.696-16.696s7.475-16.696,16.696-16.696H512
			v-26.713h-42.852c-9.22,0-16.696-7.475-16.696-16.696C452.452,186.675,459.927,179.2,469.148,179.2z"/>
	</g>
</g>
<g>
	<g>
		<path d="M367.861,66.226l-20.48,24.355l-20.48-24.355l-20.48,24.355l-20.48-24.355l-20.48,24.355l-20.48-24.355l-20.48,24.355
			l-20.48-24.355l-20.48,24.355l-20.48-24.355L142.47,90.713c0,16.859,0,313.925,0,330.574l20.591,24.487l20.48-24.355l20.48,24.355
			l20.48-24.355l20.48,24.355l20.48-24.355l20.48,24.355l20.48-24.355l20.48,24.355l20.48-24.355l20.48,24.355l20.591-24.487
			c0-16.649,0-313.726,0-330.574L367.861,66.226z"/>
	</g>
</g>
<g>
</g>
<g>
</g>
<g>
</g>
<g>
</g>
<g>
</g>
<g>
</g>
<g>
</g>
<g>
</g>
<g>
</g>
<g>
</g>
<g>
</g>
<g>
</g>
<g>
</g>
<g>
</g>
<g>
</g>
</svg>
