%YAML 1.1
%TAG !u! tag:unity3d.com,2011:
--- !u!1045 &1
EditorBuildSettings:
  m_ObjectHideFlags: 0
  serializedVersion: 2
  m_Scenes:
  - enabled: 1
    path: Assets/Scenes/StartMenu.unity
    guid: f6d15c66683d6de4f92a70f8d46a7ec2
  - enabled: 1
    path: Assets/Scenes/MechanicTest.unity
    guid: 2cda990e2423bbf4892e6590ba056729
  m_configObjects: {}
