18.832093146924365
13.183935662093308
15.742609054229993
13.222682210821851
17.18141862833474
13.016613439524988
13.952272454346192
15.985833042271482
16.464133062626967
17.31289348850704
11.901226040136995
14.216610933578135
20.039688972606704
17.6912970082143
13.795250498962877
16.98100377014546
15.447834772846456
14.342139533802396
14.5601062042389
16.3389773062837
18.52376118035698
18.76817611877923
15.154934113241993
14.224099619371627
17.13423164517039
18.20999507947037
18.838051030996162
13.919817524136045
13.921321838285174
16.914145283232834
13.758271502378662
16.059035061859145
14.588698037414888
15.229986970234988
15.270963716160425
13.12633921267791
15.292913639597609
14.188363753759079
16.435964264257517
16.200583270448693
18.820079319819627
16.39145474624437
14.699913891206476
16.171543863928143
14.003215184640814
13.30994380189245
13.193172354084872
19.06708129459024
15.440133292169577
14.042264601179436
12.726005651894708
13.795126678510483
19.099984912322544
14.206372398075606
13.650428214017627
18.18242796990138
18.5983502903504
13.736642044270866
15.376639167468982
