17.63779474577774
12.335395808930956
15.037104024375818
12.734501868064187
16.26601747713722
12.577170547948791
13.449593744606565
15.474753683764515
15.643256366234414
16.622670217214846
11.787968553605882
13.715541401686162
nan
16.618301206327843
13.315440716178543
16.10505409948675
14.801306382173408
13.833781885270817
13.941960610412865
15.53473730297878
17.06469816925896
17.932195091015597
14.564143407246812
13.711911875771161
16.27022997717937
16.925958279186034
17.489453782343723
13.399004074393105
13.400493990572322
15.929393485668719
13.247106489290868
15.299581559275824
14.056255586516178
14.585137786466804
14.644109383541899
12.596870815341685
14.65127585834441
13.710600665090716
15.553652794129212
15.506864609428977
17.570417020388266
15.567495387786824
14.236199470094025
15.323720256084183
13.514292826015133
12.668212645665617
12.718361050240434
18.026345845855037
14.757750853883538
13.562338312726324
12.227556964384256
13.30636713319657
17.71742246566842
13.71440665324805
12.913590852092181
17.21761926578757
17.67883827770414
13.25384605925056
14.724201441015843
