x,sin(x)
-3.141592653589793,-1.22464679915e-16
-3.078760800517997,-0.0627905195293
-3.015928947446201,-0.125333233564
-2.9530970943744053,-0.187381314586
-2.8902652413026093,-0.248689887165
-2.8274333882308134,-0.309016994375
-2.7646015351590174,-0.368124552685
-2.7017696820872215,-0.425779291565
-2.6389378290154255,-0.481753674102
-2.5761059759436296,-0.535826794979
-2.5132741228718336,-0.587785252292
-2.4504422698000377,-0.637423989749
-2.3876104167282417,-0.684547105929
-2.3247785636564458,-0.728968627421
-2.26194671058465,-0.770513242776
-2.199114857512854,-0.809016994375
-2.136283004441058,-0.844327925502
-2.073451151369262,-0.876306680044
-2.010619298297466,-0.904827052466
-1.94778744522567,-0.929776485888
-1.884955592153874,-0.951056516295
-1.8221237390820781,-0.968583161129
-1.7592918860102822,-0.982287250729
-1.6964600329384862,-0.992114701314
-1.6336281798666903,-0.998026728428
-1.5707963267948943,-1.0
-1.5079644737230984,-0.998026728428
-1.4451326206513024,-0.992114701314
-1.3823007675795065,-0.982287250729
-1.3194689145077105,-0.968583161129
-1.2566370614359146,-0.951056516295
-1.1938052083641186,-0.929776485888
-1.1309733552923227,-0.904827052466
-1.0681415022205267,-0.876306680044
-1.0053096491487308,-0.844327925502
-0.9424777960769348,-0.809016994375
-0.8796459430051389,-0.770513242776
-0.8168140899333429,-0.728968627421
-0.753982236861547,-0.684547105929
-0.691150383789751,-0.637423989749
-0.6283185307179551,-0.587785252292
-0.5654866776461591,-0.535826794979
-0.5026548245743632,-0.481753674102
-0.4398229715025672,-0.425779291565
-0.37699111843077127,-0.368124552685
-0.3141592653589753,-0.309016994375
-0.25132741228717936,-0.248689887165
-0.1884955592153834,-0.187381314586
-0.12566370614358746,-0.125333233564
-0.06283185307179151,-0.0627905195293
4.440892098500626e-15,4.4408920985e-15
0.06283185307180039,0.0627905195293
0.12566370614359634,0.125333233564
0.1884955592153923,0.187381314586
0.25132741228718825,0.248689887165
0.3141592653589842,0.309016994375
0.37699111843078015,0.368124552685
0.4398229715025761,0.425779291565
0.502654824574372,0.481753674102
0.565486677646168,0.535826794979
0.628318530717964,0.587785252292
0.6911503837897599,0.637423989749
0.7539822368615559,0.684547105929
0.8168140899333518,0.728968627421
0.8796459430051478,0.770513242776
0.9424777960769433,0.809016994375
1.0053096491487397,0.844327925502
1.068141502220536,0.876306680044
1.1309733552923316,0.904827052466
1.193805208364127,0.929776485888
1.2566370614359235,0.951056516295
1.3194689145077199,0.968583161129
1.3823007675795154,0.982287250729
1.4451326206513109,0.992114701314
1.5079644737231073,0.998026728428
1.5707963267949037,1.0
1.6336281798666992,0.998026728428
1.6964600329384947,0.992114701314
1.759291886010291,0.982287250729
1.8221237390820875,0.968583161129
1.884955592153883,0.951056516295
1.9477874452256785,0.929776485888
2.010619298297475,0.904827052466
2.0734511513692713,0.876306680044
2.136283004441067,0.844327925502
2.1991148575128623,0.809016994375
2.2619467105846587,0.770513242776
2.324778563656455,0.728968627421
2.3876104167282506,0.684547105929
2.450442269800046,0.637423989749
2.5132741228718425,0.587785252292
2.576105975943639,0.535826794979
2.6389378290154344,0.481753674102
2.70176968208723,0.425779291565
2.7646015351590263,0.368124552685
2.8274333882308227,0.309016994375
2.890265241302618,0.248689887165
2.9530970943744137,0.187381314586
3.01592894744621,0.125333233564
3.0787608005180065,0.0627905195293
