{
    "id":"RAISE",
    "patterns":[
        [
            {
                "RIGHT_ID": "TRI_RAISE",
                "RIGHT_ATTRS": {"LEMMA": {"REGEX":"([Nn]ehmen|[Ll]egen)"}}
            },
            {
                "LEFT_ID": "TRI_RAISE",
                "REL_OP": ">>",
                "RIGHT_ID": "raise_indicator",
                "RIGHT_ATTRS": {"LOWER": {"REGEX":"zu"}, "DEP":"svp"}
            }
        ],
        [
            {
                "RIGHT_ID": "TRI_RAISE",
                "RIGHT_ATTRS": {"LEMMA":{"REGEX":"(steigen|wachsen|zunehmen|erhöhen|zulegen|anheben)"}}
            }
        ],
        [
            {
                "RIGHT_ID": "TRI_RAISE",
                "RIGHT_ATTRS": {"LEMMA":{"REGEX":"(.*[Zz]uwachs|.*[Ww]achstum|.*[Aa]nstieg|.*[Pp]lus)"}}
            }
        ]
    ]
}
    