#line 1 "TestI2Cxc8.c"
#line 1 "TestI2Cxc8.c"





#pragma config OSC = HS         
#pragma config FCMEN = OFF      
#pragma config IESO = OFF       
 

#pragma config PWRT = OFF       
#pragma config BOREN = SBORDIS  
#pragma config BORV = 3         


#pragma config WDT = OFF        
#pragma config WDTPS = 32768    


#pragma config MODE = MC        
#pragma config ADDRBW = ADDR20BIT
#pragma config DATABW = DATA16BIT
#pragma config WAIT = OFF       


#pragma config CCP2MX = PORTC   
#pragma config ECCPMX = PORTE   
#pragma config LPT1OSC = OFF    
#pragma config MCLRE = ON       


#pragma config STVREN = ON      
#pragma config LVP = OFF        
#pragma config BBSIZ = BB2K     
#pragma config XINST = OFF      


#pragma config CP0 = OFF        
#pragma config CP1 = OFF        
#pragma config CP2 = OFF        
#pragma config CP3 = OFF        
#pragma config CP4 = OFF        
#pragma config CP5 = OFF        
#pragma config CP6 = OFF        
#pragma config CP7 = OFF        


#pragma config CPB = OFF        
#pragma config CPD = OFF        


#pragma config WRT0 = OFF       
#pragma config WRT1 = OFF       
#pragma config WRT2 = OFF       
#pragma config WRT3 = OFF       
#pragma config WRT4 = OFF       
#pragma config WRT5 = OFF       
#pragma config WRT6 = OFF       
#pragma config WRT7 = OFF       


#pragma config WRTC = OFF       
#pragma config WRTB = OFF       
#pragma config WRTD = OFF       


#pragma config EBTR0 = OFF      
#pragma config EBTR1 = OFF      
#pragma config EBTR2 = OFF      
#pragma config EBTR3 = OFF      
#pragma config EBTR4 = OFF      
#pragma config EBTR5 = OFF      
#pragma config EBTR6 = OFF      
#pragma config EBTR7 = OFF      


#pragma config EBTRB = OFF      



#line 1 "./main.h"

#line 6 "./main.h"
 








#line 16 "./main.h"


#line 19 "./main.h"
#line 20 "./main.h"
#line 21 "./main.h"
#line 22 "./main.h"
#line 23 "./main.h"
#line 24 "./main.h"
#line 25 "./main.h"

 
#line 28 "./main.h"
#line 29 "./main.h"

void OpenI2C1(  unsigned char sync_mode,  unsigned char slew );
#line 32 "./main.h"

#line 34 "./main.h"
#line 35 "./main.h"

#line 37 "./main.h"
#line 38 "./main.h"
#line 39 "./main.h"
#line 40 "./main.h"
#line 41 "./main.h"
#line 42 "./main.h"
#line 43 "./main.h"
signed char WriteI2C1(  unsigned char data_out );
#line 45 "./main.h"

#line 47 "./main.h"
#line 48 "./main.h"

signed char putsI2C1(  unsigned char *wrptr );
#line 51 "./main.h"

unsigned char ReadI2C1( void );
#line 54 "./main.h"
#line 55 "./main.h"

#line 57 "./main.h"

signed char getsI2C1( unsigned char *rdptr, unsigned char length );
#line 60 "./main.h"

#line 62 "./main.h"
#line 63 "./main.h"

signed char EEAckPolling(unsigned char control);
signed char EEByteWrite(unsigned char control, unsigned int address, unsigned char data);
signed char EEPageWrite(unsigned char control, unsigned int address, unsigned char *wrptr);
signed char EESequentialRead(unsigned char control, unsigned int address, unsigned char *rdptr, unsigned char length);
signed int EERandomRead(unsigned char control, unsigned int address);


#line 72 "./main.h"

#line 81 "TestI2Cxc8.c"

#line 1 "C:/Program Files (x86)/Microchip/mplabc18/v3.42/bin/../h/stdlib.h"
 

#line 4 "C:/Program Files (x86)/Microchip/mplabc18/v3.42/bin/../h/stdlib.h"

#line 6 "C:/Program Files (x86)/Microchip/mplabc18/v3.42/bin/../h/stdlib.h"

#line 9 "C:/Program Files (x86)/Microchip/mplabc18/v3.42/bin/../h/stdlib.h"
 
 

#line 16 "C:/Program Files (x86)/Microchip/mplabc18/v3.42/bin/../h/stdlib.h"
 
double atof (const auto char *s);

#line 28 "C:/Program Files (x86)/Microchip/mplabc18/v3.42/bin/../h/stdlib.h"
 
signed char atob (const auto char *s);


#line 39 "C:/Program Files (x86)/Microchip/mplabc18/v3.42/bin/../h/stdlib.h"
 
int atoi (const auto char *s);

#line 47 "C:/Program Files (x86)/Microchip/mplabc18/v3.42/bin/../h/stdlib.h"
 
long atol (const auto char *s);

#line 58 "C:/Program Files (x86)/Microchip/mplabc18/v3.42/bin/../h/stdlib.h"
 
unsigned long atoul (const auto char *s);


#line 71 "C:/Program Files (x86)/Microchip/mplabc18/v3.42/bin/../h/stdlib.h"
 
char *btoa (auto signed char value, auto char *s);

#line 83 "C:/Program Files (x86)/Microchip/mplabc18/v3.42/bin/../h/stdlib.h"
 
char *itoa (auto int value, auto char *s);

#line 95 "C:/Program Files (x86)/Microchip/mplabc18/v3.42/bin/../h/stdlib.h"
 
char *ltoa (auto long value, auto char *s);

#line 107 "C:/Program Files (x86)/Microchip/mplabc18/v3.42/bin/../h/stdlib.h"
 
char *ultoa (auto unsigned long value, auto char *s);
 


#line 112 "C:/Program Files (x86)/Microchip/mplabc18/v3.42/bin/../h/stdlib.h"
 
 

#line 116 "C:/Program Files (x86)/Microchip/mplabc18/v3.42/bin/../h/stdlib.h"
 
#line 118 "C:/Program Files (x86)/Microchip/mplabc18/v3.42/bin/../h/stdlib.h"


#line 124 "C:/Program Files (x86)/Microchip/mplabc18/v3.42/bin/../h/stdlib.h"
 
int rand (void);

#line 136 "C:/Program Files (x86)/Microchip/mplabc18/v3.42/bin/../h/stdlib.h"
 
void srand (auto unsigned int seed);
 
#line 140 "C:/Program Files (x86)/Microchip/mplabc18/v3.42/bin/../h/stdlib.h"
#line 149 "C:/Program Files (x86)/Microchip/mplabc18/v3.42/bin/../h/stdlib.h"

#line 151 "C:/Program Files (x86)/Microchip/mplabc18/v3.42/bin/../h/stdlib.h"
#line 82 "TestI2Cxc8.c"
 
#line 1 "C:/Program Files (x86)/Microchip/mplabc18/v3.42/bin/../h/stdio.h"

#line 3 "C:/Program Files (x86)/Microchip/mplabc18/v3.42/bin/../h/stdio.h"

#line 1 "C:/Program Files (x86)/Microchip/mplabc18/v3.42/bin/../h/stdarg.h"
 


#line 5 "C:/Program Files (x86)/Microchip/mplabc18/v3.42/bin/../h/stdarg.h"

typedef void* va_list;
#line 8 "C:/Program Files (x86)/Microchip/mplabc18/v3.42/bin/../h/stdarg.h"
#line 9 "C:/Program Files (x86)/Microchip/mplabc18/v3.42/bin/../h/stdarg.h"
#line 10 "C:/Program Files (x86)/Microchip/mplabc18/v3.42/bin/../h/stdarg.h"
#line 11 "C:/Program Files (x86)/Microchip/mplabc18/v3.42/bin/../h/stdarg.h"
#line 12 "C:/Program Files (x86)/Microchip/mplabc18/v3.42/bin/../h/stdarg.h"
#line 4 "C:/Program Files (x86)/Microchip/mplabc18/v3.42/bin/../h/stdio.h"

#line 1 "C:/Program Files (x86)/Microchip/mplabc18/v3.42/bin/../h/stddef.h"
 

#line 4 "C:/Program Files (x86)/Microchip/mplabc18/v3.42/bin/../h/stddef.h"

typedef unsigned char wchar_t;


#line 10 "C:/Program Files (x86)/Microchip/mplabc18/v3.42/bin/../h/stddef.h"
 
typedef signed short int ptrdiff_t;
typedef signed short int ptrdiffram_t;
typedef signed short long int ptrdiffrom_t;


#line 20 "C:/Program Files (x86)/Microchip/mplabc18/v3.42/bin/../h/stddef.h"
 
typedef unsigned short int size_t;
typedef unsigned short int sizeram_t;
typedef unsigned short long int sizerom_t;


#line 34 "C:/Program Files (x86)/Microchip/mplabc18/v3.42/bin/../h/stddef.h"
 
#line 36 "C:/Program Files (x86)/Microchip/mplabc18/v3.42/bin/../h/stddef.h"


#line 41 "C:/Program Files (x86)/Microchip/mplabc18/v3.42/bin/../h/stddef.h"
 
#line 43 "C:/Program Files (x86)/Microchip/mplabc18/v3.42/bin/../h/stddef.h"

#line 45 "C:/Program Files (x86)/Microchip/mplabc18/v3.42/bin/../h/stddef.h"
#line 5 "C:/Program Files (x86)/Microchip/mplabc18/v3.42/bin/../h/stdio.h"



#line 9 "C:/Program Files (x86)/Microchip/mplabc18/v3.42/bin/../h/stdio.h"
 
#line 11 "C:/Program Files (x86)/Microchip/mplabc18/v3.42/bin/../h/stdio.h"

#line 13 "C:/Program Files (x86)/Microchip/mplabc18/v3.42/bin/../h/stdio.h"


typedef unsigned char FILE;

 
#line 19 "C:/Program Files (x86)/Microchip/mplabc18/v3.42/bin/../h/stdio.h"
#line 20 "C:/Program Files (x86)/Microchip/mplabc18/v3.42/bin/../h/stdio.h"

extern FILE *stderr;
extern FILE *stdout;


int putc (auto char c, auto FILE *f);
int vsprintf (auto char *buf, auto const far  rom char *fmt, auto va_list ap);
int vprintf (auto const far  rom char *fmt, auto va_list ap);
int sprintf (auto char *buf, auto const far  rom char *fmt, ...);
int printf (auto const far  rom char *fmt, ...);
int fprintf (auto FILE *f, auto const far  rom char *fmt, ...);
int vfprintf (auto FILE *f, auto const far  rom char *fmt, auto va_list ap);
int puts (auto const far  rom char *s);
int fputs (auto const far  rom char *s, auto FILE *f);

#line 36 "C:/Program Files (x86)/Microchip/mplabc18/v3.42/bin/../h/stdio.h"
#line 83 "TestI2Cxc8.c"



unsigned char TRAMEOUT[128];
unsigned char TRAMEIN[129];

char cCompt;
char tmp;
char cFlag;



void Init_RS485(void);
void RS485(unsigned char carac);
void TRAMEENVOIRS485DONNEES(void);

void Init_I2C(void);
signed char EESequRead(unsigned char cControl, unsigned int address, unsigned char *rdptr, unsigned char length);
signed char EEPaWrite(unsigned char cControl, unsigned int address, unsigned char *wrptr);
unsigned char ECRIRE_EEPROMBYTE(unsigned char ADDE, unsigned int ADDHL, unsigned char *tab, char g);
unsigned char putstringI2C(unsigned char *wrptr);
unsigned char LIRE_EEPROM(unsigned char ADDE, unsigned int ADDHL, unsigned char *tab, char r);


#line 108 "TestI2Cxc8.c"

#line 110 "TestI2Cxc8.c"
#line 111 "TestI2Cxc8.c"
#line 112 "TestI2Cxc8.c"

#line 114 "TestI2Cxc8.c"


void main(void) {
    
    unsigned char cBcl;
    OpenI2C1 (0b00001000 , 0b10000000 );
    TRISCbits.TRISC4 = 1; 
    TRISCbits.TRISC3 = 1; 

    TRISJbits.TRISJ0 = 0; 
    TRISJbits.TRISJ1 = 0; 
    TRISJbits.TRISJ2 = 0; 

    Init_I2C();
    

    PORTJbits.RJ1  = 0;
    PORTJbits.RJ0  = 0;
    PORTJbits.RJ2  = 1; 

    Init_RS485();
    
    T0CONbits.TMR0ON = 0; 
    T0CONbits.T08BIT = 0; 
    T0CONbits.T0CS = 0; 
    T0CONbits.T0SE = 1; 
    T0CONbits.PSA = 0; 
    T0CONbits.T0PS = 7; 
    INTCONbits.TMR0IE = 1;
    INTCON2bits.TMR0IP = 1;
    
    
    

    TMR0L = 0; 
    TMR0H = 0; 

    cFlag = 0;
    cCompt = 0;


    TRAMEIN[0] = '#'; 
    TRAMEIN[1] = '3';
    TRAMEIN[2] = '0';
    TRAMEIN[3] = '5';
    TRAMEIN[4] = '1';
    TRAMEIN[5] = '5';
    TRAMEIN[6] = 'A';
    TRAMEIN[7] = '1';
    TRAMEIN[8] = '1';
    TRAMEIN[9] = '1';
    TRAMEIN[10] = '1';
    TRAMEIN[11] = '2';
    TRAMEIN[12] = '2';
    TRAMEIN[13] = '2';
    TRAMEIN[14] = '2';
    TRAMEIN[15] = '0';
    TRAMEIN[16] = '0';
    TRAMEIN[17] = '0';
    TRAMEIN[18] = '0';
    TRAMEIN[19] = 'B';
    TRAMEIN[20] = 'R';
    TRAMEIN[21] = 'A';
    TRAMEIN[22] = '/';
    TRAMEIN[23] = '8';
    TRAMEIN[24] = '8';
    TRAMEIN[25] = '8';
    TRAMEIN[26] = '8';
    TRAMEIN[27] = '/';
    TRAMEIN[28] = '2';
    TRAMEIN[29] = '2';
    TRAMEIN[30] = '/';
    TRAMEIN[31] = '1';
    TRAMEIN[32] = 'y';
    TRAMEIN[33] = 'O';
    TRAMEIN[34] = 'M';
    TRAMEIN[35] = 'M';
    TRAMEIN[36] = 'E';
    TRAMEIN[37] = 'N';
    TRAMEIN[38] = 'T';
    TRAMEIN[39] = 'A';
    TRAMEIN[40] = 'I';
    TRAMEIN[41] = 'R';
    TRAMEIN[42] = 'E';
    TRAMEIN[43] = 'S';
    TRAMEIN[44] = 'I';
    TRAMEIN[45] = 'C';
    TRAMEIN[46] = 'I';
    TRAMEIN[47] = 'R';
    TRAMEIN[48] = 'O';
    TRAMEIN[49] = 'B';
    TRAMEIN[50] = '9';
    TRAMEIN[51] = '9';
    TRAMEIN[52] = '3';
    TRAMEIN[53] = '2';
    TRAMEIN[54] = '6';
    TRAMEIN[55] = '1';
    TRAMEIN[56] = '1';
    TRAMEIN[57] = '1';
    TRAMEIN[58] = '5';
    TRAMEIN[59] = '2';
    TRAMEIN[60] = '5';
    TRAMEIN[61] = '0';
    TRAMEIN[62] = '0';
    TRAMEIN[63] = '1';
    TRAMEIN[64] = '0';
    TRAMEIN[65] = '2';
    TRAMEIN[66] = '0';
    TRAMEIN[67] = '0';
    TRAMEIN[68] = '0';
    TRAMEIN[69] = '0';
    TRAMEIN[70] = '4';
    TRAMEIN[71] = '5';
    TRAMEIN[72] = '6';
    TRAMEIN[73] = '7';
    TRAMEIN[74] = '8';
    TRAMEIN[75] = '0';
    TRAMEIN[76] = '1';
    TRAMEIN[77] = '0';
    TRAMEIN[78] = '8';
    TRAMEIN[79] = '6';
    TRAMEIN[80] = '5';
    TRAMEIN[81] = '0';
    TRAMEIN[82] = '8';
    TRAMEIN[83] = '8';
    TRAMEIN[84] = '8';
    TRAMEIN[85] = '2';
    TRAMEIN[86] = '2';
    TRAMEIN[87] = '7';
    TRAMEIN[88] = '6';
    TRAMEIN[89] = '7';
    TRAMEIN[90] = '7';
    TRAMEIN[91] = '-';
    TRAMEIN[92] = '-';
    TRAMEIN[93] = '-';
    TRAMEIN[94] = '-';
    TRAMEIN[95] = '-';
    TRAMEIN[96] = '-';
    TRAMEIN[97] = '-';
    TRAMEIN[98] = '-';
    TRAMEIN[99] = '-';
    TRAMEIN[100] = '-';
    TRAMEIN[101] = '-';
    TRAMEIN[102] = '-';
    TRAMEIN[103] = '-';
    TRAMEIN[104] = '-';
    TRAMEIN[105] = '-';
    TRAMEIN[106] = '-';
    TRAMEIN[107] = '-';
    TRAMEIN[108] = '-';
    TRAMEIN[109] = '-';
    TRAMEIN[110] = '-';
    TRAMEIN[111] = '-';
    TRAMEIN[112] = '-';
    TRAMEIN[113] = '-';
    TRAMEIN[114] = '-';
    TRAMEIN[115] = '-';
    TRAMEIN[116] = '-';
    TRAMEIN[117] = '-';
    TRAMEIN[118] = '-';
    TRAMEIN[119] = '-';
    TRAMEIN[120] = '-';
    TRAMEIN[121] = '-';
    TRAMEIN[122] = '-';
    TRAMEIN[123] = '-';
    TRAMEIN[124] = '-';
    TRAMEIN[125] = '2';
    TRAMEIN[126] = '*';
    TRAMEIN[127] = '5';
    TRAMEIN[128] = 0;

    for(cBcl = 0; cBcl < 128; cBcl++){
    TRAMEOUT[cBcl] = 0; 
    }

    while (1) 
    {
        if(cFlag == 0){
        T0CONbits.TMR0ON = 1; 
        tmp = ECRIRE_EEPROMBYTE(0, 128, TRAMEIN, 1); 

        EEAckPolling(0xA0);


        T0CONbits.TMR0ON = 0; 

        EESequentialRead(0x0, 128, TRAMEOUT, 1);
        TRAMEENVOIRS485DONNEES();
        cFlag = 1;
        }        
    }
}

void Init_RS485(void) {

    unsigned int SPEED;

    TRISCbits.TRISC5 = 0;
    TRISCbits.TRISC7 = 1;
    TRISCbits.TRISC6 = 0;
    TRISCbits.TRISC5 = 0; 

    TRISAbits.TRISA4 = 0; 



    RCSTA1bits.SPEN = 1; 
    TXSTA1bits.SYNC = 0; 
    BAUDCON1bits.BRG16 = 1;

    TXSTA1bits.BRGH = 1; 
    SPEED = 624; 
    SPBRG1 = SPEED; 
    SPBRGH1 = SPEED >> 8; 





    IPR1bits.RCIP = 1; 
    PIR1bits.RCIF = 0; 
    PIE1bits.RCIE = 0; 

    TXSTA1bits.TXEN = 0; 
    RCSTA1bits.RX9 = 0; 
    TXSTA1bits.TX9 = 0; 
    RCSTA1bits.CREN = 0; 
    RCONbits.IPEN = 1; 

}

void TRAMEENVOIRS485DONNEES(void) {
    unsigned char u;
    unsigned char tmp;
    tmp = 0;

    do {
ret1:

        u = TRAMEOUT[tmp];
        if (u == 0xFF) 
            u = 'x';
        RS485(u);
        
        


        tmp = tmp + 1;
    } while ((u != '*') && (tmp < 200));



}

void RS485(unsigned char carac) {
    


    PORTAbits.RA4  = 1; 
    PORTHbits.RH3  = !PORTHbits.RH3 ;

    TXSTA1bits.TXEN = 0;

    RCSTA1bits.CREN = 0; 

    TXSTA1bits.TXEN = 1; 


    TXREG1 = carac;

    
    
    
    
    while (TXSTA1bits.TRMT == 0); 
    
    TXSTA1bits.TXEN = 0;

    PORTAbits.RA4  = 0; 
    
}

void Init_I2C(void) {

    
    DDRCbits.RC3 = 1; 
    DDRCbits.RC4 = 1; 
    SSP1STAT = 0x00; 
    SSP1CON1 = 0x28; 
    SSP1CON2 = 0x00; 
    SSP1ADD = 0x3B; 
}

signed char EESequRead(unsigned char cControl, unsigned int address, unsigned char *rdptr, unsigned char length) {
    unsigned char cADDE;
    unsigned char cAdressL, cAdressH;
    
    cADDE = (cControl << 1) & 0xFF;
    cADDE = cADDE | 0xA0;

    cAdressL = (address) & 0xFF;
    cAdressH = (address) >> 8;
    while ((SSP1CON2 & 0x1F) | (SSP1STATbits.R_W)) ; 
    SSP1CON2bits.SEN=1;while(SSP1CON2bits.SEN) ; 
    if (PIR2bits.BCLIF) 
    {
        PIR2bits.BCLIF = 0;
        return ( -1); 
    } else {
        if (WriteI2C1 (cADDE)) 
        {
            SSP1CON2bits.PEN=1;while(SSP1CON2bits.PEN) ;
            return ( -3); 
        }

        if (!SSPCON2bits.ACKSTAT) 
        {
            if (WriteI2C1 (cAdressH)) 
            {
                SSP1CON2bits.PEN=1;while(SSP1CON2bits.PEN) ;
                return ( -3); 
            }

            while (SSPCON2bits.ACKSTAT);
            if (!SSPCON2bits.ACKSTAT) 
            {
                if (WriteI2C1 (cAdressL)) 
                {
                    SSP1CON2bits.PEN=1;while(SSP1CON2bits.PEN) ;
                    return ( -3); 
                }

                while (SSPCON2bits.ACKSTAT);
                if (!SSPCON2bits.ACKSTAT) 
                {
                    SSP1CON2bits.RSEN=1;while(SSP1CON2bits.RSEN) ; 
                    if (WriteI2C1 (cADDE + 1))
                    {
                        SSP1CON2bits.PEN=1;while(SSP1CON2bits.PEN) ;
                        return ( -3); 
                    }

                    while (SSPCON2bits.ACKSTAT);
                    if (!SSPCON2bits.ACKSTAT)
                    {
                        if (getsI2C1 (rdptr, length))
                        {
                            return ( -1); 
                        }

                        SSP1CON2bits.ACKDT=1, SSP1CON2bits.ACKEN=1;while(SSP1CON2bits.ACKEN) ; 
                        SSP1CON2bits.PEN=1;while(SSP1CON2bits.PEN) ; 
                        if (PIR2bits.BCLIF) 
                        {
                            PIR2bits.BCLIF = 0;
                            return ( -1); 
                        }
                    } else {
                        SSP1CON2bits.PEN=1;while(SSP1CON2bits.PEN) ;
                        return ( -2); 
                    }
                } else {
                    SSP1CON2bits.PEN=1;while(SSP1CON2bits.PEN) ;
                    return ( -2); 
                }
            } else {
                SSP1CON2bits.PEN=1;while(SSP1CON2bits.PEN) ;
                return ( -2); 
            }
        } else {
            SSP1CON2bits.PEN=1;while(SSP1CON2bits.PEN) ;
            return ( -2); 
        }
    }
    return ( 0); 
}

signed char EEPaWrite(unsigned char cControl, unsigned int address, unsigned char *wrptr) {
    unsigned char cADDE;
    unsigned char cAdressL, cAdressH;
    
    cADDE = (cControl << 1) & 0xFF;
    cADDE = cADDE | 0xA0;

    cAdressL = (address) & 0xFF;
    cAdressH = (address) >> 8;

    while ((SSP1CON2 & 0x1F) | (SSP1STATbits.R_W)) ; 
    SSP1CON2bits.SEN=1;while(SSP1CON2bits.SEN) ; 
    if (PIR2bits.BCLIF) 
    {
        PIR2bits.BCLIF = 0;
        return ( -1); 
    } else {
        if (WriteI2C1 (cADDE)) 
        {
            SSP1CON2bits.PEN=1;while(SSP1CON2bits.PEN) ;
            return ( -3); 
        }
        while ((SSP1CON2 & 0x1F) | (SSP1STATbits.R_W)) ;
        if (WriteI2C1 (cAdressH)) 
        {
            SSP1CON2bits.PEN=1;while(SSP1CON2bits.PEN) ;
            return ( -3); 
        }
        while ((SSP1CON2 & 0x1F) | (SSP1STATbits.R_W)) ;
        if (WriteI2C1 (cAdressL)) 
        {
            SSP1CON2bits.PEN=1;while(SSP1CON2bits.PEN) ;
            return ( -3); 
        }
        while ((SSP1CON2 & 0x1F) | (SSP1STATbits.R_W)) ;
        if (putsI2C1 (wrptr)) {
            SSP1CON2bits.PEN=1;while(SSP1CON2bits.PEN) ;
            return ( -4); 
        }
    }

    
    SSP1CON2bits.PEN=1;while(SSP1CON2bits.PEN) ; 
    if (PIR2bits.BCLIF) 
    {
        PIR2bits.BCLIF = 0;
        return ( -1); 
    }
    return ( 0); 
}


unsigned char ECRIRE_EEPROMBYTE(unsigned char ADDE, unsigned int ADDHL, unsigned char *tab, char g) {
    unsigned char TMP2, TMP;
    unsigned int h;
    unsigned char t;
    unsigned char AddH, AddL;




    
    if (ADDE == 6) 
        ADDE = 12;
    if (ADDE == 5)
        ADDE = 10;
    if (ADDE == 4)
        ADDE = 8;
    if (ADDE == 3)
        ADDE = 6;
    if (ADDE == 2)
        ADDE = 4;
    if (ADDE == 1)
        ADDE = 2;




    TMP2 = ADDE;
    
    TMP2 = 0XA0 | TMP2;


    AddL = (ADDHL);
    AddH = (ADDHL) >> 8;




    while ((SSP1CON2 & 0x1F) | (SSP1STATbits.R_W)) ; 
    SSP1CON2bits.SEN=1;while(SSP1CON2bits.SEN) ; 
    WriteI2C1 (TMP2); 
    while ((SSP1CON2 & 0x1F) | (SSP1STATbits.R_W)) ; 
    WriteI2C1 (AddH); 
    while ((SSP1CON2 & 0x1F) | (SSP1STATbits.R_W)) ; 
    WriteI2C1 (AddL); 
    while ((SSP1CON2 & 0x1F) | (SSP1STATbits.R_W)) ; 
    putstringI2C(tab); 
    while ((SSP1CON2 & 0x1F) | (SSP1STATbits.R_W)) ; 
    SSP1CON2bits.PEN=1;while(SSP1CON2bits.PEN) ; 
    return ( 0); 

}

unsigned char putstringI2C(unsigned char *wrptr) {



    unsigned char x;

    unsigned int PageSize;
    PageSize = 128;


    for (x = 0; x < PageSize; x++) 
    {
        if (SSPCON1bits.SSPM3) 
        { 
            if (WriteI2C1  (*wrptr)) 
            {
                return ( -3); 
            }
            while ((SSP1CON2 & 0x1F) | (SSP1STATbits.R_W)) ; 
            if (SSPCON2bits.ACKSTAT) 
            {
                return ( -2); 
            } 
        } else 
        {
            PIR1bits.SSPIF = 0; 
            SSPBUF = *wrptr; 
            SSPCON1bits.CKP = 1; 
            while (!PIR1bits.SSPIF); 
            if ((!SSPSTATbits.R_W) && (!SSPSTATbits.BF))
            {
                return ( -2); 
            }
        }



        wrptr++; 



    } 
    return ( 0);
}

unsigned char LIRE_EEPROM(unsigned char ADDE, unsigned int ADDHL, unsigned char *tab, char r) {
    char h;
    unsigned char t;
    unsigned char TMP2;
    unsigned char TMP4;
    unsigned char AddH, AddL;


    
    if (ADDE == 6) 
        ADDE = 12;
    if (ADDE == 5)
        ADDE = 10;
    if (ADDE == 4)
        ADDE = 8;
    if (ADDE == 3)
        ADDE = 6;
    if (ADDE == 2)
        ADDE = 4;
    if (ADDE == 1)
        ADDE = 2;





    AddL = ADDHL;
    AddH = ADDHL >> 8;



    TMP2 = ADDE;
    
    TMP2 = TMP2 | 0xA0;


    while ((SSP1CON2 & 0x1F) | (SSP1STATbits.R_W)) ;
    SSP1CON2bits.SEN=1;while(SSP1CON2bits.SEN) ;
    
    while (SSPCON2bits.SEN);

    WriteI2C1 (TMP2); 
    while ((SSP1CON2 & 0x1F) | (SSP1STATbits.R_W)) ;




    WriteI2C1 (AddH); 
    while ((SSP1CON2 & 0x1F) | (SSP1STATbits.R_W)) ;

    while (SSPCON2bits.RSEN);

    WriteI2C1 (AddL); 
    while ((SSP1CON2 & 0x1F) | (SSP1STATbits.R_W)) ;


    SSP1CON2bits.RSEN=1;while(SSP1CON2bits.RSEN) ;
    while (SSPCON2bits.RSEN);


    
    TMP2 = TMP2 | 0x01;
    WriteI2C1 (TMP2); 
    while ((SSP1CON2 & 0x1F) | (SSP1STATbits.R_W)) ;



    
    if (r == 1) 
        getsI2C1 (tab, 86);
    if (r == 0)
        getsI2C1 (tab, 108);
    if (r == 3)
        getsI2C1 (tab, 116);
    if (r == 4)
        getsI2C1 (tab, 24);
    if (r == 5)
        getsI2C1 (tab, 120);
    if (r == 6)
        getsI2C1 (tab, 100);


    SSP1CON2bits.ACKDT=1, SSP1CON2bits.ACKEN=1;while(SSP1CON2bits.ACKEN) ;
    while (SSPCON2bits.ACKEN);



    SSP1CON2bits.PEN=1;while(SSP1CON2bits.PEN) ;
    while (SSPCON2bits.PEN);
    return (1);
}
