Warning[2054] C:\Users\LFRAD\Documents\CMS2Luc\ProjetsNettoyesCMSGit\ProjetCarteIO\project\MainDemoV1.c 1820 : suspicious pointer conversion
Warning[2054] C:\Users\LFRAD\Documents\CMS2Luc\ProjetsNettoyesCMSGit\ProjetCarteIO\project\MainDemoV1.c 1840 : suspicious pointer conversion
Warning[2054] C:\Users\LFRAD\Documents\CMS2Luc\ProjetsNettoyesCMSGit\ProjetCarteIO\project\MainDemoV1.c 1847 : suspicious pointer conversion
Warning[2054] C:\Users\LFRAD\Documents\CMS2Luc\ProjetsNettoyesCMSGit\ProjetCarteIO\project\MainDemoV1.c 1884 : suspicious pointer conversion
Warning[2054] C:\Users\LFRAD\Documents\CMS2Luc\ProjetsNettoyesCMSGit\ProjetCarteIO\project\MainDemoV1.c 1891 : suspicious pointer conversion
Warning[2054] C:\Users\LFRAD\Documents\CMS2Luc\ProjetsNettoyesCMSGit\ProjetCarteIO\project\MainDemoV1.c 1913 : suspicious pointer conversion
Warning[2054] C:\Users\LFRAD\Documents\CMS2Luc\ProjetsNettoyesCMSGit\ProjetCarteIO\project\MainDemoV1.c 1920 : suspicious pointer conversion
Warning[2054] C:\Users\LFRAD\Documents\CMS2Luc\ProjetsNettoyesCMSGit\ProjetCarteIO\project\MainDemoV1.c 2233 : suspicious pointer conversion
Warning[2054] C:\Users\LFRAD\Documents\CMS2Luc\ProjetsNettoyesCMSGit\ProjetCarteIO\project\MainDemoV1.c 2271 : suspicious pointer conversion
Warning[2054] C:\Users\LFRAD\Documents\CMS2Luc\ProjetsNettoyesCMSGit\ProjetCarteIO\project\MainDemoV1.c 2304 : suspicious pointer conversion
Warning[2054] C:\Users\LFRAD\Documents\CMS2Luc\ProjetsNettoyesCMSGit\ProjetCarteIO\project\MainDemoV1.c 2336 : suspicious pointer conversion
Warning[2054] C:\Users\LFRAD\Documents\CMS2Luc\ProjetsNettoyesCMSGit\ProjetCarteIO\project\MainDemoV1.c 2368 : suspicious pointer conversion
Warning[2054] C:\Users\LFRAD\Documents\CMS2Luc\ProjetsNettoyesCMSGit\ProjetCarteIO\project\MainDemoV1.c 2400 : suspicious pointer conversion
Warning[2054] C:\Users\LFRAD\Documents\CMS2Luc\ProjetsNettoyesCMSGit\ProjetCarteIO\project\MainDemoV1.c 2412 : suspicious pointer conversion
Warning[2054] C:\Users\LFRAD\Documents\CMS2Luc\ProjetsNettoyesCMSGit\ProjetCarteIO\project\MainDemoV1.c 2437 : suspicious pointer conversion
Warning[2054] C:\Users\LFRAD\Documents\CMS2Luc\ProjetsNettoyesCMSGit\ProjetCarteIO\project\MainDemoV1.c 2444 : suspicious pointer conversion
Warning[2054] C:\Users\LFRAD\Documents\CMS2Luc\ProjetsNettoyesCMSGit\ProjetCarteIO\project\MainDemoV1.c 2477 : suspicious pointer conversion
Warning[2054] C:\Users\LFRAD\Documents\CMS2Luc\ProjetsNettoyesCMSGit\ProjetCarteIO\project\MainDemoV1.c 2484 : suspicious pointer conversion
Warning[2054] C:\Users\LFRAD\Documents\CMS2Luc\ProjetsNettoyesCMSGit\ProjetCarteIO\project\MainDemoV1.c 2515 : suspicious pointer conversion
Warning[2054] C:\Users\LFRAD\Documents\CMS2Luc\ProjetsNettoyesCMSGit\ProjetCarteIO\project\MainDemoV1.c 2522 : suspicious pointer conversion
Warning[2054] C:\Users\LFRAD\Documents\CMS2Luc\ProjetsNettoyesCMSGit\ProjetCarteIO\project\MainDemoV1.c 2551 : suspicious pointer conversion
Warning[2054] C:\Users\LFRAD\Documents\CMS2Luc\ProjetsNettoyesCMSGit\ProjetCarteIO\project\MainDemoV1.c 2558 : suspicious pointer conversion
Warning[2054] C:\Users\LFRAD\Documents\CMS2Luc\ProjetsNettoyesCMSGit\ProjetCarteIO\project\MainDemoV1.c 2590 : suspicious pointer conversion
Warning[2054] C:\Users\LFRAD\Documents\CMS2Luc\ProjetsNettoyesCMSGit\ProjetCarteIO\project\MainDemoV1.c 2597 : suspicious pointer conversion
Warning[2054] C:\Users\LFRAD\Documents\CMS2Luc\ProjetsNettoyesCMSGit\ProjetCarteIO\project\MainDemoV1.c 2632 : suspicious pointer conversion
Warning[2054] C:\Users\LFRAD\Documents\CMS2Luc\ProjetsNettoyesCMSGit\ProjetCarteIO\project\MainDemoV1.c 2639 : suspicious pointer conversion
Warning[2054] C:\Users\LFRAD\Documents\CMS2Luc\ProjetsNettoyesCMSGit\ProjetCarteIO\project\MainDemoV1.c 2659 : suspicious pointer conversion
Warning[2054] C:\Users\LFRAD\Documents\CMS2Luc\ProjetsNettoyesCMSGit\ProjetCarteIO\project\MainDemoV1.c 2666 : suspicious pointer conversion
Warning[2054] C:\Users\LFRAD\Documents\CMS2Luc\ProjetsNettoyesCMSGit\ProjetCarteIO\project\MainDemoV1.c 2983 : suspicious pointer conversion
Warning[2054] C:\Users\LFRAD\Documents\CMS2Luc\ProjetsNettoyesCMSGit\ProjetCarteIO\project\MainDemoV1.c 3024 : suspicious pointer conversion
Warning[2054] C:\Users\LFRAD\Documents\CMS2Luc\ProjetsNettoyesCMSGit\ProjetCarteIO\project\MainDemoV1.c 3039 : suspicious pointer conversion
Warning[2054] C:\Users\LFRAD\Documents\CMS2Luc\ProjetsNettoyesCMSGit\ProjetCarteIO\project\MainDemoV1.c 3477 : suspicious pointer conversion
Warning[2054] C:\Users\LFRAD\Documents\CMS2Luc\ProjetsNettoyesCMSGit\ProjetCarteIO\project\MainDemoV1.c 3532 : suspicious pointer conversion
Warning[2054] C:\Users\LFRAD\Documents\CMS2Luc\ProjetsNettoyesCMSGit\ProjetCarteIO\project\MainDemoV1.c 3532 : suspicious pointer conversion
Warning[2054] C:\Users\LFRAD\Documents\CMS2Luc\ProjetsNettoyesCMSGit\ProjetCarteIO\project\MainDemoV1.c 3532 : suspicious pointer conversion
Warning[2054] C:\Users\LFRAD\Documents\CMS2Luc\ProjetsNettoyesCMSGit\ProjetCarteIO\project\MainDemoV1.c 3603 : suspicious pointer conversion
Warning[2054] C:\Users\LFRAD\Documents\CMS2Luc\ProjetsNettoyesCMSGit\ProjetCarteIO\project\MainDemoV1.c 3603 : suspicious pointer conversion
Warning[2054] C:\Users\LFRAD\Documents\CMS2Luc\ProjetsNettoyesCMSGit\ProjetCarteIO\project\MainDemoV1.c 3603 : suspicious pointer conversion
Warning[2054] C:\Users\LFRAD\Documents\CMS2Luc\ProjetsNettoyesCMSGit\ProjetCarteIO\project\MainDemoV1.c 3647 : suspicious pointer conversion
Warning[2054] C:\Users\LFRAD\Documents\CMS2Luc\ProjetsNettoyesCMSGit\ProjetCarteIO\project\MainDemoV1.c 3698 : suspicious pointer conversion
Warning[2054] C:\Users\LFRAD\Documents\CMS2Luc\ProjetsNettoyesCMSGit\ProjetCarteIO\project\MainDemoV1.c 3751 : suspicious pointer conversion
Warning[2058] C:\Users\LFRAD\Documents\CMS2Luc\ProjetsNettoyesCMSGit\ProjetCarteIO\project\MainDemoV1.c 9304 : call of function without prototype
Warning[2054] C:\Users\LFRAD\Documents\CMS2Luc\ProjetsNettoyesCMSGit\ProjetCarteIO\project\MainDemoV1.c 9797 : suspicious pointer conversion
Warning[2054] C:\Users\LFRAD\Documents\CMS2Luc\ProjetsNettoyesCMSGit\ProjetCarteIO\project\MainDemoV1.c 9876 : suspicious pointer conversion
Warning[2054] C:\Users\LFRAD\Documents\CMS2Luc\ProjetsNettoyesCMSGit\ProjetCarteIO\project\MainDemoV1.c 9876 : suspicious pointer conversion
Warning[2054] C:\Users\LFRAD\Documents\CMS2Luc\ProjetsNettoyesCMSGit\ProjetCarteIO\project\MainDemoV1.c 9876 : suspicious pointer conversion
Warning[2054] C:\Users\LFRAD\Documents\CMS2Luc\ProjetsNettoyesCMSGit\ProjetCarteIO\project\MainDemoV1.c 9952 : suspicious pointer conversion
Warning[2054] C:\Users\LFRAD\Documents\CMS2Luc\ProjetsNettoyesCMSGit\ProjetCarteIO\project\MainDemoV1.c 10238 : suspicious pointer conversion
Warning[2054] C:\Users\LFRAD\Documents\CMS2Luc\ProjetsNettoyesCMSGit\ProjetCarteIO\project\MainDemoV1.c 10241 : suspicious pointer conversion
Warning[2054] C:\Users\LFRAD\Documents\CMS2Luc\ProjetsNettoyesCMSGit\ProjetCarteIO\project\MainDemoV1.c 10251 : suspicious pointer conversion
Warning[2054] C:\Users\LFRAD\Documents\CMS2Luc\ProjetsNettoyesCMSGit\ProjetCarteIO\project\MainDemoV1.c 10271 : suspicious pointer conversion
Warning[2054] C:\Users\LFRAD\Documents\CMS2Luc\ProjetsNettoyesCMSGit\ProjetCarteIO\project\MainDemoV1.c 10587 : suspicious pointer conversion
Warning[2054] C:\Users\LFRAD\Documents\CMS2Luc\ProjetsNettoyesCMSGit\ProjetCarteIO\project\MainDemoV1.c 11770 : suspicious pointer conversion
Warning[2054] C:\Users\LFRAD\Documents\CMS2Luc\ProjetsNettoyesCMSGit\ProjetCarteIO\project\MainDemoV1.c 11978 : suspicious pointer conversion
Warning[2054] C:\Users\LFRAD\Documents\CMS2Luc\ProjetsNettoyesCMSGit\ProjetCarteIO\project\MainDemoV1.c 12168 : suspicious pointer conversion
Warning[2054] C:\Users\LFRAD\Documents\CMS2Luc\ProjetsNettoyesCMSGit\ProjetCarteIO\project\MainDemoV1.c 12729 : suspicious pointer conversion
Warning[2054] C:\Users\LFRAD\Documents\CMS2Luc\ProjetsNettoyesCMSGit\ProjetCarteIO\project\MainDemoV1.c 13128 : suspicious pointer conversion
Warning[2054] C:\Users\LFRAD\Documents\CMS2Luc\ProjetsNettoyesCMSGit\ProjetCarteIO\project\MainDemoV1.c 13182 : suspicious pointer conversion
Warning[2054] C:\Users\LFRAD\Documents\CMS2Luc\ProjetsNettoyesCMSGit\ProjetCarteIO\project\MainDemoV1.c 13182 : suspicious pointer conversion
Warning[2054] C:\Users\LFRAD\Documents\CMS2Luc\ProjetsNettoyesCMSGit\ProjetCarteIO\project\MainDemoV1.c 13182 : suspicious pointer conversion
Warning[2054] C:\Users\LFRAD\Documents\CMS2Luc\ProjetsNettoyesCMSGit\ProjetCarteIO\project\MainDemoV1.c 13828 : suspicious pointer conversion
Warning[2054] C:\Users\LFRAD\Documents\CMS2Luc\ProjetsNettoyesCMSGit\ProjetCarteIO\project\MainDemoV1.c 13899 : suspicious pointer conversion
Warning[2054] C:\Users\LFRAD\Documents\CMS2Luc\ProjetsNettoyesCMSGit\ProjetCarteIO\project\MainDemoV1.c 14206 : suspicious pointer conversion
Warning[2054] C:\Users\LFRAD\Documents\CMS2Luc\ProjetsNettoyesCMSGit\ProjetCarteIO\project\MainDemoV1.c 14306 : suspicious pointer conversion
Warning[2054] C:\Users\LFRAD\Documents\CMS2Luc\ProjetsNettoyesCMSGit\ProjetCarteIO\project\MainDemoV1.c 14418 : suspicious pointer conversion
Warning[2054] C:\Users\LFRAD\Documents\CMS2Luc\ProjetsNettoyesCMSGit\ProjetCarteIO\project\MainDemoV1.c 14488 : suspicious pointer conversion
Warning[2054] C:\Users\LFRAD\Documents\CMS2Luc\ProjetsNettoyesCMSGit\ProjetCarteIO\project\MainDemoV1.c 14494 : suspicious pointer conversion
Warning[2054] C:\Users\LFRAD\Documents\CMS2Luc\ProjetsNettoyesCMSGit\ProjetCarteIO\project\MainDemoV1.c 14501 : suspicious pointer conversion
Warning[2054] C:\Users\LFRAD\Documents\CMS2Luc\ProjetsNettoyesCMSGit\ProjetCarteIO\project\MainDemoV1.c 14507 : suspicious pointer conversion
Warning[2054] C:\Users\LFRAD\Documents\CMS2Luc\ProjetsNettoyesCMSGit\ProjetCarteIO\project\MainDemoV1.c 14512 : suspicious pointer conversion
Warning[2054] C:\Users\LFRAD\Documents\CMS2Luc\ProjetsNettoyesCMSGit\ProjetCarteIO\project\MainDemoV1.c 14517 : suspicious pointer conversion
Warning[2054] C:\Users\LFRAD\Documents\CMS2Luc\ProjetsNettoyesCMSGit\ProjetCarteIO\project\MainDemoV1.c 14524 : suspicious pointer conversion
Warning[2054] C:\Users\LFRAD\Documents\CMS2Luc\ProjetsNettoyesCMSGit\ProjetCarteIO\project\MainDemoV1.c 14529 : suspicious pointer conversion
Warning[2054] C:\Users\LFRAD\Documents\CMS2Luc\ProjetsNettoyesCMSGit\ProjetCarteIO\project\MainDemoV1.c 14535 : suspicious pointer conversion
Warning[2054] C:\Users\LFRAD\Documents\CMS2Luc\ProjetsNettoyesCMSGit\ProjetCarteIO\project\MainDemoV1.c 14569 : suspicious pointer conversion
Warning[2054] C:\Users\LFRAD\Documents\CMS2Luc\ProjetsNettoyesCMSGit\ProjetCarteIO\project\MainDemoV1.c 14600 : suspicious pointer conversion
Warning[2054] C:\Users\LFRAD\Documents\CMS2Luc\ProjetsNettoyesCMSGit\ProjetCarteIO\project\MainDemoV1.c 14600 : suspicious pointer conversion
Warning[2054] C:\Users\LFRAD\Documents\CMS2Luc\ProjetsNettoyesCMSGit\ProjetCarteIO\project\MainDemoV1.c 14600 : suspicious pointer conversion
Warning[2054] C:\Users\LFRAD\Documents\CMS2Luc\ProjetsNettoyesCMSGit\ProjetCarteIO\project\MainDemoV1.c 14602 : suspicious pointer conversion
Warning[2054] C:\Users\LFRAD\Documents\CMS2Luc\ProjetsNettoyesCMSGit\ProjetCarteIO\project\MainDemoV1.c 14611 : suspicious pointer conversion
Warning[2054] C:\Users\LFRAD\Documents\CMS2Luc\ProjetsNettoyesCMSGit\ProjetCarteIO\project\MainDemoV1.c 14611 : suspicious pointer conversion
Warning[2054] C:\Users\LFRAD\Documents\CMS2Luc\ProjetsNettoyesCMSGit\ProjetCarteIO\project\MainDemoV1.c 14611 : suspicious pointer conversion
Warning[2054] C:\Users\LFRAD\Documents\CMS2Luc\ProjetsNettoyesCMSGit\ProjetCarteIO\project\MainDemoV1.c 14614 : suspicious pointer conversion
Warning[2054] C:\Users\LFRAD\Documents\CMS2Luc\ProjetsNettoyesCMSGit\ProjetCarteIO\project\MainDemoV1.c 14644 : suspicious pointer conversion
Warning[2054] C:\Users\LFRAD\Documents\CMS2Luc\ProjetsNettoyesCMSGit\ProjetCarteIO\project\MainDemoV1.c 14644 : suspicious pointer conversion
Warning[2054] C:\Users\LFRAD\Documents\CMS2Luc\ProjetsNettoyesCMSGit\ProjetCarteIO\project\MainDemoV1.c 14644 : suspicious pointer conversion
Warning[2054] C:\Users\LFRAD\Documents\CMS2Luc\ProjetsNettoyesCMSGit\ProjetCarteIO\project\MainDemoV1.c 14645 : suspicious pointer conversion
Warning[2054] C:\Users\LFRAD\Documents\CMS2Luc\ProjetsNettoyesCMSGit\ProjetCarteIO\project\MainDemoV1.c 14729 : suspicious pointer conversion
Warning[2054] C:\Users\LFRAD\Documents\CMS2Luc\ProjetsNettoyesCMSGit\ProjetCarteIO\project\MainDemoV1.c 14737 : suspicious pointer conversion
Warning[2054] C:\Users\LFRAD\Documents\CMS2Luc\ProjetsNettoyesCMSGit\ProjetCarteIO\project\MainDemoV1.c 14764 : suspicious pointer conversion
Warning[2054] C:\Users\LFRAD\Documents\CMS2Luc\ProjetsNettoyesCMSGit\ProjetCarteIO\project\MainDemoV1.c 14766 : suspicious pointer conversion
Warning[2054] C:\Users\LFRAD\Documents\CMS2Luc\ProjetsNettoyesCMSGit\ProjetCarteIO\project\MainDemoV1.c 14766 : suspicious pointer conversion
Warning[2054] C:\Users\LFRAD\Documents\CMS2Luc\ProjetsNettoyesCMSGit\ProjetCarteIO\project\MainDemoV1.c 14766 : suspicious pointer conversion
Warning[2054] C:\Users\LFRAD\Documents\CMS2Luc\ProjetsNettoyesCMSGit\ProjetCarteIO\project\MainDemoV1.c 14768 : suspicious pointer conversion
Warning[2054] C:\Users\LFRAD\Documents\CMS2Luc\ProjetsNettoyesCMSGit\ProjetCarteIO\project\MainDemoV1.c 14768 : suspicious pointer conversion
Warning[2054] C:\Users\LFRAD\Documents\CMS2Luc\ProjetsNettoyesCMSGit\ProjetCarteIO\project\MainDemoV1.c 14768 : suspicious pointer conversion
Warning[2054] C:\Users\LFRAD\Documents\CMS2Luc\ProjetsNettoyesCMSGit\ProjetCarteIO\project\MainDemoV1.c 14798 : suspicious pointer conversion
Warning[2054] C:\Users\LFRAD\Documents\CMS2Luc\ProjetsNettoyesCMSGit\ProjetCarteIO\project\MainDemoV1.c 14800 : suspicious pointer conversion
Warning[2054] C:\Users\LFRAD\Documents\CMS2Luc\ProjetsNettoyesCMSGit\ProjetCarteIO\project\MainDemoV1.c 14800 : suspicious pointer conversion
Warning[2054] C:\Users\LFRAD\Documents\CMS2Luc\ProjetsNettoyesCMSGit\ProjetCarteIO\project\MainDemoV1.c 14800 : suspicious pointer conversion
Warning[2054] C:\Users\LFRAD\Documents\CMS2Luc\ProjetsNettoyesCMSGit\ProjetCarteIO\project\MainDemoV1.c 15383 : suspicious pointer conversion
Warning[2054] C:\Users\LFRAD\Documents\CMS2Luc\ProjetsNettoyesCMSGit\ProjetCarteIO\project\MainDemoV1.c 15509 : suspicious pointer conversion
Warning[2054] C:\Users\LFRAD\Documents\CMS2Luc\ProjetsNettoyesCMSGit\ProjetCarteIO\project\MainDemoV1.c 15512 : suspicious pointer conversion
Warning[2054] C:\Users\LFRAD\Documents\CMS2Luc\ProjetsNettoyesCMSGit\ProjetCarteIO\project\MainDemoV1.c 15734 : suspicious pointer conversion
Warning[2054] C:\Users\LFRAD\Documents\CMS2Luc\ProjetsNettoyesCMSGit\ProjetCarteIO\project\MainDemoV1.c 15740 : suspicious pointer conversion
Warning[2054] C:\Users\LFRAD\Documents\CMS2Luc\ProjetsNettoyesCMSGit\ProjetCarteIO\project\MainDemoV1.c 16271 : suspicious pointer conversion
Warning[2054] C:\Users\LFRAD\Documents\CMS2Luc\ProjetsNettoyesCMSGit\ProjetCarteIO\project\MainDemoV1.c 16275 : suspicious pointer conversion
Warning[2054] C:\Users\LFRAD\Documents\CMS2Luc\ProjetsNettoyesCMSGit\ProjetCarteIO\project\MainDemoV1.c 16465 : suspicious pointer conversion
Warning[2054] C:\Users\LFRAD\Documents\CMS2Luc\ProjetsNettoyesCMSGit\ProjetCarteIO\project\MainDemoV1.c 16490 : suspicious pointer conversion
Warning[2054] C:\Users\LFRAD\Documents\CMS2Luc\ProjetsNettoyesCMSGit\ProjetCarteIO\project\MainDemoV1.c 16946 : suspicious pointer conversion
Warning[2054] C:\Users\LFRAD\Documents\CMS2Luc\ProjetsNettoyesCMSGit\ProjetCarteIO\project\MainDemoV1.c 17493 : suspicious pointer conversion
Warning[2054] C:\Users\LFRAD\Documents\CMS2Luc\ProjetsNettoyesCMSGit\ProjetCarteIO\project\MainDemoV1.c 17512 : suspicious pointer conversion
Warning[2054] C:\Users\LFRAD\Documents\CMS2Luc\ProjetsNettoyesCMSGit\ProjetCarteIO\project\MainDemoV1.c 18195 : suspicious pointer conversion
Warning[2054] C:\Users\LFRAD\Documents\CMS2Luc\ProjetsNettoyesCMSGit\ProjetCarteIO\project\MainDemoV1.c 18195 : suspicious pointer conversion
Warning[2054] C:\Users\LFRAD\Documents\CMS2Luc\ProjetsNettoyesCMSGit\ProjetCarteIO\project\MainDemoV1.c 18195 : suspicious pointer conversion
Warning[2054] C:\Users\LFRAD\Documents\CMS2Luc\ProjetsNettoyesCMSGit\ProjetCarteIO\project\MainDemoV1.c 18198 : suspicious pointer conversion
Warning[2054] C:\Users\LFRAD\Documents\CMS2Luc\ProjetsNettoyesCMSGit\ProjetCarteIO\project\MainDemoV1.c 18198 : suspicious pointer conversion
Warning[2054] C:\Users\LFRAD\Documents\CMS2Luc\ProjetsNettoyesCMSGit\ProjetCarteIO\project\MainDemoV1.c 18198 : suspicious pointer conversion
Warning[2054] C:\Users\LFRAD\Documents\CMS2Luc\ProjetsNettoyesCMSGit\ProjetCarteIO\project\MainDemoV1.c 18236 : suspicious pointer conversion
Warning[2054] C:\Users\LFRAD\Documents\CMS2Luc\ProjetsNettoyesCMSGit\ProjetCarteIO\project\MainDemoV1.c 18311 : suspicious pointer conversion
Warning[2054] C:\Users\LFRAD\Documents\CMS2Luc\ProjetsNettoyesCMSGit\ProjetCarteIO\project\MainDemoV1.c 18768 : suspicious pointer conversion
Warning[2054] C:\Users\LFRAD\Documents\CMS2Luc\ProjetsNettoyesCMSGit\ProjetCarteIO\project\MainDemoV1.c 18768 : suspicious pointer conversion
Warning[2054] C:\Users\LFRAD\Documents\CMS2Luc\ProjetsNettoyesCMSGit\ProjetCarteIO\project\MainDemoV1.c 18768 : suspicious pointer conversion
Warning[2054] C:\Users\LFRAD\Documents\CMS2Luc\ProjetsNettoyesCMSGit\ProjetCarteIO\project\MainDemoV1.c 18877 : suspicious pointer conversion
Warning[2054] C:\Users\LFRAD\Documents\CMS2Luc\ProjetsNettoyesCMSGit\ProjetCarteIO\project\MainDemoV1.c 18877 : suspicious pointer conversion
Warning[2054] C:\Users\LFRAD\Documents\CMS2Luc\ProjetsNettoyesCMSGit\ProjetCarteIO\project\MainDemoV1.c 18877 : suspicious pointer conversion
Warning[2054] C:\Users\LFRAD\Documents\CMS2Luc\ProjetsNettoyesCMSGit\ProjetCarteIO\project\MainDemoV1.c 18878 : suspicious pointer conversion
Warning[2054] C:\Users\LFRAD\Documents\CMS2Luc\ProjetsNettoyesCMSGit\ProjetCarteIO\project\MainDemoV1.c 18878 : suspicious pointer conversion
Warning[2054] C:\Users\LFRAD\Documents\CMS2Luc\ProjetsNettoyesCMSGit\ProjetCarteIO\project\MainDemoV1.c 18878 : suspicious pointer conversion
Warning[2054] C:\Users\LFRAD\Documents\CMS2Luc\ProjetsNettoyesCMSGit\ProjetCarteIO\project\MainDemoV1.c 18965 : suspicious pointer conversion
Warning[2054] C:\Users\LFRAD\Documents\CMS2Luc\ProjetsNettoyesCMSGit\ProjetCarteIO\project\MainDemoV1.c 18967 : suspicious pointer conversion
Warning[2054] C:\Users\LFRAD\Documents\CMS2Luc\ProjetsNettoyesCMSGit\ProjetCarteIO\project\MainDemoV1.c 18977 : suspicious pointer conversion
Warning[2054] C:\Users\LFRAD\Documents\CMS2Luc\ProjetsNettoyesCMSGit\ProjetCarteIO\project\MainDemoV1.c 18991 : suspicious pointer conversion
