__S0 1FD40 0 ABS 0
__S1 180 0 ABS 0
__S2 0 0 ABS 0
__S4 0 0 ABS 0
__S5 0 0 ABS 0
_SSP1STATbits FC7 0 ABS 0
putstringI2C@x 9 0 COMRAM 1
__Hintentry 0 0 ABS 0
__Lintentry 0 0 ABS 0
_tmp 16 0 COMRAM 1
__size_of_ECRIRE_EEPROMBYTE 0 0 ABS 0
main@cBcl 14 0 COMRAM 1
_main 1FA70 0 CODE 0
___sp 0 0 STACK 2
__end_of_getsI2C1 1F3DA 0 CODE 0
start 0 0 CODE 0
EEAckPolling@cControl 4 0 COMRAM 1
_RS485 1F2A6 0 CODE 0
_TMR0H FD7 0 ABS 0
_TMR0L FD6 0 ABS 0
__Hirdata 0 0 CODE 0
__Lirdata 0 0 CODE 0
__HRAM 0 0 ABS 0
__LRAM 1 0 ABS 0
__end_of_putstringI2C 1F4B8 0 CODE 0
__Hconfig 30000E 0 CONFIG 4
__Lconfig 0 0 CONFIG 4
_EEAckPolling 1F598 0 CODE 0
putstringI2C@wrptr 3 0 COMRAM 1
_cFlag 15 0 COMRAM 1
__Hbigram 0 0 ABS 0
__Lbigram 0 0 ABS 0
__Hrparam 0 0 COMRAM 1
__Lrparam 0 0 COMRAM 1
__Hram 0 0 ABS 0
__Lram 0 0 ABS 0
__Hcomram 0 0 ABS 0
__Lcomram 0 0 ABS 0
__Hsfr 0 0 ABS 0
__Lsfr 0 0 ABS 0
__Hbss 0 0 RAM 1
__Lbss 0 0 RAM 1
___param_bank 0 0 ABS 0
__Hnvrram 0 0 COMRAM 1
__Lnvrram 0 0 COMRAM 1
_TXREG1 FAD 0 ABS 0
_SPBRG1 FAF 0 ABS 0
_PIE1bits F9D 0 ABS 0
__Heeprom_data 0 0 EEDATA 0
__Leeprom_data 0 0 EEDATA 0
_PIR1bits F9E 0 ABS 0
_IPR1bits F9F 0 ABS 0
_PIR2bits FA1 0 ABS 0
_DDRCbits F94 0 ABS 0
__Hintsave_regs 0 0 BIGRAM 1
__Lintsave_regs 0 0 BIGRAM 1
_RCONbits FD0 0 ABS 0
__size_of_EEAckPolling 0 0 ABS 0
__Hbigbss 0 0 BIGRAM 1
__Lbigbss 0 0 BIGRAM 1
__Hintret 0 0 ABS 0
__Lintret 0 0 ABS 0
__Hramtop 1000 0 RAM 0
ECRIRE_EEPROMBYTE@g E 0 COMRAM 1
__Lramtop 1000 0 RAM 0
__Hstruct 0 0 COMRAM 1
__Lstruct 0 0 COMRAM 1
__Hbigdata 0 0 BIGRAM 1
__Lbigdata 0 0 BIGRAM 1
__Hmediumconst 0 0 MEDIUMCONST 0
__Lmediumconst 0 0 MEDIUMCONST 0
__Hfarbss 0 0 FARRAM 0
__Lfarbss 0 0 FARRAM 0
__Hintcode 0 0 CODE 0
_SSPBUF FC9 0 ABS 0
__Lintcode 0 0 CODE 0
__Hfardata 0 0 FARRAM 0
__Lfardata 0 0 FARRAM 0
__Habs1 0 0 ABS 0
__Labs1 0 0 ABS 0
__HnvFARRAM 0 0 FARRAM 0
__LnvFARRAM 0 0 FARRAM 0
ECRIRE_EEPROMBYTE@tab C 0 COMRAM 1
EESequentialRead@address 4 0 COMRAM 1
RS485@carac 2 0 COMRAM 1
_WriteI2C1 1F4B8 0 CODE 0
ECRIRE_EEPROMBYTE@TMP2 12 0 COMRAM 1
__Hdata 0 0 ABS 0
__Ldata 0 0 ABS 0
ECRIRE_EEPROMBYTE@ADDE 13 0 COMRAM 1
stackhi EEE 0 ABS 0
ECRIRE_EEPROMBYTE@AddH 10 0 COMRAM 1
__Htemp 0 0 COMRAM 1
__Ltemp 0 0 COMRAM 1
stacklo 180 0 ABS 0
__Hrbit 0 0 COMRAM 1
__Lrbit 0 0 COMRAM 1
ECRIRE_EEPROMBYTE@AddL 11 0 COMRAM 1
__Hinit 4 0 CODE 0
__Linit 0 0 CODE 0
__Hintcodelo 0 0 CODE 0
__Lintcodelo 0 0 CODE 0
__Hrbss 0 0 COMRAM 1
__end_of_main 1FD40 0 CODE 0
__Lrbss 0 0 COMRAM 1
_cCompt 17 0 COMRAM 1
__size_of_ReadI2C1 0 0 ABS 0
__Htext 0 0 ABS 0
__Ltext 0 0 ABS 0
getsI2C1@length 3 0 COMRAM 1
__end_of_TRAMEENVOIRS485DONNEES 1F342 0 CODE 0
end_of_initialization 1F238 0 CODE 0
__size_of_TRAMEENVOIRS485DONNEES 0 0 ABS 0
__size_of_Init_I2C 0 0 ABS 0
_SPBRGH1 F7F 0 ABS 0
WriteI2C1@data_out 2 0 COMRAM 1
_SSP1ADD FC8 0 ABS 0
__end_of_Init_RS485 1F26A 0 CODE 0
_TRISAbits F92 0 ABS 0
_TRISCbits F94 0 ABS 0
_PORTAbits F80 0 ABS 0
_T0CONbits FD5 0 ABS 0
ECRIRE_EEPROMBYTE@ADDHL A 0 COMRAM 1
_TRISJbits F9A 0 ABS 0
_PORTHbits F87 0 ABS 0
_PORTJbits F88 0 ABS 0
TRAMEENVOIRS485DONNEES@tmp 4 0 COMRAM 1
_SSP1BUF FC9 0 ABS 0
__Hibigdata 0 0 CODE 0
__Libigdata 0 0 CODE 0
_TRAMEIN 60 0 BANK0 1
__Hifardata 0 0 CODE 0
__Lifardata 0 0 CODE 0
__Hbank0 0 0 ABS 0
__Lbank0 0 0 ABS 0
__Hbank1 0 0 ABS 0
__Lbank1 0 0 ABS 0
__Hbank2 0 0 ABS 0
__Lbank2 0 0 ABS 0
__Hbank3 0 0 ABS 0
__Lbank3 0 0 ABS 0
__Hbank4 0 0 ABS 0
__Lbank4 0 0 ABS 0
__Hbank5 0 0 ABS 0
__Lbank5 0 0 ABS 0
__Hpowerup 0 0 CODE 0
__Lpowerup 0 0 CODE 0
__Hbank6 0 0 ABS 0
__Lbank6 0 0 ABS 0
__Hbank7 0 0 ABS 0
__Lbank7 0 0 ABS 0
__Hbank8 0 0 ABS 0
__Lbank8 0 0 ABS 0
__Htext0 0 0 ABS 0
__Ltext0 0 0 ABS 0
__Hbank9 0 0 ABS 0
_SSPCON1bits FC6 0 ABS 0
__Lbank9 0 0 ABS 0
__Htext1 0 0 ABS 0
getsI2C1@rdptr 1 0 COMRAM 1
__Ltext1 0 0 ABS 0
__ptext0 1FA70 0 CODE 0
_INTCON2bits FF1 0 ABS 0
_SSPCON2bits FC5 0 ABS 0
__Htext2 0 0 ABS 0
__Ltext2 0 0 ABS 0
__ptext1 1F2EC 0 CODE 0
__Htext3 0 0 ABS 0
__Ltext3 0 0 ABS 0
__ptext2 1F2A6 0 CODE 0
__Htext4 0 0 ABS 0
__Ltext4 0 0 ABS 0
__ptext3 1F1FC 0 CODE 0
__Htext5 0 0 ABS 0
__Ltext5 0 0 ABS 0
putstringI2C@PageSize 7 0 COMRAM 1
__ptext4 1F23E 0 CODE 0
__Htext6 0 0 ABS 0
__Ltext6 0 0 ABS 0
__ptext5 1F1E6 0 CODE 0
__Htext7 0 0 ABS 0
__Ltext7 0 0 ABS 0
__ptext6 1F846 0 CODE 0
__HbssCOMRAM 0 0 ABS 0
__LbssCOMRAM 0 0 ABS 0
__Htext8 0 0 ABS 0
__Ltext8 0 0 ABS 0
__ptext7 1F342 0 CODE 0
__pbssCOMRAM 15 0 COMRAM 1
__Htext9 0 0 ABS 0
__Ltext9 0 0 ABS 0
__ptext8 1F26A 0 CODE 0
__ptext9 1F598 0 CODE 0
__Hclrtext 0 0 ABS 0
__Lclrtext 0 0 ABS 0
_Init_RS485 1F23E 0 CODE 0
__end_of__initialization 1F238 0 CODE 0
___rparam_used 1 0 ABS 0
_SSPSTATbits FC7 0 ABS 0
__size_of_Init_RS485 0 0 ABS 0
__Hidata 0 0 CODE 0
__Lidata 0 0 CODE 0
__Hrdata 0 0 COMRAM 1
__Lrdata 0 0 COMRAM 1
__Hidloc 200008 0 IDLOC 5
__Lidloc 0 0 IDLOC 5
__Hstack 0 0 STACK 2
__end_of_Init_I2C 1F1FC 0 CODE 0
__Lstack 0 0 STACK 2
__Hparam 0 0 COMRAM 1
__Lparam 0 0 COMRAM 1
__Hspace_0 1FD40 0 ABS 0
__HcstackCOMRAM 0 0 ABS 0
__Lspace_0 0 0 ABS 0
__LcstackCOMRAM 0 0 ABS 0
__pcstackCOMRAM 1 0 COMRAM 1
__Hspace_1 180 0 ABS 0
__Lspace_1 0 0 ABS 0
__Hsmallconst 0 0 SMALLCONST 0
__Lsmallconst 0 0 SMALLCONST 0
__size_of_EESequentialRead 0 0 ABS 0
__Hspace_2 0 0 ABS 0
__Lspace_2 0 0 ABS 0
__Hnvbit 0 0 COMRAM 1
__Lnvbit 0 0 COMRAM 1
__Hcinit 0 0 ABS 0
TRAMEENVOIRS485DONNEES@u 3 0 COMRAM 1
__Lcinit 0 0 ABS 0
__pcinit 1F21A 0 CODE 0
__ramtop 1000 0 RAM 0
__mediumconst 0 0 MEDIUMCONST 0
__size_of_main 0 0 ABS 0
__Hconst 0 0 CONST 0
__Lconst 0 0 CONST 0
__Hspace_4 60000E 0 ABS 0
__Lspace_4 0 0 ABS 0
_ReadI2C1 1F26A 0 CODE 0
_OpenI2C1 1F1FC 0 CODE 0
EESequentialRead@cAdressH C 0 COMRAM 1
_getsI2C1 1F342 0 CODE 0
EESequentialRead@cAdressL B 0 COMRAM 1
__HbssBANK0 0 0 ABS 0
__LbssBANK0 0 0 ABS 0
_SSP1CON1 FC6 0 ABS 0
__Hbank10 0 0 ABS 0
__pbssBANK0 60 0 BANK0 1
__Lbank10 0 0 ABS 0
_SSP1CON2 FC5 0 ABS 0
__Hbank11 0 0 ABS 0
__Lbank11 0 0 ABS 0
__Hbank12 0 0 ABS 0
__Lbank12 0 0 ABS 0
__Hbank13 0 0 ABS 0
__Lbank13 0 0 ABS 0
__HbssBANK1 0 0 ABS 0
__LbssBANK1 0 0 ABS 0
__Hbank14 0 0 ABS 0
__pbssBANK1 100 0 BANK1 1
__Lbank14 0 0 ABS 0
__Htext10 0 0 ABS 0
__Ltext10 0 0 ABS 0
__ptext10 1F69C 0 CODE 0
__Hbank15 0 0 ABS 0
__Lbank15 0 0 ABS 0
__Htext11 0 0 ABS 0
__Ltext11 0 0 ABS 0
__ptext11 1F3DA 0 CODE 0
_EESequentialRead 1F846 0 CODE 0
__Htext12 0 0 ABS 0
__Ltext12 0 0 ABS 0
__ptext12 1F4B8 0 CODE 0
_RCSTA1bits FAB 0 ABS 0
_TXSTA1bits FAC 0 ABS 0
___extmem_base 20000 0 ABS 0
___inthi_sp 0 0 STACK 2
_Init_I2C 1F1E6 0 CODE 0
EEAckPolling@cADDE 5 0 COMRAM 1
EESequentialRead@cADDE D 0 COMRAM 1
__end_of_ReadI2C1 1F2A6 0 CODE 0
___intlo_sp 0 0 STACK 2
_INTCONbits FF2 0 ABS 0
__size_of_putstringI2C 0 0 ABS 0
_putstringI2C 1F3DA 0 CODE 0
__end_of_EESequentialRead 1FA70 0 CODE 0
__size_of_OpenI2C1 0 0 ABS 0
_ECRIRE_EEPROMBYTE 1F69C 0 CODE 0
__smallconst 0 0 SMALLCONST 0
OpenI2C1@slew 1 0 COMRAM 1
EESequentialRead@rdptr 6 0 COMRAM 1
__Hreset_vec 0 0 CODE 0
__Lreset_vec 0 0 CODE 0
__size_of_RS485 0 0 ABS 0
_TRAMEENVOIRS485DONNEES 1F2EC 0 CODE 0
__accesstop 60 0 ABS 0
EESequentialRead@cControl A 0 COMRAM 1
__Hintcode_body 0 0 ABS 0
__Lintcode_body 0 0 ABS 0
__end_of_WriteI2C1 1F598 0 CODE 0
intlevel0 0 0 CODE 0
_SSP1STAT FC7 0 ABS 0
intlevel1 0 0 CODE 0
intlevel2 0 0 CODE 0
intlevel3 0 0 CODE 0
_SSP1CON1bits FC6 0 ABS 0
_BAUDCON1bits F7E 0 ABS 0
_SSP1CON2bits FC5 0 ABS 0
__size_of_WriteI2C1 0 0 ABS 0
__end_of_ECRIRE_EEPROMBYTE 1F846 0 CODE 0
_TRAMEOUT 100 0 BANK1 1
start_initialization 1F21A 0 CODE 0
__end_of_RS485 1F2EC 0 CODE 0
EESequentialRead@length 8 0 COMRAM 1
OpenI2C1@sync_mode 2 0 COMRAM 1
__initialization 1F21A 0 CODE 0
__end_of_EEAckPolling 1F69C 0 CODE 0
__size_of_getsI2C1 0 0 ABS 0
__activetblptr 0 0 ABS 0
__end_of_OpenI2C1 1F21A 0 CODE 0
%segments
reset_vec 0 3 CODE 0 0
cstackCOMRAM 1 17 COMRAM 1 1
bssBANK0 60 E0 BANK0 60 1
bssBANK1 100 17F BANK1 100 1
text0 1FA70 1FD3F CODE 1FA70 0
text6 1F846 1FA6F CODE 1F846 0
text10 1F69C 1F845 CODE 1F69C 0
text9 1F598 1F69B CODE 1F598 0
text12 1F4B8 1F597 CODE 1F4B8 0
text11 1F3DA 1F4B7 CODE 1F3DA 0
text7 1F342 1F3D9 CODE 1F342 0
text1 1F2EC 1F341 CODE 1F2EC 0
text2 1F2A6 1F2EB CODE 1F2A6 0
text8 1F26A 1F2A5 CODE 1F26A 0
text4 1F23E 1F269 CODE 1F23E 0
cinit 1F21A 1F23D CODE 1F21A 0
text3 1F1FC 1F219 CODE 1F1FC 0
text5 1F1E6 1F1FB CODE 1F1E6 0
%locals
dist/default/debug\ProjetEeprom.X.debug.o
C:/Program Files (x86)/Microchip/MPLABX/v5.40/packs/Microchip/PIC18Fxxxx_DFP/1.2.26/xc8\pic\include\proc\pic18f8723.h
C:\Users\LFRAD\AppData\Local\Temp\se3c.s
1051 1F21A 0 CODE 0
1053 1F21A 0 CODE 0
1056 1F21A 0 CODE 0
1086 1F21A 0 CODE 0
1087 1F21E 0 CODE 0
1088 1F220 0 CODE 0
1089 1F220 0 CODE 0
1090 1F222 0 CODE 0
1091 1F224 0 CODE 0
1094 1F226 0 CODE 0
1095 1F22A 0 CODE 0
1096 1F22C 0 CODE 0
1097 1F22C 0 CODE 0
1098 1F22E 0 CODE 0
1099 1F230 0 CODE 0
1102 1F232 0 CODE 0
1103 1F234 0 CODE 0
1104 1F236 0 CODE 0
1110 1F238 0 CODE 0
1112 1F238 0 CODE 0
1113 1F23A 0 CODE 0
TestI2Cxc8.c
116 1FA70 0 CODE 0
119 1FA70 0 CODE 0
120 1FA7A 0 CODE 0
121 1FA7C 0 CODE 0
123 1FA7E 0 CODE 0
124 1FA80 0 CODE 0
125 1FA82 0 CODE 0
127 1FA84 0 CODE 0
130 1FA88 0 CODE 0
131 1FA8A 0 CODE 0
132 1FA8C 0 CODE 0
134 1FA8E 0 CODE 0
136 1FA92 0 CODE 0
137 1FA94 0 CODE 0
138 1FA96 0 CODE 0
139 1FA98 0 CODE 0
140 1FA9A 0 CODE 0
141 1FA9C 0 CODE 0
142 1FAA0 0 CODE 0
143 1FAA2 0 CODE 0
148 1FAA4 0 CODE 0
149 1FAA8 0 CODE 0
151 1FAAC 0 CODE 0
152 1FAB0 0 CODE 0
155 1FAB4 0 CODE 0
156 1FABA 0 CODE 0
157 1FABE 0 CODE 0
158 1FAC2 0 CODE 0
159 1FAC6 0 CODE 0
160 1FACA 0 CODE 0
161 1FACE 0 CODE 0
162 1FAD2 0 CODE 0
163 1FAD6 0 CODE 0
164 1FADA 0 CODE 0
165 1FADE 0 CODE 0
166 1FAE2 0 CODE 0
167 1FAE6 0 CODE 0
168 1FAEA 0 CODE 0
169 1FAEE 0 CODE 0
170 1FAF2 0 CODE 0
171 1FAF6 0 CODE 0
172 1FAFA 0 CODE 0
173 1FAFE 0 CODE 0
174 1FB02 0 CODE 0
175 1FB06 0 CODE 0
176 1FB0A 0 CODE 0
177 1FB0E 0 CODE 0
178 1FB12 0 CODE 0
179 1FB16 0 CODE 0
180 1FB1A 0 CODE 0
181 1FB1E 0 CODE 0
182 1FB22 0 CODE 0
183 1FB26 0 CODE 0
184 1FB2A 0 CODE 0
185 1FB2E 0 CODE 0
186 1FB32 0 CODE 0
187 1FB36 0 CODE 0
188 1FB3A 0 CODE 0
189 1FB3E 0 CODE 0
190 1FB42 0 CODE 0
191 1FB46 0 CODE 0
192 1FB4A 0 CODE 0
193 1FB4E 0 CODE 0
194 1FB52 0 CODE 0
195 1FB56 0 CODE 0
196 1FB5A 0 CODE 0
197 1FB5E 0 CODE 0
198 1FB62 0 CODE 0
199 1FB66 0 CODE 0
200 1FB6A 0 CODE 0
201 1FB6E 0 CODE 0
202 1FB72 0 CODE 0
203 1FB76 0 CODE 0
204 1FB7A 0 CODE 0
205 1FB7E 0 CODE 0
206 1FB82 0 CODE 0
207 1FB86 0 CODE 0
208 1FB8A 0 CODE 0
209 1FB8E 0 CODE 0
210 1FB92 0 CODE 0
211 1FB96 0 CODE 0
212 1FB9A 0 CODE 0
213 1FB9E 0 CODE 0
214 1FBA2 0 CODE 0
215 1FBA6 0 CODE 0
216 1FBAA 0 CODE 0
217 1FBAE 0 CODE 0
218 1FBB2 0 CODE 0
219 1FBB6 0 CODE 0
220 1FBBA 0 CODE 0
221 1FBBE 0 CODE 0
222 1FBC2 0 CODE 0
223 1FBC6 0 CODE 0
224 1FBCA 0 CODE 0
225 1FBCE 0 CODE 0
226 1FBD2 0 CODE 0
227 1FBD6 0 CODE 0
228 1FBDA 0 CODE 0
229 1FBDE 0 CODE 0
230 1FBE2 0 CODE 0
231 1FBE6 0 CODE 0
232 1FBEA 0 CODE 0
233 1FBEE 0 CODE 0
234 1FBF2 0 CODE 0
235 1FBF6 0 CODE 0
236 1FBFA 0 CODE 0
237 1FBFE 0 CODE 0
238 1FC02 0 CODE 0
239 1FC06 0 CODE 0
240 1FC0A 0 CODE 0
241 1FC0E 0 CODE 0
242 1FC12 0 CODE 0
243 1FC16 0 CODE 0
244 1FC1A 0 CODE 0
245 1FC1E 0 CODE 0
246 1FC22 0 CODE 0
247 1FC26 0 CODE 0
248 1FC2A 0 CODE 0
249 1FC2E 0 CODE 0
250 1FC32 0 CODE 0
251 1FC36 0 CODE 0
252 1FC3A 0 CODE 0
253 1FC3E 0 CODE 0
254 1FC42 0 CODE 0
255 1FC46 0 CODE 0
256 1FC4A 0 CODE 0
257 1FC4E 0 CODE 0
258 1FC52 0 CODE 0
259 1FC56 0 CODE 0
260 1FC5A 0 CODE 0
261 1FC5E 0 CODE 0
262 1FC62 0 CODE 0
263 1FC66 0 CODE 0
264 1FC6A 0 CODE 0
265 1FC6E 0 CODE 0
266 1FC72 0 CODE 0
267 1FC76 0 CODE 0
268 1FC7A 0 CODE 0
269 1FC7E 0 CODE 0
270 1FC82 0 CODE 0
271 1FC86 0 CODE 0
272 1FC8A 0 CODE 0
273 1FC8E 0 CODE 0
274 1FC92 0 CODE 0
275 1FC96 0 CODE 0
276 1FC9A 0 CODE 0
277 1FC9E 0 CODE 0
278 1FCA2 0 CODE 0
279 1FCA6 0 CODE 0
280 1FCAA 0 CODE 0
281 1FCAE 0 CODE 0
282 1FCB2 0 CODE 0
283 1FCB6 0 CODE 0
285 1FCBA 0 CODE 0
286 1FCBE 0 CODE 0
287 1FCCE 0 CODE 0
291 1FCE0 0 CODE 0
292 1FCF0 0 CODE 0
293 1FCF2 0 CODE 0
295 1FD0E 0 CODE 0
298 1FD14 0 CODE 0
300 1FD16 0 CODE 0
301 1FD30 0 CODE 0
302 1FD34 0 CODE 0
TestI2Cxc8.c
345 1F2EC 0 CODE 0
348 1F2EC 0 CODE 0
353 1F2F0 0 CODE 0
354 1F300 0 CODE 0
355 1F310 0 CODE 0
356 1F314 0 CODE 0
361 1F31A 0 CODE 0
362 1F31E 0 CODE 0
366 1F340 0 CODE 0
TestI2Cxc8.c
368 1F2A6 0 CODE 0
372 1F2A8 0 CODE 0
373 1F2AA 0 CODE 0
375 1F2CE 0 CODE 0
377 1F2D0 0 CODE 0
379 1F2D2 0 CODE 0
382 1F2D4 0 CODE 0
388 1F2D8 0 CODE 0
390 1F2E6 0 CODE 0
392 1F2E8 0 CODE 0
394 1F2EA 0 CODE 0
i2c.c
19 1F1FC 0 CODE 0
20 1F1FE 0 CODE 0
21 1F202 0 CODE 0
22 1F206 0 CODE 0
23 1F20A 0 CODE 0
24 1F20E 0 CODE 0
26 1F212 0 CODE 0
27 1F214 0 CODE 0
29 1F216 0 CODE 0
30 1F218 0 CODE 0
TestI2Cxc8.c
307 1F23E 0 CODE 0
311 1F23E 0 CODE 0
312 1F240 0 CODE 0
313 1F242 0 CODE 0
314 1F244 0 CODE 0
316 1F246 0 CODE 0
320 1F248 0 CODE 0
321 1F24A 0 CODE 0
322 1F24C 0 CODE 0
324 1F24E 0 CODE 0
325 1F250 0 CODE 0
326 1F250 0 CODE 0
327 1F254 0 CODE 0
333 1F258 0 CODE 0
334 1F25A 0 CODE 0
335 1F25C 0 CODE 0
337 1F25E 0 CODE 0
338 1F260 0 CODE 0
339 1F262 0 CODE 0
340 1F264 0 CODE 0
341 1F266 0 CODE 0
343 1F268 0 CODE 0
TestI2Cxc8.c
396 1F1E6 0 CODE 0
399 1F1E6 0 CODE 0
400 1F1E8 0 CODE 0
401 1F1EA 0 CODE 0
402 1F1EE 0 CODE 0
403 1F1F2 0 CODE 0
404 1F1F6 0 CODE 0
405 1F1FA 0 CODE 0
i2c.c
311 1F846 0 CODE 0
315 1F848 0 CODE 0
316 1F84E 0 CODE 0
318 1F854 0 CODE 0
319 1F858 0 CODE 0
320 1F85C 0 CODE 0
321 1F886 0 CODE 0
322 1F896 0 CODE 0
324 1F8A4 0 CODE 0
325 1F8A6 0 CODE 0
327 1F8AA 0 CODE 0
329 1F8C0 0 CODE 0
331 1F8D4 0 CODE 0
333 1F8D4 0 CODE 0
335 1F8E2 0 CODE 0
337 1F8F8 0 CODE 0
341 1F90C 0 CODE 0
342 1F91A 0 CODE 0
344 1F928 0 CODE 0
346 1F93E 0 CODE 0
350 1F952 0 CODE 0
351 1F960 0 CODE 0
353 1F96E 0 CODE 0
354 1F97E 0 CODE 0
356 1F994 0 CODE 0
360 1F9A8 0 CODE 0
361 1F9B6 0 CODE 0
363 1F9C4 0 CODE 0
366 1F9E8 0 CODE 0
368 1F9E8 0 CODE 0
369 1F9FA 0 CODE 0
370 1FA0A 0 CODE 0
372 1FA18 0 CODE 0
373 1FA1A 0 CODE 0
375 1FA1E 0 CODE 0
376 1FA1E 0 CODE 0
379 1FA32 0 CODE 0
380 1FA32 0 CODE 0
383 1FA46 0 CODE 0
384 1FA46 0 CODE 0
386 1FA5A 0 CODE 0
387 1FA5A 0 CODE 0
388 1FA5E 0 CODE 0
393 1FA6E 0 CODE 0
i2c.c
68 1F342 0 CODE 0
69 1F342 0 CODE 0
71 1F346 0 CODE 0
72 1F358 0 CODE 0
74 1F366 0 CODE 0
76 1F374 0 CODE 0
80 1F37A 0 CODE 0
82 1F3A2 0 CODE 0
84 1F3B2 0 CODE 0
85 1F3B4 0 CODE 0
86 1F3B6 0 CODE 0
69 1F3C4 0 CODE 0
91 1F3D6 0 CODE 0
92 1F3D8 0 CODE 0
i2c.c
60 1F26A 0 CODE 0
62 1F26A 0 CODE 0
63 1F292 0 CODE 0
64 1F294 0 CODE 0
65 1F2A2 0 CODE 0
66 1F2A4 0 CODE 0
i2c.c
123 1F598 0 CODE 0
125 1F59A 0 CODE 0
126 1F5A0 0 CODE 0
128 1F5A6 0 CODE 0
129 1F5D0 0 CODE 0
131 1F5E0 0 CODE 0
133 1F5EE 0 CODE 0
134 1F5F0 0 CODE 0
136 1F5F4 0 CODE 0
138 1F60A 0 CODE 0
142 1F61E 0 CODE 0
144 1F61E 0 CODE 0
145 1F62E 0 CODE 0
147 1F63C 0 CODE 0
148 1F63E 0 CODE 0
151 1F642 0 CODE 0
153 1F658 0 CODE 0
156 1F66C 0 CODE 0
142 1F66C 0 CODE 0
157 1F67A 0 CODE 0
159 1F67A 0 CODE 0
160 1F68A 0 CODE 0
162 1F698 0 CODE 0
166 1F69A 0 CODE 0
TestI2Cxc8.c
543 1F69C 0 CODE 0
553 1F69E 0 CODE 0
554 1F6B0 0 CODE 0
555 1F6B4 0 CODE 0
556 1F6C6 0 CODE 0
557 1F6CA 0 CODE 0
558 1F6DC 0 CODE 0
559 1F6E0 0 CODE 0
560 1F6F2 0 CODE 0
561 1F6F6 0 CODE 0
562 1F708 0 CODE 0
563 1F70C 0 CODE 0
564 1F71C 0 CODE 0
569 1F720 0 CODE 0
571 1F724 0 CODE 0
574 1F72A 0 CODE 0
575 1F72E 0 CODE 0
580 1F732 0 CODE 0
581 1F75C 0 CODE 0
582 1F76C 0 CODE 0
583 1F772 0 CODE 0
584 1F79C 0 CODE 0
585 1F7A2 0 CODE 0
586 1F7CC 0 CODE 0
587 1F7D2 0 CODE 0
588 1F7FC 0 CODE 0
589 1F808 0 CODE 0
590 1F832 0 CODE 0
591 1F842 0 CODE 0
593 1F844 0 CODE 0
TestI2Cxc8.c
595 1F3DA 0 CODE 0
602 1F3DA 0 CODE 0
605 1F3E2 0 CODE 0
607 1F3EA 0 CODE 0
609 1F3F8 0 CODE 0
613 1F41A 0 CODE 0
614 1F444 0 CODE 0
618 1F456 0 CODE 0
620 1F456 0 CODE 0
621 1F458 0 CODE 0
622 1F464 0 CODE 0
623 1F466 0 CODE 0
624 1F474 0 CODE 0
632 1F494 0 CODE 0
636 1F498 0 CODE 0
638 1F4B6 0 CODE 0
i2c.c
32 1F4B8 0 CODE 0
33 1F4BA 0 CODE 0
34 1F4BE 0 CODE 0
35 1F4CC 0 CODE 0
37 1F4D2 0 CODE 0
39 1F4FA 0 CODE 0
41 1F4FC 0 CODE 0
40 1F4FC 0 CODE 0
44 1F50A 0 CODE 0
46 1F526 0 CODE 0
47 1F52C 0 CODE 0
49 1F532 0 CODE 0
52 1F55A 0 CODE 0
53 1F584 0 CODE 0
58 1F596 0 CODE 0
