Warning[2054] C:\cms2 luc\CMS2 23032021 - Reims jaures\carte com IP MPLAB\carte com IP MPLAB\TCPIP\Demo App\MainDemo.c 1830 : suspicious pointer conversion
Warning[2054] C:\cms2 luc\CMS2 23032021 - Reims jaures\carte com IP MPLAB\carte com IP MPLAB\TCPIP\Demo App\MainDemo.c 1850 : suspicious pointer conversion
Warning[2054] C:\cms2 luc\CMS2 23032021 - Reims jaures\carte com IP MPLAB\carte com IP MPLAB\TCPIP\Demo App\MainDemo.c 1857 : suspicious pointer conversion
Warning[2054] C:\cms2 luc\CMS2 23032021 - Reims jaures\carte com IP MPLAB\carte com IP MPLAB\TCPIP\Demo App\MainDemo.c 1894 : suspicious pointer conversion
Warning[2054] C:\cms2 luc\CMS2 23032021 - Reims jaures\carte com IP MPLAB\carte com IP MPLAB\TCPIP\Demo App\MainDemo.c 1901 : suspicious pointer conversion
Warning[2054] C:\cms2 luc\CMS2 23032021 - Reims jaures\carte com IP MPLAB\carte com IP MPLAB\TCPIP\Demo App\MainDemo.c 1923 : suspicious pointer conversion
Warning[2054] C:\cms2 luc\CMS2 23032021 - Reims jaures\carte com IP MPLAB\carte com IP MPLAB\TCPIP\Demo App\MainDemo.c 1930 : suspicious pointer conversion
Warning[2054] C:\cms2 luc\CMS2 23032021 - Reims jaures\carte com IP MPLAB\carte com IP MPLAB\TCPIP\Demo App\MainDemo.c 2243 : suspicious pointer conversion
Warning[2054] C:\cms2 luc\CMS2 23032021 - Reims jaures\carte com IP MPLAB\carte com IP MPLAB\TCPIP\Demo App\MainDemo.c 2281 : suspicious pointer conversion
Warning[2054] C:\cms2 luc\CMS2 23032021 - Reims jaures\carte com IP MPLAB\carte com IP MPLAB\TCPIP\Demo App\MainDemo.c 2314 : suspicious pointer conversion
Warning[2054] C:\cms2 luc\CMS2 23032021 - Reims jaures\carte com IP MPLAB\carte com IP MPLAB\TCPIP\Demo App\MainDemo.c 2346 : suspicious pointer conversion
Warning[2054] C:\cms2 luc\CMS2 23032021 - Reims jaures\carte com IP MPLAB\carte com IP MPLAB\TCPIP\Demo App\MainDemo.c 2378 : suspicious pointer conversion
Warning[2054] C:\cms2 luc\CMS2 23032021 - Reims jaures\carte com IP MPLAB\carte com IP MPLAB\TCPIP\Demo App\MainDemo.c 2410 : suspicious pointer conversion
Warning[2054] C:\cms2 luc\CMS2 23032021 - Reims jaures\carte com IP MPLAB\carte com IP MPLAB\TCPIP\Demo App\MainDemo.c 2422 : suspicious pointer conversion
Warning[2054] C:\cms2 luc\CMS2 23032021 - Reims jaures\carte com IP MPLAB\carte com IP MPLAB\TCPIP\Demo App\MainDemo.c 2447 : suspicious pointer conversion
Warning[2054] C:\cms2 luc\CMS2 23032021 - Reims jaures\carte com IP MPLAB\carte com IP MPLAB\TCPIP\Demo App\MainDemo.c 2454 : suspicious pointer conversion
Warning[2054] C:\cms2 luc\CMS2 23032021 - Reims jaures\carte com IP MPLAB\carte com IP MPLAB\TCPIP\Demo App\MainDemo.c 2487 : suspicious pointer conversion
Warning[2054] C:\cms2 luc\CMS2 23032021 - Reims jaures\carte com IP MPLAB\carte com IP MPLAB\TCPIP\Demo App\MainDemo.c 2494 : suspicious pointer conversion
Warning[2054] C:\cms2 luc\CMS2 23032021 - Reims jaures\carte com IP MPLAB\carte com IP MPLAB\TCPIP\Demo App\MainDemo.c 2525 : suspicious pointer conversion
Warning[2054] C:\cms2 luc\CMS2 23032021 - Reims jaures\carte com IP MPLAB\carte com IP MPLAB\TCPIP\Demo App\MainDemo.c 2532 : suspicious pointer conversion
Warning[2054] C:\cms2 luc\CMS2 23032021 - Reims jaures\carte com IP MPLAB\carte com IP MPLAB\TCPIP\Demo App\MainDemo.c 2561 : suspicious pointer conversion
Warning[2054] C:\cms2 luc\CMS2 23032021 - Reims jaures\carte com IP MPLAB\carte com IP MPLAB\TCPIP\Demo App\MainDemo.c 2568 : suspicious pointer conversion
Warning[2054] C:\cms2 luc\CMS2 23032021 - Reims jaures\carte com IP MPLAB\carte com IP MPLAB\TCPIP\Demo App\MainDemo.c 2600 : suspicious pointer conversion
Warning[2054] C:\cms2 luc\CMS2 23032021 - Reims jaures\carte com IP MPLAB\carte com IP MPLAB\TCPIP\Demo App\MainDemo.c 2607 : suspicious pointer conversion
Warning[2054] C:\cms2 luc\CMS2 23032021 - Reims jaures\carte com IP MPLAB\carte com IP MPLAB\TCPIP\Demo App\MainDemo.c 2642 : suspicious pointer conversion
Warning[2054] C:\cms2 luc\CMS2 23032021 - Reims jaures\carte com IP MPLAB\carte com IP MPLAB\TCPIP\Demo App\MainDemo.c 2649 : suspicious pointer conversion
Warning[2054] C:\cms2 luc\CMS2 23032021 - Reims jaures\carte com IP MPLAB\carte com IP MPLAB\TCPIP\Demo App\MainDemo.c 2669 : suspicious pointer conversion
Warning[2054] C:\cms2 luc\CMS2 23032021 - Reims jaures\carte com IP MPLAB\carte com IP MPLAB\TCPIP\Demo App\MainDemo.c 2676 : suspicious pointer conversion
Warning[2054] C:\cms2 luc\CMS2 23032021 - Reims jaures\carte com IP MPLAB\carte com IP MPLAB\TCPIP\Demo App\MainDemo.c 2993 : suspicious pointer conversion
Warning[2054] C:\cms2 luc\CMS2 23032021 - Reims jaures\carte com IP MPLAB\carte com IP MPLAB\TCPIP\Demo App\MainDemo.c 3034 : suspicious pointer conversion
Warning[2054] C:\cms2 luc\CMS2 23032021 - Reims jaures\carte com IP MPLAB\carte com IP MPLAB\TCPIP\Demo App\MainDemo.c 3049 : suspicious pointer conversion
Warning[2054] C:\cms2 luc\CMS2 23032021 - Reims jaures\carte com IP MPLAB\carte com IP MPLAB\TCPIP\Demo App\MainDemo.c 3487 : suspicious pointer conversion
Warning[2054] C:\cms2 luc\CMS2 23032021 - Reims jaures\carte com IP MPLAB\carte com IP MPLAB\TCPIP\Demo App\MainDemo.c 3542 : suspicious pointer conversion
Warning[2054] C:\cms2 luc\CMS2 23032021 - Reims jaures\carte com IP MPLAB\carte com IP MPLAB\TCPIP\Demo App\MainDemo.c 3542 : suspicious pointer conversion
Warning[2054] C:\cms2 luc\CMS2 23032021 - Reims jaures\carte com IP MPLAB\carte com IP MPLAB\TCPIP\Demo App\MainDemo.c 3542 : suspicious pointer conversion
Warning[2054] C:\cms2 luc\CMS2 23032021 - Reims jaures\carte com IP MPLAB\carte com IP MPLAB\TCPIP\Demo App\MainDemo.c 3613 : suspicious pointer conversion
Warning[2054] C:\cms2 luc\CMS2 23032021 - Reims jaures\carte com IP MPLAB\carte com IP MPLAB\TCPIP\Demo App\MainDemo.c 3613 : suspicious pointer conversion
Warning[2054] C:\cms2 luc\CMS2 23032021 - Reims jaures\carte com IP MPLAB\carte com IP MPLAB\TCPIP\Demo App\MainDemo.c 3613 : suspicious pointer conversion
Warning[2054] C:\cms2 luc\CMS2 23032021 - Reims jaures\carte com IP MPLAB\carte com IP MPLAB\TCPIP\Demo App\MainDemo.c 3657 : suspicious pointer conversion
Warning[2054] C:\cms2 luc\CMS2 23032021 - Reims jaures\carte com IP MPLAB\carte com IP MPLAB\TCPIP\Demo App\MainDemo.c 3708 : suspicious pointer conversion
Warning[2054] C:\cms2 luc\CMS2 23032021 - Reims jaures\carte com IP MPLAB\carte com IP MPLAB\TCPIP\Demo App\MainDemo.c 3761 : suspicious pointer conversion
Warning[2058] C:\cms2 luc\CMS2 23032021 - Reims jaures\carte com IP MPLAB\carte com IP MPLAB\TCPIP\Demo App\MainDemo.c 9314 : call of function without prototype
Warning[2054] C:\cms2 luc\CMS2 23032021 - Reims jaures\carte com IP MPLAB\carte com IP MPLAB\TCPIP\Demo App\MainDemo.c 9807 : suspicious pointer conversion
Warning[2054] C:\cms2 luc\CMS2 23032021 - Reims jaures\carte com IP MPLAB\carte com IP MPLAB\TCPIP\Demo App\MainDemo.c 9886 : suspicious pointer conversion
Warning[2054] C:\cms2 luc\CMS2 23032021 - Reims jaures\carte com IP MPLAB\carte com IP MPLAB\TCPIP\Demo App\MainDemo.c 9886 : suspicious pointer conversion
Warning[2054] C:\cms2 luc\CMS2 23032021 - Reims jaures\carte com IP MPLAB\carte com IP MPLAB\TCPIP\Demo App\MainDemo.c 9886 : suspicious pointer conversion
Warning[2054] C:\cms2 luc\CMS2 23032021 - Reims jaures\carte com IP MPLAB\carte com IP MPLAB\TCPIP\Demo App\MainDemo.c 9962 : suspicious pointer conversion
Warning[2054] C:\cms2 luc\CMS2 23032021 - Reims jaures\carte com IP MPLAB\carte com IP MPLAB\TCPIP\Demo App\MainDemo.c 10248 : suspicious pointer conversion
Warning[2054] C:\cms2 luc\CMS2 23032021 - Reims jaures\carte com IP MPLAB\carte com IP MPLAB\TCPIP\Demo App\MainDemo.c 10251 : suspicious pointer conversion
Warning[2054] C:\cms2 luc\CMS2 23032021 - Reims jaures\carte com IP MPLAB\carte com IP MPLAB\TCPIP\Demo App\MainDemo.c 10261 : suspicious pointer conversion
Warning[2054] C:\cms2 luc\CMS2 23032021 - Reims jaures\carte com IP MPLAB\carte com IP MPLAB\TCPIP\Demo App\MainDemo.c 10281 : suspicious pointer conversion
Warning[2054] C:\cms2 luc\CMS2 23032021 - Reims jaures\carte com IP MPLAB\carte com IP MPLAB\TCPIP\Demo App\MainDemo.c 10597 : suspicious pointer conversion
Warning[2054] C:\cms2 luc\CMS2 23032021 - Reims jaures\carte com IP MPLAB\carte com IP MPLAB\TCPIP\Demo App\MainDemo.c 11780 : suspicious pointer conversion
Warning[2054] C:\cms2 luc\CMS2 23032021 - Reims jaures\carte com IP MPLAB\carte com IP MPLAB\TCPIP\Demo App\MainDemo.c 11988 : suspicious pointer conversion
Warning[2054] C:\cms2 luc\CMS2 23032021 - Reims jaures\carte com IP MPLAB\carte com IP MPLAB\TCPIP\Demo App\MainDemo.c 12178 : suspicious pointer conversion
Warning[2054] C:\cms2 luc\CMS2 23032021 - Reims jaures\carte com IP MPLAB\carte com IP MPLAB\TCPIP\Demo App\MainDemo.c 12739 : suspicious pointer conversion
Warning[2054] C:\cms2 luc\CMS2 23032021 - Reims jaures\carte com IP MPLAB\carte com IP MPLAB\TCPIP\Demo App\MainDemo.c 13138 : suspicious pointer conversion
Warning[2054] C:\cms2 luc\CMS2 23032021 - Reims jaures\carte com IP MPLAB\carte com IP MPLAB\TCPIP\Demo App\MainDemo.c 13192 : suspicious pointer conversion
Warning[2054] C:\cms2 luc\CMS2 23032021 - Reims jaures\carte com IP MPLAB\carte com IP MPLAB\TCPIP\Demo App\MainDemo.c 13192 : suspicious pointer conversion
Warning[2054] C:\cms2 luc\CMS2 23032021 - Reims jaures\carte com IP MPLAB\carte com IP MPLAB\TCPIP\Demo App\MainDemo.c 13192 : suspicious pointer conversion
Warning[2054] C:\cms2 luc\CMS2 23032021 - Reims jaures\carte com IP MPLAB\carte com IP MPLAB\TCPIP\Demo App\MainDemo.c 13838 : suspicious pointer conversion
Warning[2054] C:\cms2 luc\CMS2 23032021 - Reims jaures\carte com IP MPLAB\carte com IP MPLAB\TCPIP\Demo App\MainDemo.c 13909 : suspicious pointer conversion
Warning[2054] C:\cms2 luc\CMS2 23032021 - Reims jaures\carte com IP MPLAB\carte com IP MPLAB\TCPIP\Demo App\MainDemo.c 14216 : suspicious pointer conversion
Warning[2054] C:\cms2 luc\CMS2 23032021 - Reims jaures\carte com IP MPLAB\carte com IP MPLAB\TCPIP\Demo App\MainDemo.c 14316 : suspicious pointer conversion
Warning[2054] C:\cms2 luc\CMS2 23032021 - Reims jaures\carte com IP MPLAB\carte com IP MPLAB\TCPIP\Demo App\MainDemo.c 14428 : suspicious pointer conversion
Warning[2054] C:\cms2 luc\CMS2 23032021 - Reims jaures\carte com IP MPLAB\carte com IP MPLAB\TCPIP\Demo App\MainDemo.c 14498 : suspicious pointer conversion
Warning[2054] C:\cms2 luc\CMS2 23032021 - Reims jaures\carte com IP MPLAB\carte com IP MPLAB\TCPIP\Demo App\MainDemo.c 14504 : suspicious pointer conversion
Warning[2054] C:\cms2 luc\CMS2 23032021 - Reims jaures\carte com IP MPLAB\carte com IP MPLAB\TCPIP\Demo App\MainDemo.c 14511 : suspicious pointer conversion
Warning[2054] C:\cms2 luc\CMS2 23032021 - Reims jaures\carte com IP MPLAB\carte com IP MPLAB\TCPIP\Demo App\MainDemo.c 14517 : suspicious pointer conversion
Warning[2054] C:\cms2 luc\CMS2 23032021 - Reims jaures\carte com IP MPLAB\carte com IP MPLAB\TCPIP\Demo App\MainDemo.c 14522 : suspicious pointer conversion
Warning[2054] C:\cms2 luc\CMS2 23032021 - Reims jaures\carte com IP MPLAB\carte com IP MPLAB\TCPIP\Demo App\MainDemo.c 14527 : suspicious pointer conversion
Warning[2054] C:\cms2 luc\CMS2 23032021 - Reims jaures\carte com IP MPLAB\carte com IP MPLAB\TCPIP\Demo App\MainDemo.c 14534 : suspicious pointer conversion
Warning[2054] C:\cms2 luc\CMS2 23032021 - Reims jaures\carte com IP MPLAB\carte com IP MPLAB\TCPIP\Demo App\MainDemo.c 14539 : suspicious pointer conversion
Warning[2054] C:\cms2 luc\CMS2 23032021 - Reims jaures\carte com IP MPLAB\carte com IP MPLAB\TCPIP\Demo App\MainDemo.c 14545 : suspicious pointer conversion
Warning[2054] C:\cms2 luc\CMS2 23032021 - Reims jaures\carte com IP MPLAB\carte com IP MPLAB\TCPIP\Demo App\MainDemo.c 14579 : suspicious pointer conversion
Warning[2054] C:\cms2 luc\CMS2 23032021 - Reims jaures\carte com IP MPLAB\carte com IP MPLAB\TCPIP\Demo App\MainDemo.c 14610 : suspicious pointer conversion
Warning[2054] C:\cms2 luc\CMS2 23032021 - Reims jaures\carte com IP MPLAB\carte com IP MPLAB\TCPIP\Demo App\MainDemo.c 14610 : suspicious pointer conversion
Warning[2054] C:\cms2 luc\CMS2 23032021 - Reims jaures\carte com IP MPLAB\carte com IP MPLAB\TCPIP\Demo App\MainDemo.c 14610 : suspicious pointer conversion
Warning[2054] C:\cms2 luc\CMS2 23032021 - Reims jaures\carte com IP MPLAB\carte com IP MPLAB\TCPIP\Demo App\MainDemo.c 14612 : suspicious pointer conversion
Warning[2054] C:\cms2 luc\CMS2 23032021 - Reims jaures\carte com IP MPLAB\carte com IP MPLAB\TCPIP\Demo App\MainDemo.c 14621 : suspicious pointer conversion
Warning[2054] C:\cms2 luc\CMS2 23032021 - Reims jaures\carte com IP MPLAB\carte com IP MPLAB\TCPIP\Demo App\MainDemo.c 14621 : suspicious pointer conversion
Warning[2054] C:\cms2 luc\CMS2 23032021 - Reims jaures\carte com IP MPLAB\carte com IP MPLAB\TCPIP\Demo App\MainDemo.c 14621 : suspicious pointer conversion
Warning[2054] C:\cms2 luc\CMS2 23032021 - Reims jaures\carte com IP MPLAB\carte com IP MPLAB\TCPIP\Demo App\MainDemo.c 14624 : suspicious pointer conversion
Warning[2054] C:\cms2 luc\CMS2 23032021 - Reims jaures\carte com IP MPLAB\carte com IP MPLAB\TCPIP\Demo App\MainDemo.c 14654 : suspicious pointer conversion
Warning[2054] C:\cms2 luc\CMS2 23032021 - Reims jaures\carte com IP MPLAB\carte com IP MPLAB\TCPIP\Demo App\MainDemo.c 14654 : suspicious pointer conversion
Warning[2054] C:\cms2 luc\CMS2 23032021 - Reims jaures\carte com IP MPLAB\carte com IP MPLAB\TCPIP\Demo App\MainDemo.c 14654 : suspicious pointer conversion
Warning[2054] C:\cms2 luc\CMS2 23032021 - Reims jaures\carte com IP MPLAB\carte com IP MPLAB\TCPIP\Demo App\MainDemo.c 14655 : suspicious pointer conversion
Warning[2054] C:\cms2 luc\CMS2 23032021 - Reims jaures\carte com IP MPLAB\carte com IP MPLAB\TCPIP\Demo App\MainDemo.c 14739 : suspicious pointer conversion
Warning[2054] C:\cms2 luc\CMS2 23032021 - Reims jaures\carte com IP MPLAB\carte com IP MPLAB\TCPIP\Demo App\MainDemo.c 14747 : suspicious pointer conversion
Warning[2054] C:\cms2 luc\CMS2 23032021 - Reims jaures\carte com IP MPLAB\carte com IP MPLAB\TCPIP\Demo App\MainDemo.c 14774 : suspicious pointer conversion
Warning[2054] C:\cms2 luc\CMS2 23032021 - Reims jaures\carte com IP MPLAB\carte com IP MPLAB\TCPIP\Demo App\MainDemo.c 14776 : suspicious pointer conversion
Warning[2054] C:\cms2 luc\CMS2 23032021 - Reims jaures\carte com IP MPLAB\carte com IP MPLAB\TCPIP\Demo App\MainDemo.c 14776 : suspicious pointer conversion
Warning[2054] C:\cms2 luc\CMS2 23032021 - Reims jaures\carte com IP MPLAB\carte com IP MPLAB\TCPIP\Demo App\MainDemo.c 14776 : suspicious pointer conversion
Warning[2054] C:\cms2 luc\CMS2 23032021 - Reims jaures\carte com IP MPLAB\carte com IP MPLAB\TCPIP\Demo App\MainDemo.c 14778 : suspicious pointer conversion
Warning[2054] C:\cms2 luc\CMS2 23032021 - Reims jaures\carte com IP MPLAB\carte com IP MPLAB\TCPIP\Demo App\MainDemo.c 14778 : suspicious pointer conversion
Warning[2054] C:\cms2 luc\CMS2 23032021 - Reims jaures\carte com IP MPLAB\carte com IP MPLAB\TCPIP\Demo App\MainDemo.c 14778 : suspicious pointer conversion
Warning[2054] C:\cms2 luc\CMS2 23032021 - Reims jaures\carte com IP MPLAB\carte com IP MPLAB\TCPIP\Demo App\MainDemo.c 14808 : suspicious pointer conversion
Warning[2054] C:\cms2 luc\CMS2 23032021 - Reims jaures\carte com IP MPLAB\carte com IP MPLAB\TCPIP\Demo App\MainDemo.c 14810 : suspicious pointer conversion
Warning[2054] C:\cms2 luc\CMS2 23032021 - Reims jaures\carte com IP MPLAB\carte com IP MPLAB\TCPIP\Demo App\MainDemo.c 14810 : suspicious pointer conversion
Warning[2054] C:\cms2 luc\CMS2 23032021 - Reims jaures\carte com IP MPLAB\carte com IP MPLAB\TCPIP\Demo App\MainDemo.c 14810 : suspicious pointer conversion
Warning[2054] C:\cms2 luc\CMS2 23032021 - Reims jaures\carte com IP MPLAB\carte com IP MPLAB\TCPIP\Demo App\MainDemo.c 15393 : suspicious pointer conversion
Warning[2054] C:\cms2 luc\CMS2 23032021 - Reims jaures\carte com IP MPLAB\carte com IP MPLAB\TCPIP\Demo App\MainDemo.c 15519 : suspicious pointer conversion
Warning[2054] C:\cms2 luc\CMS2 23032021 - Reims jaures\carte com IP MPLAB\carte com IP MPLAB\TCPIP\Demo App\MainDemo.c 15522 : suspicious pointer conversion
Warning[2054] C:\cms2 luc\CMS2 23032021 - Reims jaures\carte com IP MPLAB\carte com IP MPLAB\TCPIP\Demo App\MainDemo.c 15744 : suspicious pointer conversion
Warning[2054] C:\cms2 luc\CMS2 23032021 - Reims jaures\carte com IP MPLAB\carte com IP MPLAB\TCPIP\Demo App\MainDemo.c 15750 : suspicious pointer conversion
Warning[2054] C:\cms2 luc\CMS2 23032021 - Reims jaures\carte com IP MPLAB\carte com IP MPLAB\TCPIP\Demo App\MainDemo.c 16281 : suspicious pointer conversion
Warning[2054] C:\cms2 luc\CMS2 23032021 - Reims jaures\carte com IP MPLAB\carte com IP MPLAB\TCPIP\Demo App\MainDemo.c 16285 : suspicious pointer conversion
Warning[2054] C:\cms2 luc\CMS2 23032021 - Reims jaures\carte com IP MPLAB\carte com IP MPLAB\TCPIP\Demo App\MainDemo.c 16475 : suspicious pointer conversion
Warning[2054] C:\cms2 luc\CMS2 23032021 - Reims jaures\carte com IP MPLAB\carte com IP MPLAB\TCPIP\Demo App\MainDemo.c 16500 : suspicious pointer conversion
Warning[2054] C:\cms2 luc\CMS2 23032021 - Reims jaures\carte com IP MPLAB\carte com IP MPLAB\TCPIP\Demo App\MainDemo.c 16956 : suspicious pointer conversion
Warning[2054] C:\cms2 luc\CMS2 23032021 - Reims jaures\carte com IP MPLAB\carte com IP MPLAB\TCPIP\Demo App\MainDemo.c 17503 : suspicious pointer conversion
Warning[2054] C:\cms2 luc\CMS2 23032021 - Reims jaures\carte com IP MPLAB\carte com IP MPLAB\TCPIP\Demo App\MainDemo.c 17522 : suspicious pointer conversion
Warning[2054] C:\cms2 luc\CMS2 23032021 - Reims jaures\carte com IP MPLAB\carte com IP MPLAB\TCPIP\Demo App\MainDemo.c 18205 : suspicious pointer conversion
Warning[2054] C:\cms2 luc\CMS2 23032021 - Reims jaures\carte com IP MPLAB\carte com IP MPLAB\TCPIP\Demo App\MainDemo.c 18205 : suspicious pointer conversion
Warning[2054] C:\cms2 luc\CMS2 23032021 - Reims jaures\carte com IP MPLAB\carte com IP MPLAB\TCPIP\Demo App\MainDemo.c 18205 : suspicious pointer conversion
Warning[2054] C:\cms2 luc\CMS2 23032021 - Reims jaures\carte com IP MPLAB\carte com IP MPLAB\TCPIP\Demo App\MainDemo.c 18208 : suspicious pointer conversion
Warning[2054] C:\cms2 luc\CMS2 23032021 - Reims jaures\carte com IP MPLAB\carte com IP MPLAB\TCPIP\Demo App\MainDemo.c 18208 : suspicious pointer conversion
Warning[2054] C:\cms2 luc\CMS2 23032021 - Reims jaures\carte com IP MPLAB\carte com IP MPLAB\TCPIP\Demo App\MainDemo.c 18208 : suspicious pointer conversion
Warning[2054] C:\cms2 luc\CMS2 23032021 - Reims jaures\carte com IP MPLAB\carte com IP MPLAB\TCPIP\Demo App\MainDemo.c 18246 : suspicious pointer conversion
Warning[2054] C:\cms2 luc\CMS2 23032021 - Reims jaures\carte com IP MPLAB\carte com IP MPLAB\TCPIP\Demo App\MainDemo.c 18321 : suspicious pointer conversion
Warning[2054] C:\cms2 luc\CMS2 23032021 - Reims jaures\carte com IP MPLAB\carte com IP MPLAB\TCPIP\Demo App\MainDemo.c 18778 : suspicious pointer conversion
Warning[2054] C:\cms2 luc\CMS2 23032021 - Reims jaures\carte com IP MPLAB\carte com IP MPLAB\TCPIP\Demo App\MainDemo.c 18778 : suspicious pointer conversion
Warning[2054] C:\cms2 luc\CMS2 23032021 - Reims jaures\carte com IP MPLAB\carte com IP MPLAB\TCPIP\Demo App\MainDemo.c 18778 : suspicious pointer conversion
Warning[2054] C:\cms2 luc\CMS2 23032021 - Reims jaures\carte com IP MPLAB\carte com IP MPLAB\TCPIP\Demo App\MainDemo.c 18887 : suspicious pointer conversion
Warning[2054] C:\cms2 luc\CMS2 23032021 - Reims jaures\carte com IP MPLAB\carte com IP MPLAB\TCPIP\Demo App\MainDemo.c 18887 : suspicious pointer conversion
Warning[2054] C:\cms2 luc\CMS2 23032021 - Reims jaures\carte com IP MPLAB\carte com IP MPLAB\TCPIP\Demo App\MainDemo.c 18887 : suspicious pointer conversion
Warning[2054] C:\cms2 luc\CMS2 23032021 - Reims jaures\carte com IP MPLAB\carte com IP MPLAB\TCPIP\Demo App\MainDemo.c 18888 : suspicious pointer conversion
Warning[2054] C:\cms2 luc\CMS2 23032021 - Reims jaures\carte com IP MPLAB\carte com IP MPLAB\TCPIP\Demo App\MainDemo.c 18888 : suspicious pointer conversion
Warning[2054] C:\cms2 luc\CMS2 23032021 - Reims jaures\carte com IP MPLAB\carte com IP MPLAB\TCPIP\Demo App\MainDemo.c 18888 : suspicious pointer conversion
Warning[2054] C:\cms2 luc\CMS2 23032021 - Reims jaures\carte com IP MPLAB\carte com IP MPLAB\TCPIP\Demo App\MainDemo.c 18975 : suspicious pointer conversion
Warning[2054] C:\cms2 luc\CMS2 23032021 - Reims jaures\carte com IP MPLAB\carte com IP MPLAB\TCPIP\Demo App\MainDemo.c 18977 : suspicious pointer conversion
Warning[2054] C:\cms2 luc\CMS2 23032021 - Reims jaures\carte com IP MPLAB\carte com IP MPLAB\TCPIP\Demo App\MainDemo.c 18987 : suspicious pointer conversion
Warning[2054] C:\cms2 luc\CMS2 23032021 - Reims jaures\carte com IP MPLAB\carte com IP MPLAB\TCPIP\Demo App\MainDemo.c 19001 : suspicious pointer conversion
