Considering spec jbod:max at 0
Picking disks heuristically
Max JBOD, taking the rest of the disks
Picked 8 disks
Started with 1 specs, compiled to 8
Running /opt/smartstorageadmin/ssacli/bin/ssacli controller slot=0 create type=ld size=max stripsize=64 raid=0 drives=:0 forced
Created jbod on ssacli:0
Running /opt/smartstorageadmin/ssacli/bin/ssacli controller slot=0 create type=ld size=max stripsize=64 raid=0 drives=:1 forced
Created jbod on ssacli:0
Running /opt/smartstorageadmin/ssacli/bin/ssacli controller slot=0 create type=ld size=max stripsize=64 raid=0 drives=:2 forced
Created jbod on ssacli:0
Running /opt/smartstorageadmin/ssacli/bin/ssacli controller slot=0 create type=ld size=max stripsize=64 raid=0 drives=:3 forced
Created jbod on ssacli:0
Running /opt/smartstorageadmin/ssacli/bin/ssacli controller slot=0 create type=ld size=max stripsize=64 raid=0 drives=:4 forced
Created jbod on ssacli:0
Running /opt/smartstorageadmin/ssacli/bin/ssacli controller slot=0 create type=ld size=max stripsize=64 raid=0 drives=:5 forced
Created jbod on ssacli:0
Running /opt/smartstorageadmin/ssacli/bin/ssacli controller slot=0 create type=ld size=max stripsize=64 raid=0 drives=:6 forced
Created jbod on ssacli:0
Running /opt/smartstorageadmin/ssacli/bin/ssacli controller slot=0 create type=ld size=max stripsize=64 raid=0 drives=:7 forced
Created jbod on ssacli:0
