{
  "__type__": "cc.SpriteFrame",
  "content": {
    "name": "efx_blood4_6",
    "texture": "2f5edd67-a375-4555-bc24-9969b82d264d",
    "atlas": "aad1c392-32e5-4482-8797-b852e9b1e2fe",
    "rect": [
      1,
      261,
      116,
      106
    ],
    "offset": [
      9,
      -2
    ],
    "originalSize": [
      168,
      140
    ],
    "capInsets": [
      0,
      0,
      0,
      0
    ]
  }
}