{
  "__type__": "cc.SpriteFrame",
  "content": {
    "name": "efx_light_dot",
    "texture": "e3620e24-2776-4358-879d-55b445e9fed2",
    "atlas": "",
    "rect": [
      0,
      0,
      12,
      12
    ],
    "offset": [
      0,
      0
    ],
    "originalSize": [
      12,
      12
    ],
    "capInsets": [
      0,
      0,
      0,
      0
    ]
  }
}