{
  "__type__": "cc.SpriteFrame",
  "content": {
    "name": "death_num_bg",
    "texture": "acd34bcd-19a2-44e1-a803-b29b595b75d0",
    "atlas": "",
    "rect": [
      0,
      0,
      40,
      40
    ],
    "offset": [
      0,
      0
    ],
    "originalSize": [
      40,
      40
    ],
    "capInsets": [
      0,
      0,
      0,
      0
    ]
  }
}