{
  "__type__": "cc.SpriteFrame",
  "content": {
    "name": "home_btn_play",
    "texture": "a2d19ead-7a25-4004-8b75-4483e7606300",
    "atlas": "",
    "rect": [
      3,
      15,
      280,
      100
    ],
    "offset": [
      1,
      -4
    ],
    "originalSize": [
      284,
      122
    ],
    "capInsets": [
      0,
      0,
      0,
      0
    ]
  }
}