{
  "__type__": "cc.SpriteFrame",
  "content": {
    "name": "efx_blood3_8",
    "texture": "2f5edd67-a375-4555-bc24-9969b82d264d",
    "atlas": "aad1c392-32e5-4482-8797-b852e9b1e2fe",
    "rect": [
      129,
      175,
      108,
      82
    ],
    "offset": [
      -33,
      0
    ],
    "originalSize": [
      184,
      124
    ],
    "capInsets": [
      0,
      0,
      0,
      0
    ]
  }
}