{
  "__type__": "cc.SpriteFrame",
  "content": {
    "name": "home_c_zombie_2",
    "texture": "60ca9c88-c756-4991-88f9-d3effb23a6e6",
    "atlas": "",
    "rect": [
      0,
      0,
      94,
      134
    ],
    "offset": [
      0,
      0
    ],
    "originalSize": [
      94,
      134
    ],
    "capInsets": [
      0,
      0,
      0,
      0
    ]
  }
}