{
  "__type__": "cc.SpriteFrame",
  "content": {
    "name": "home_c_dead_2_body",
    "texture": "a1fc3151-eab7-4a61-bc9d-22579bbf83d7",
    "atlas": "",
    "rect": [
      0,
      0,
      116,
      112
    ],
    "offset": [
      0,
      0
    ],
    "originalSize": [
      116,
      112
    ],
    "capInsets": [
      0,
      0,
      0,
      0
    ]
  }
}