{
  "__type__": "cc.SpriteFrame",
  "content": {
    "name": "efx_revive_3",
    "texture": "85e43a97-6c3c-4236-8f07-19f883b450cd",
    "atlas": "",
    "rect": [
      5,
      5,
      18,
      18
    ],
    "offset": [
      0,
      0
    ],
    "originalSize": [
      28,
      28
    ],
    "capInsets": [
      0,
      0,
      0,
      0
    ]
  }
}