{
  "__type__": "cc.SpriteFrame",
  "content": {
    "name": "p1_run_d_3",
    "texture": "c00a9ebd-446a-42d0-b4db-c6ee05b356f6",
    "atlas": "37a3e48d-1032-438e-a2e4-939eaf02797c",
    "rect": [
      911,
      181,
      40,
      62
    ],
    "offset": [
      0,
      0
    ],
    "originalSize": [
      40,
      62
    ],
    "capInsets": [
      0,
      0,
      0,
      0
    ]
  }
}