{
  "__type__": "cc.SpriteFrame",
  "content": {
    "name": "unlock_heart",
    "texture": "0716ecad-d417-4066-a112-99083a27faa3",
    "atlas": "",
    "rect": [
      0,
      0,
      216,
      120
    ],
    "offset": [
      0,
      0
    ],
    "originalSize": [
      216,
      120
    ],
    "capInsets": [
      0,
      0,
      0,
      0
    ]
  }
}