[
  {
    "__type__": "cc.Prefab",
    "_name": "foe0",
    "_objFlags": 0,
    "_rawFiles": null,
    "data": {
      "__id__": 1
    },
    "optimizationPolicy": 0,
    "asyncLoadAssets": false,
    "readonly": false
  },
  {
    "__type__": "cc.Node",
    "_name": "foe",
    "_objFlags": 0,
    "_opacity": 255,
    "_color": {
      "__type__": "cc.Color",
      "r": 255,
      "g": 255,
      "b": 255,
      "a": 255
    },
    "_cascadeOpacityEnabled": true,
    "_parent": null,
    "_anchorPoint": {
      "__type__": "cc.Vec2",
      "x": 0.5,
      "y": 0.5
    },
    "_contentSize": {
      "__type__": "cc.Size",
      "width": 0,
      "height": 0
    },
    "_children": [
      {
        "__id__": 2
      },
      {
        "__id__": 6
      },
      {
        "__id__": 10
      },
      {
        "__id__": 14
      }
    ],
    "_skewX": 0,
    "_skewY": 0,
    "_localZOrder": 0,
    "_globalZOrder": 0,
    "_tag": -1,
    "_opacityModifyRGB": false,
    "_reorderChildDirty": false,
    "_id": "",
    "_active": true,
    "_components": [
      {
        "__id__": 17
      },
      {
        "__id__": 18
      }
    ],
    "_prefab": {
      "__id__": 19
    },
    "groupIndex": 0,
    "_trs": {
      "__type__": "TypedArray",
      "ctor": "Float64Array",
      "array": [
        335,
        385,
        0,
        0,
        0,
        0,
        0,
        1,
        1,
        1
      ]
    }
  },
  {
    "__type__": "cc.Node",
    "_name": "fxBlood",
    "_objFlags": 0,
    "_opacity": 255,
    "_color": {
      "__type__": "cc.Color",
      "r": 255,
      "g": 255,
      "b": 255,
      "a": 255
    },
    "_cascadeOpacityEnabled": true,
    "_parent": {
      "__id__": 1
    },
    "_anchorPoint": {
      "__type__": "cc.Vec2",
      "x": 0.15,
      "y": 0.5
    },
    "_contentSize": {
      "__type__": "cc.Size",
      "width": 136,
      "height": 132
    },
    "_children": [],
    "_skewX": 0,
    "_skewY": 0,
    "_localZOrder": 0,
    "_globalZOrder": 0,
    "_tag": -1,
    "_opacityModifyRGB": false,
    "_reorderChildDirty": false,
    "_id": "",
    "_active": false,
    "_components": [
      {
        "__id__": 3
      },
      {
        "__id__": 4
      }
    ],
    "_prefab": {
      "__id__": 5
    },
    "groupIndex": 0,
    "_trs": {
      "__type__": "TypedArray",
      "ctor": "Float64Array",
      "array": [
        0,
        4.699999809265137,
        0,
        0,
        0,
        0,
        0,
        1,
        1,
        1
      ]
    }
  },
  {
    "__type__": "cc.Sprite",
    "_name": "",
    "_objFlags": 0,
    "node": {
      "__id__": 2
    },
    "_enabled": true,
    "_spriteFrame": {
      "__uuid__": "c06be84a-394b-43cc-a927-652b404a987b"
    },
    "_type": 0,
    "_sizeMode": 2,
    "_fillType": 0,
    "_fillCenter": {
      "__type__": "cc.Vec2",
      "x": 0,
      "y": 0
    },
    "_fillStart": 0,
    "_fillRange": 0,
    "_isTrimmedMode": false,
    "_srcBlendFactor": 770,
    "_dstBlendFactor": 771,
    "_atlas": {
      "__uuid__": "aad1c392-32e5-4482-8797-b852e9b1e2fe"
    }
  },
  {
    "__type__": "cc.Animation",
    "_name": "",
    "_objFlags": 0,
    "node": {
      "__id__": 2
    },
    "_enabled": true,
    "_defaultClip": null,
    "_clips": [
      {
        "__uuid__": "eb80fd56-6bb5-4d02-b69e-4c12f13c2f5b"
      }
    ],
    "playOnLoad": false
  },
  {
    "__type__": "cc.PrefabInfo",
    "root": {
      "__id__": 1
    },
    "asset": {
      "__uuid__": "9668b306-990a-421b-855f-45f126a8f3cc"
    },
    "fileId": "480614bq+BLw4mgLfZRF1lX"
  },
  {
    "__type__": "cc.Node",
    "_name": "sprite",
    "_objFlags": 0,
    "_opacity": 255,
    "_color": {
      "__type__": "cc.Color",
      "r": 255,
      "g": 255,
      "b": 255,
      "a": 255
    },
    "_cascadeOpacityEnabled": true,
    "_parent": {
      "__id__": 1
    },
    "_anchorPoint": {
      "__type__": "cc.Vec2",
      "x": 0.5,
      "y": 0.1
    },
    "_contentSize": {
      "__type__": "cc.Size",
      "width": 28,
      "height": 64
    },
    "_children": [],
    "_skewX": 0,
    "_skewY": 0,
    "_localZOrder": 0,
    "_globalZOrder": 0,
    "_tag": -1,
    "_opacityModifyRGB": false,
    "_reorderChildDirty": false,
    "_id": "",
    "_active": true,
    "_components": [
      {
        "__id__": 7
      },
      {
        "__id__": 8
      }
    ],
    "_prefab": {
      "__id__": 9
    },
    "groupIndex": 0,
    "_trs": {
      "__type__": "TypedArray",
      "ctor": "Float64Array",
      "array": [
        0,
        -30,
        0,
        0,
        0,
        0,
        0,
        1,
        1,
        1
      ]
    }
  },
  {
    "__type__": "cc.Sprite",
    "_name": "",
    "_objFlags": 0,
    "node": {
      "__id__": 6
    },
    "_enabled": true,
    "_spriteFrame": {
      "__uuid__": "3b603a20-5cd0-43ec-846c-67ad2d034aed"
    },
    "_type": 0,
    "_sizeMode": 2,
    "_fillType": 0,
    "_fillCenter": {
      "__type__": "cc.Vec2",
      "x": 0,
      "y": 0
    },
    "_fillStart": 0,
    "_fillRange": 0,
    "_isTrimmedMode": false,
    "_srcBlendFactor": 770,
    "_dstBlendFactor": 771,
    "_atlas": {
      "__uuid__": "555561a7-a7e9-4786-a1f5-4e4fd6d2a18c"
    }
  },
  {
    "__type__": "cc.Animation",
    "_name": "",
    "_objFlags": 0,
    "node": {
      "__id__": 6
    },
    "_enabled": true,
    "_defaultClip": null,
    "_clips": [
      {
        "__uuid__": "2b429426-6f66-422d-a427-00d051eef396"
      },
      {
        "__uuid__": "20e3e54f-222d-4daf-ae69-2ae847d30d99"
      },
      {
        "__uuid__": "4a93ce82-d11d-4a05-9299-55fdfa85297e"
      },
      {
        "__uuid__": "efa5c6e2-494b-4a65-800a-428e22eab654"
      },
      {
        "__uuid__": "63a36a58-98ba-4f77-9c5e-6120f2c1cb39"
      },
      {
        "__uuid__": "3980904f-2668-4307-bef3-304c0b77ef69"
      },
      {
        "__uuid__": "069cba4f-3815-45c3-887b-9a0048185590"
      },
      {
        "__uuid__": "e9e7fe7a-ab8f-4b27-a32b-536595eb3b03"
      },
      {
        "__uuid__": "143b90fb-8b51-4728-9e4e-9a550fd2d07e"
      }
    ],
    "playOnLoad": false
  },
  {
    "__type__": "cc.PrefabInfo",
    "root": {
      "__id__": 1
    },
    "asset": {
      "__uuid__": "9668b306-990a-421b-855f-45f126a8f3cc"
    },
    "fileId": "f804f8x61VGGYpGEy40tjCm"
  },
  {
    "__type__": "cc.Node",
    "_name": "blade",
    "_objFlags": 0,
    "_opacity": 255,
    "_color": {
      "__type__": "cc.Color",
      "r": 255,
      "g": 255,
      "b": 255,
      "a": 255
    },
    "_cascadeOpacityEnabled": true,
    "_parent": {
      "__id__": 1
    },
    "_anchorPoint": {
      "__type__": "cc.Vec2",
      "x": 0.5,
      "y": 0.5
    },
    "_contentSize": {
      "__type__": "cc.Size",
      "width": 243,
      "height": 11
    },
    "_children": [],
    "_skewX": 0,
    "_skewY": 0,
    "_localZOrder": 0,
    "_globalZOrder": 0,
    "_tag": -1,
    "_opacityModifyRGB": false,
    "_reorderChildDirty": false,
    "_id": "",
    "_active": true,
    "_components": [
      {
        "__id__": 11
      },
      {
        "__id__": 12
      }
    ],
    "_prefab": {
      "__id__": 13
    },
    "groupIndex": 0,
    "_trs": {
      "__type__": "TypedArray",
      "ctor": "Float64Array",
      "array": [
        0,
        0,
        0,
        0,
        0,
        0,
        0,
        1,
        1,
        1
      ]
    }
  },
  {
    "__type__": "cc.Sprite",
    "_name": "",
    "_objFlags": 0,
    "node": {
      "__id__": 10
    },
    "_enabled": true,
    "_spriteFrame": {
      "__uuid__": "8b2a7c82-8824-44af-aa60-b2684c5b9161"
    },
    "_type": 0,
    "_sizeMode": 1,
    "_fillType": 0,
    "_fillCenter": {
      "__type__": "cc.Vec2",
      "x": 0,
      "y": 0
    },
    "_fillStart": 0,
    "_fillRange": 0,
    "_isTrimmedMode": true,
    "_srcBlendFactor": 770,
    "_dstBlendFactor": 771,
    "_atlas": null
  },
  {
    "__type__": "cc.Animation",
    "_name": "",
    "_objFlags": 0,
    "node": {
      "__id__": 10
    },
    "_enabled": true,
    "_defaultClip": null,
    "_clips": [
      {
        "__uuid__": "a2b85759-42e9-4059-97d9-6ef0a007b447"
      }
    ],
    "playOnLoad": false
  },
  {
    "__type__": "cc.PrefabInfo",
    "root": {
      "__id__": 1
    },
    "asset": {
      "__uuid__": "9668b306-990a-421b-855f-45f126a8f3cc"
    },
    "fileId": "4a53daYQhRK3JmIyzI1ePXn"
  },
  {
    "__type__": "cc.Node",
    "_name": "fxSmoke",
    "_objFlags": 0,
    "_opacity": 255,
    "_color": {
      "__type__": "cc.Color",
      "r": 255,
      "g": 255,
      "b": 255,
      "a": 255
    },
    "_cascadeOpacityEnabled": true,
    "_parent": {
      "__id__": 1
    },
    "_anchorPoint": {
      "__type__": "cc.Vec2",
      "x": 0.5,
      "y": 0.5
    },
    "_contentSize": {
      "__type__": "cc.Size",
      "width": 0,
      "height": 0
    },
    "_children": [],
    "_skewX": 0,
    "_skewY": 0,
    "_localZOrder": 0,
    "_globalZOrder": 0,
    "_tag": -1,
    "_opacityModifyRGB": false,
    "_reorderChildDirty": false,
    "_id": "",
    "_active": true,
    "_components": [
      {
        "__id__": 15
      }
    ],
    "_prefab": {
      "__id__": 16
    },
    "groupIndex": 0,
    "_trs": {
      "__type__": "TypedArray",
      "ctor": "Float64Array",
      "array": [
        0,
        0,
        0,
        0,
        0,
        0,
        0,
        1,
        1,
        1
      ]
    }
  },
  {
    "__type__": "cc.ParticleSystem",
    "_name": "",
    "_objFlags": 0,
    "node": {
      "__id__": 14
    },
    "_enabled": true,
    "_custom": false,
    "_file": {
      "__uuid__": "f3ffd92b-aa1f-4ed9-aac3-9718afa95047"
    },
    "_texture": {
      "__uuid__": "f00e5de9-f943-42c7-8ef9-2f5695613419"
    },
    "_srcBlendFactor": 770,
    "_dstBlendFactor": 771,
    "playOnLoad": false,
    "_autoRemoveOnFinish": false,
    "totalParticles": 15,
    "duration": 0.1,
    "emissionRate": 500,
    "life": 0,
    "lifeVar": 0.8,
    "_startColor": {
      "__type__": "cc.Color",
      "r": 105,
      "g": 103,
      "b": 103,
      "a": 73
    },
    "_startColorVar": {
      "__type__": "cc.Color",
      "r": 0,
      "g": 0,
      "b": 0,
      "a": 28
    },
    "_endColor": {
      "__type__": "cc.Color",
      "r": 53,
      "g": 53,
      "b": 53,
      "a": 0
    },
    "_endColorVar": {
      "__type__": "cc.Color",
      "r": 0,
      "g": 0,
      "b": 0,
      "a": 0
    },
    "angle": 0,
    "angleVar": 360,
    "startSize": 30,
    "startSizeVar": 0,
    "endSize": 50,
    "endSizeVar": 10,
    "startSpin": 0,
    "startSpinVar": 90,
    "endSpin": 0,
    "endSpinVar": 90,
    "sourcePos": {
      "__type__": "cc.Vec2",
      "x": 0,
      "y": 0
    },
    "posVar": {
      "__type__": "cc.Vec2",
      "x": 25,
      "y": 30
    },
    "_positionType": 0,
    "_emitterMode": 0,
    "gravity": {
      "__type__": "cc.Vec2",
      "x": 0,
      "y": 0
    },
    "speed": 60,
    "speedVar": 20,
    "tangentialAccel": 0,
    "tangentialAccelVar": 0,
    "radialAccel": 0,
    "radialAccelVar": 0,
    "rotationIsDir": false,
    "startRadius": 0,
    "startRadiusVar": 0,
    "endRadius": 0,
    "endRadiusVar": 0,
    "rotatePerS": 0,
    "rotatePerSVar": 0,
    "_N$preview": true
  },
  {
    "__type__": "cc.PrefabInfo",
    "root": {
      "__id__": 1
    },
    "asset": {
      "__uuid__": "9668b306-990a-421b-855f-45f126a8f3cc"
    },
    "fileId": "8fde7ha0Q5GHqpXvEUNnY8j"
  },
  {
    "__type__": "d887bx46FZAa4lxVyJ37BSp",
    "_name": "",
    "_objFlags": 0,
    "node": {
      "__id__": 1
    },
    "_enabled": true,
    "foeType": 0,
    "atkType": 0,
    "projectileType": 0,
    "hitPoint": 1,
    "hurtRadius": 45,
    "atkRange": 150,
    "atkDist": 200,
    "atkDuration": 0.3,
    "atkStun": 0.5,
    "atkPrepTime": 1,
    "corpseDuration": 3,
    "sfAtkDirs": [
      {
        "__uuid__": "882df9af-ae64-4eb6-8d45-2d0c20db75bb"
      },
      {
        "__uuid__": "94cc035d-003c-430d-a70f-41851863980b"
      },
      {
        "__uuid__": "e3d3b8ed-3216-4da6-89b2-5c2b36224df7"
      }
    ],
    "fxSmoke": {
      "__id__": 15
    },
    "fxBlood": {
      "__id__": 4
    },
    "fxBlade": {
      "__id__": 12
    }
  },
  {
    "__type__": "03fecYvs+9L07SPviQLuLj3",
    "_name": "",
    "_objFlags": 0,
    "node": {
      "__id__": 1
    },
    "_enabled": true,
    "moveSpeed": 100,
    "anim": {
      "__id__": 8
    }
  },
  {
    "__type__": "cc.PrefabInfo",
    "root": {
      "__id__": 1
    },
    "asset": {
      "__uuid__": "9668b306-990a-421b-855f-45f126a8f3cc"
    },
    "fileId": "f592asvzUdK37RUGu1w5Gbq"
  }
]