{
  "__type__": "cc.SpriteFrame",
  "content": {
    "name": "loading_logo_2",
    "texture": "f82f8220-188b-4fb7-a7a7-a36b351ca404",
    "atlas": "",
    "rect": [
      0,
      0,
      99,
      86
    ],
    "offset": [
      0,
      0
    ],
    "originalSize": [
      99,
      86
    ],
    "capInsets": [
      0,
      0,
      0,
      0
    ]
  }
}