{
  "__type__": "cc.SpriteFrame",
  "content": {
    "name": "death_btn_save",
    "texture": "673dc161-c222-4dd6-b584-9a72581d2e95",
    "atlas": "",
    "rect": [
      5,
      14,
      311,
      99
    ],
    "offset": [
      0.5,
      -2.5
    ],
    "originalSize": [
      320,
      122
    ],
    "capInsets": [
      0,
      0,
      0,
      0
    ]
  }
}