{
  "__type__": "cc.SpriteFrame",
  "content": {
    "name": "efx_p1bl_4",
    "texture": "b939ff84-5d15-42f7-b533-523a4a1135bf",
    "atlas": "20b9a49e-1c53-4d46-aa3e-db07dc9c6d55",
    "rect": [
      1,
      711,
      274,
      180
    ],
    "offset": [
      4,
      8
    ],
    "originalSize": [
      288,
      224
    ],
    "rotated": 1,
    "capInsets": [
      0,
      0,
      0,
      0
    ]
  }
}