{
  "__type__": "cc.SpriteFrame",
  "content": {
    "name": "foe6_fb3",
    "texture": "5564ff88-cc6d-42be-8501-0cf23d937f7d",
    "atlas": "555561a7-a7e9-4786-a1f5-4e4fd6d2a18c",
    "rect": [
      303,
      425,
      20,
      40
    ],
    "offset": [
      -1,
      3
    ],
    "originalSize": [
      24,
      52
    ],
    "rotated": 1,
    "capInsets": [
      0,
      0,
      0,
      0
    ]
  }
}