{
  "__type__": "cc.SpriteFrame",
  "content": {
    "name": "item_zombie_g",
    "texture": "3836429a-3646-4464-bc4a-283cb78eb4e4",
    "atlas": "bcb429e9-2a34-4488-ae6b-9d974bf3ea38",
    "rect": [
      871,
      347,
      82,
      82
    ],
    "offset": [
      1,
      -3
    ],
    "originalSize": [
      96,
      100
    ],
    "capInsets": [
      0,
      0,
      0,
      0
    ]
  }
}