{
  "__type__": "cc.SpriteFrame",
  "content": {
    "name": "ba_outer_right",
    "texture": "1c618aed-26ca-4b02-9d80-54c42d68e554",
    "atlas": "",
    "rect": [
      0,
      0,
      6,
      768
    ],
    "offset": [
      0,
      0
    ],
    "originalSize": [
      6,
      768
    ],
    "capInsets": [
      0,
      0,
      0,
      0
    ]
  }
}