{
  "__type__": "cc.SpriteFrame",
  "content": {
    "name": "player_swordkee_fz",
    "texture": "eac14401-67a7-4b4c-a206-b31ae1360680",
    "atlas": "",
    "rect": [
      0,
      0,
      17,
      320
    ],
    "offset": [
      0,
      0
    ],
    "originalSize": [
      17,
      320
    ],
    "capInsets": [
      0,
      0,
      0,
      0
    ]
  }
}