{
  "__type__": "cc.SpriteFrame",
  "content": {
    "name": "ba_combo_bg",
    "texture": "cd15fcb6-7dc4-4191-91f3-e5cd4fe58c3e",
    "atlas": "",
    "rect": [
      0,
      1,
      158,
      95
    ],
    "offset": [
      -0.5,
      -0.5
    ],
    "originalSize": [
      159,
      96
    ],
    "capInsets": [
      0,
      0,
      0,
      0
    ]
  }
}