{
  "__type__": "cc.SpriteFrame",
  "content": {
    "name": "efx_fog",
    "texture": "f00e5de9-f943-42c7-8ef9-2f5695613419",
    "atlas": "",
    "rect": [
      0,
      0,
      40,
      40
    ],
    "offset": [
      0,
      0
    ],
    "originalSize": [
      40,
      40
    ],
    "capInsets": [
      0,
      0,
      0,
      0
    ]
  }
}