{
  "__type__": "cc.SpriteFrame",
  "content": {
    "name": "img_soul_8",
    "texture": "3836429a-3646-4464-bc4a-283cb78eb4e4",
    "atlas": "bcb429e9-2a34-4488-ae6b-9d974bf3ea38",
    "rect": [
      871,
      221,
      14,
      22
    ],
    "offset": [
      -1,
      1
    ],
    "originalSize": [
      20,
      24
    ],
    "rotated": 1,
    "capInsets": [
      0,
      0,
      0,
      0
    ]
  }
}