{
  "__type__": "cc.SpriteFrame",
  "content": {
    "name": "home_c_zombie_1",
    "texture": "5397ee4d-b0fb-47d2-8c90-3243669770c5",
    "atlas": "",
    "rect": [
      0,
      0,
      62,
      122
    ],
    "offset": [
      0,
      0
    ],
    "originalSize": [
      62,
      122
    ],
    "capInsets": [
      0,
      0,
      0,
      0
    ]
  }
}