{
  "__type__": "cc.SpriteFrame",
  "content": {
    "name": "item_zombie",
    "texture": "3836429a-3646-4464-bc4a-283cb78eb4e4",
    "atlas": "bcb429e9-2a34-4488-ae6b-9d974bf3ea38",
    "rect": [
      955,
      263,
      34,
      36
    ],
    "offset": [
      0,
      1
    ],
    "originalSize": [
      42,
      42
    ],
    "capInsets": [
      0,
      0,
      0,
      0
    ]
  }
}