{
  "__type__": "cc.SpriteFrame",
  "content": {
    "name": "efx_revive_l2",
    "texture": "b939ff84-5d15-42f7-b533-523a4a1135bf",
    "atlas": "20b9a49e-1c53-4d46-aa3e-db07dc9c6d55",
    "rect": [
      183,
      711,
      4,
      254
    ],
    "offset": [
      -1,
      4
    ],
    "originalSize": [
      20,
      264
    ],
    "capInsets": [
      0,
      0,
      0,
      0
    ]
  }
}