{
  "__type__": "cc.AnimationClip",
  "_name": "run_down",
  "_objFlags": 0,
  "_rawFiles": null,
  "_duration": 0.5,
  "sample": 10,
  "speed": 1,
  "wrapMode": 2,
  "curveData": {
    "comps": {
      "cc.Sprite": {
        "spriteFrame": [
          {
            "frame": 0,
            "value": {
              "__uuid__": "f35a2a53-cf76-475c-b55e-a359c2b6642f"
            }
          },
          {
            "frame": 0.1,
            "value": {
              "__uuid__": "b64aa1cd-be6b-476e-933b-349e9227aa50"
            }
          },
          {
            "frame": 0.2,
            "value": {
              "__uuid__": "357c9250-0fd8-4da0-b754-000a70f44678"
            }
          },
          {
            "frame": 0.3,
            "value": {
              "__uuid__": "7171d4d4-3ca1-4e8c-9a21-510a1ec35fbb"
            }
          },
          {
            "frame": 0.4,
            "value": {
              "__uuid__": "3b603a20-5cd0-43ec-846c-67ad2d034aed"
            }
          }
        ]
      }
    }
  },
  "events": []
}