{
  "__type__": "cc.SpriteFrame",
  "content": {
    "name": "efx_revive_l2",
    "texture": "375032fe-47a7-41ba-8d8e-47ea02900c29",
    "atlas": "",
    "rect": [
      8,
      3,
      2,
      251
    ],
    "offset": [
      -1,
      3.5
    ],
    "originalSize": [
      20,
      264
    ],
    "capInsets": [
      0,
      0,
      0,
      0
    ]
  }
}