{
  "__type__": "cc.SpriteFrame",
  "content": {
    "name": "p1_run_r_2",
    "texture": "c00a9ebd-446a-42d0-b4db-c6ee05b356f6",
    "atlas": "37a3e48d-1032-438e-a2e4-939eaf02797c",
    "rect": [
      613,
      131,
      74,
      60
    ],
    "offset": [
      -10,
      -3
    ],
    "originalSize": [
      120,
      80
    ],
    "rotated": 1,
    "capInsets": [
      0,
      0,
      0,
      0
    ]
  }
}