
E14.png
size: 1024,1024
format: RGBA8888
filter: Linear,Linear
repeat: none
1
  rotate: false
  xy: 363, 772
  size: 267, 244
  orig: 267, 244
  offset: 0, 0
  index: -1
10
  rotate: false
  xy: 714, 342
  size: 67, 45
  orig: 67, 45
  offset: 0, 0
  index: -1
11
  rotate: false
  xy: 925, 660
  size: 73, 43
  orig: 73, 43
  offset: 0, 0
  index: -1
12
  rotate: false
  xy: 191, 271
  size: 25, 29
  orig: 25, 29
  offset: 0, 0
  index: -1
13
  rotate: false
  xy: 714, 389
  size: 106, 52
  orig: 106, 52
  offset: 0, 0
  index: -1
15
  rotate: true
  xy: 2, 2
  size: 34, 47
  orig: 34, 47
  offset: 0, 0
  index: -1
16
  rotate: false
  xy: 191, 57
  size: 34, 20
  orig: 34, 20
  offset: 0, 0
  index: -1
17
  rotate: true
  xy: 221, 406
  size: 312, 157
  orig: 312, 157
  offset: 0, 0
  index: -1
17_1
  rotate: false
  xy: 380, 543
  size: 214, 227
  orig: 214, 227
  offset: 0, 0
  index: -1
17_2
  rotate: false
  xy: 632, 763
  size: 253, 253
  orig: 253, 253
  offset: 0, 0
  index: -1
18
  rotate: true
  xy: 2, 302
  size: 416, 217
  orig: 416, 217
  offset: 0, 0
  index: -1
2
  rotate: false
  xy: 925, 605
  size: 56, 53
  orig: 56, 53
  offset: 0, 0
  index: -1
22
  rotate: false
  xy: 887, 829
  size: 98, 187
  orig: 98, 187
  offset: 0, 0
  index: -1
23
  rotate: false
  xy: 778, 603
  size: 145, 158
  orig: 145, 158
  offset: 0, 0
  index: -1
24
  rotate: false
  xy: 925, 705
  size: 97, 122
  orig: 97, 122
  offset: 0, 0
  index: -1
25
  rotate: true
  xy: 2, 38
  size: 262, 187
  orig: 262, 187
  offset: 0, 0
  index: -1
29
  rotate: false
  xy: 1000, 680
  size: 22, 23
  orig: 22, 23
  offset: 0, 0
  index: -1
3
  rotate: false
  xy: 2, 720
  size: 359, 296
  orig: 359, 296
  offset: 0, 0
  index: -1
30
  rotate: true
  xy: 983, 620
  size: 38, 39
  orig: 38, 39
  offset: 0, 0
  index: -1
31
  rotate: false
  xy: 822, 389
  size: 51, 52
  orig: 51, 52
  offset: 0, 0
  index: -1
32
  rotate: false
  xy: 221, 239
  size: 152, 165
  orig: 152, 165
  offset: 0, 0
  index: -1
Flash00005
  rotate: false
  xy: 562, 292
  size: 150, 149
  orig: 150, 149
  offset: 0, 0
  index: -1
fx/5 (1)
  rotate: false
  xy: 380, 383
  size: 180, 158
  orig: 180, 158
  offset: 0, 0
  index: -1
fx/5 (2)
  rotate: false
  xy: 596, 603
  size: 180, 158
  orig: 180, 158
  offset: 0, 0
  index: -1
fx/5 (3)
  rotate: false
  xy: 375, 223
  size: 180, 158
  orig: 180, 158
  offset: 0, 0
  index: -1
fx/5 (4)
  rotate: false
  xy: 191, 79
  size: 180, 158
  orig: 180, 158
  offset: 0, 0
  index: -1
fx/5 (5)
  rotate: false
  xy: 373, 63
  size: 180, 158
  orig: 180, 158
  offset: 0, 0
  index: -1
fx/5 (6)
  rotate: false
  xy: 596, 443
  size: 180, 158
  orig: 180, 158
  offset: 0, 0
  index: -1
fx/5 (7)
  rotate: false
  xy: 778, 443
  size: 180, 158
  orig: 180, 158
  offset: 0, 0
  index: -1
