%YAML 1.1
%TAG !u! tag:unity3d.com,2011:
--- !u!114 &11400000
MonoBehaviour:
  m_ObjectHideFlags: 0
  m_CorrespondingSourceObject: {fileID: 0}
  m_PrefabInstance: {fileID: 0}
  m_PrefabAsset: {fileID: 0}
  m_GameObject: {fileID: 0}
  m_Enabled: 1
  m_EditorHideFlags: 0
  m_Script: {fileID: 11500000, guid: a6b194f808b1af6499c93410e504af42, type: 3}
  m_Name: Up_Ship_2_Atlas
  m_EditorClassIdentifier: 
  atlasFile: {fileID: 4900000, guid: 0864483ea01d72d4991cc763d0ab1f1b, type: 3}
  materials:
  - {fileID: 2100000, guid: 7b5c9686465217b45b4d2f9a2c8e7958, type: 2}
