
E21.png
size: 1024,512
format: RGBA8888
filter: Linear,Linear
repeat: none
0
  rotate: false
  xy: 2, 263
  size: 505, 232
  orig: 505, 232
  offset: 0, 0
  index: -1
00
  rotate: false
  xy: 435, 17
  size: 155, 102
  orig: 155, 102
  offset: 0, 0
  index: -1
1
  rotate: false
  xy: 2, 33
  size: 256, 228
  orig: 256, 228
  offset: 0, 0
  index: -1
10
  rotate: false
  xy: 653, 219
  size: 51, 78
  orig: 51, 78
  offset: 0, 0
  index: -1
11
  rotate: true
  xy: 648, 155
  size: 62, 58
  orig: 62, 58
  offset: 0, 0
  index: -1
12
  rotate: false
  xy: 260, 15
  size: 173, 96
  orig: 173, 96
  offset: 0, 0
  index: -1
14
  rotate: false
  xy: 808, 355
  size: 11, 11
  orig: 11, 11
  offset: 0, 0
  index: -1
18
  rotate: false
  xy: 628, 124
  size: 15, 15
  orig: 15, 15
  offset: 0, 0
  index: -1
22
  rotate: true
  xy: 592, 83
  size: 36, 31
  orig: 36, 31
  offset: 0, 0
  index: -1
26
  rotate: false
  xy: 554, 286
  size: 11, 11
  orig: 11, 11
  offset: 0, 0
  index: -1
3
  rotate: true
  xy: 2, 19
  size: 12, 62
  orig: 12, 62
  offset: 0, 0
  index: -1
30
  rotate: false
  xy: 2, 2
  size: 15, 15
  orig: 15, 15
  offset: 0, 0
  index: -1
34
  rotate: true
  xy: 592, 45
  size: 36, 31
  orig: 36, 31
  offset: 0, 0
  index: -1
37
  rotate: false
  xy: 570, 121
  size: 56, 18
  orig: 56, 18
  offset: 0, 0
  index: -1
38
  rotate: false
  xy: 823, 331
  size: 199, 164
  orig: 199, 164
  offset: 0, 0
  index: -1
4
  rotate: false
  xy: 570, 141
  size: 76, 76
  orig: 76, 76
  offset: 0, 0
  index: -1
40
  rotate: false
  xy: 509, 263
  size: 43, 34
  orig: 43, 34
  offset: 0, 0
  index: -1
6
  rotate: false
  xy: 260, 113
  size: 166, 148
  orig: 166, 148
  offset: 0, 0
  index: -1
7
  rotate: false
  xy: 509, 299
  size: 206, 67
  orig: 206, 67
  offset: 0, 0
  index: -1
Layer 4
  rotate: true
  xy: 717, 306
  size: 60, 89
  orig: 60, 89
  offset: 0, 0
  index: -1
glow1 do
  rotate: false
  xy: 509, 368
  size: 312, 127
  orig: 312, 127
  offset: 0, 0
  index: -1
light
  rotate: false
  xy: 570, 219
  size: 81, 78
  orig: 81, 78
  offset: 0, 0
  index: -1
light1
  rotate: false
  xy: 428, 121
  size: 140, 140
  orig: 140, 140
  offset: 0, 0
  index: -1
