%YAML 1.1
%TAG !u! tag:unity3d.com,2011:
--- !u!114 &11400000
MonoBehaviour:
  m_ObjectHideFlags: 0
  m_CorrespondingSourceObject: {fileID: 0}
  m_PrefabInstance: {fileID: 0}
  m_PrefabAsset: {fileID: 0}
  m_GameObject: {fileID: 0}
  m_Enabled: 1
  m_EditorHideFlags: 0
  m_Script: {fileID: 11500000, guid: 6d5ef227f55af584aa3a1b29b76e7e81, type: 3}
  m_Name: DailyRewardData
  m_EditorClassIdentifier: 
  Items:
  - Icon: {fileID: 21300000, guid: 118d68ac7040afe4aa000d1cae52726b, type: 3}
    CategoryIcon: {fileID: 0}
    Quantity: 1000
    RewardType: 0
    ExtendId: 0
    IsSpecial: 0
  - Icon: {fileID: 21300000, guid: be5ede9787e87524a8e944f4f80197ce, type: 3}
    CategoryIcon: {fileID: 0}
    Quantity: 5
    RewardType: 6
    ExtendId: 0
    IsSpecial: 0
  - Icon: {fileID: 21300000, guid: 876b82cc93643ac4e8121f5c5bd0d082, type: 3}
    CategoryIcon: {fileID: 0}
    Quantity: 5
    RewardType: 1
    ExtendId: 0
    IsSpecial: 0
  - Icon: {fileID: 21300000, guid: 497691bc17e5c6940883d35daab87ff4, type: 3}
    CategoryIcon: {fileID: 0}
    Quantity: 1500
    RewardType: 0
    ExtendId: 0
    IsSpecial: 0
  - Icon: {fileID: 21300000, guid: 750e03842a0af634a8c1b244777baccd, type: 3}
    CategoryIcon: {fileID: 0}
    Quantity: 1
    RewardType: 5
    ExtendId: 0
    IsSpecial: 0
  - Icon: {fileID: 21300000, guid: bf30fc965b1326045a72e7ca04d0e707, type: 3}
    CategoryIcon: {fileID: 0}
    Quantity: 5
    RewardType: 7
    ExtendId: 0
    IsSpecial: 0
  - Icon: {fileID: 21300000, guid: 76e15aee5e0d4d04182cd382d4f943ba, type: 3}
    CategoryIcon: {fileID: 0}
    Quantity: 2
    RewardType: 3
    ExtendId: 0
    IsSpecial: 0
  - Icon: {fileID: 21300000, guid: 2492063f13d70564c91ebbdeca248a10, type: 3}
    CategoryIcon: {fileID: 0}
    Quantity: 2000
    RewardType: 0
    ExtendId: 0
    IsSpecial: 0
  - Icon: {fileID: 21300000, guid: a3f370f51a535bf489ea20dc2b2745eb, type: 3}
    CategoryIcon: {fileID: 0}
    Quantity: 5
    RewardType: 6
    ExtendId: 1
    IsSpecial: 0
  - Icon: {fileID: 21300000, guid: 41077266f23f09541a6127ce4bea6527, type: 3}
    CategoryIcon: {fileID: 0}
    Quantity: 10
    RewardType: 1
    ExtendId: 0
    IsSpecial: 0
  - Icon: {fileID: 21300000, guid: a903b7f9de421124892d73ae71109b5e, type: 3}
    CategoryIcon: {fileID: 0}
    Quantity: 3000
    RewardType: 0
    ExtendId: 0
    IsSpecial: 0
  - Icon: {fileID: 21300000, guid: 750e03842a0af634a8c1b244777baccd, type: 3}
    CategoryIcon: {fileID: 0}
    Quantity: 1
    RewardType: 5
    ExtendId: 0
    IsSpecial: 0
  - Icon: {fileID: 21300000, guid: bf30fc965b1326045a72e7ca04d0e707, type: 3}
    CategoryIcon: {fileID: 0}
    Quantity: 3
    RewardType: 7
    ExtendId: 1
    IsSpecial: 0
  - Icon: {fileID: 21300000, guid: b3f29fd74e914bf4bacda265a58aff33, type: 3}
    CategoryIcon: {fileID: 0}
    Quantity: 1
    RewardType: 3
    ExtendId: 1
    IsSpecial: 0
  - Icon: {fileID: 21300000, guid: de6b925d70e0b2f48aedccf0d3670925, type: 3}
    CategoryIcon: {fileID: 0}
    Quantity: 4000
    RewardType: 0
    ExtendId: 0
    IsSpecial: 0
  - Icon: {fileID: 21300000, guid: ad2be8b2143b0934a9b1b6679bf858a5, type: 3}
    CategoryIcon: {fileID: 0}
    Quantity: 5
    RewardType: 6
    ExtendId: 2
    IsSpecial: 0
  - Icon: {fileID: 21300000, guid: 0a188b31d8847964c859530d2c84a996, type: 3}
    CategoryIcon: {fileID: 0}
    Quantity: 15
    RewardType: 1
    ExtendId: 0
    IsSpecial: 0
  - Icon: {fileID: 21300000, guid: 44b923675c987d34ebf9f9955b8c3f8d, type: 3}
    CategoryIcon: {fileID: 0}
    Quantity: 6000
    RewardType: 0
    ExtendId: 0
    IsSpecial: 0
  - Icon: {fileID: 21300000, guid: 750e03842a0af634a8c1b244777baccd, type: 3}
    CategoryIcon: {fileID: 0}
    Quantity: 1
    RewardType: 5
    ExtendId: 0
    IsSpecial: 0
  - Icon: {fileID: 21300000, guid: bf30fc965b1326045a72e7ca04d0e707, type: 3}
    CategoryIcon: {fileID: 0}
    Quantity: 1
    RewardType: 7
    ExtendId: 2
    IsSpecial: 0
  - Icon: {fileID: 21300000, guid: b3f29fd74e914bf4bacda265a58aff33, type: 3}
    CategoryIcon: {fileID: 0}
    Quantity: 2
    RewardType: 3
    ExtendId: 1
    IsSpecial: 0
  - Icon: {fileID: 21300000, guid: 89667f04f225cc443a5fa12d2b8c0f87, type: 3}
    CategoryIcon: {fileID: 0}
    Quantity: 8000
    RewardType: 0
    ExtendId: 0
    IsSpecial: 0
  - Icon: {fileID: 21300000, guid: 82f3f9b5099211643b18bfb47e5fb96a, type: 3}
    CategoryIcon: {fileID: 0}
    Quantity: 10
    RewardType: 6
    ExtendId: 3
    IsSpecial: 0
  - Icon: {fileID: 21300000, guid: 0625d369acb821e4892ab22ae2fe2f69, type: 3}
    CategoryIcon: {fileID: 0}
    Quantity: 20
    RewardType: 1
    ExtendId: 0
    IsSpecial: 0
  - Icon: {fileID: 21300000, guid: 58be8bb0ac8463342891dad85de90109, type: 3}
    CategoryIcon: {fileID: 0}
    Quantity: 10000
    RewardType: 0
    ExtendId: 0
    IsSpecial: 0
  - Icon: {fileID: 21300000, guid: 750e03842a0af634a8c1b244777baccd, type: 3}
    CategoryIcon: {fileID: 0}
    Quantity: 1
    RewardType: 5
    ExtendId: 0
    IsSpecial: 0
  - Icon: {fileID: 21300000, guid: bf30fc965b1326045a72e7ca04d0e707, type: 3}
    CategoryIcon: {fileID: 0}
    Quantity: 1
    RewardType: 7
    ExtendId: 3
    IsSpecial: 0
  - Icon: {fileID: 21300000, guid: 91944dd5c492fe6468850071a956c366, type: 3}
    CategoryIcon: {fileID: 0}
    Quantity: 1
    RewardType: 3
    ExtendId: 2
    IsSpecial: 0
  Rookies:
  - Icon: {fileID: 21300000, guid: d47523f84a7e379498381f2e023cd6d4, type: 3}
    CategoryIcon: {fileID: 0}
    Quantity: 10000
    RewardType: 0
    ExtendId: 0
    IsSpecial: 0
  - Icon: {fileID: 21300000, guid: 91944dd5c492fe6468850071a956c366, type: 3}
    CategoryIcon: {fileID: 0}
    Quantity: 1
    RewardType: 3
    ExtendId: 2
    IsSpecial: 0
  - Icon: {fileID: 21300000, guid: 876b82cc93643ac4e8121f5c5bd0d082, type: 3}
    CategoryIcon: {fileID: 0}
    Quantity: 10
    RewardType: 1
    ExtendId: 0
    IsSpecial: 0
  - Icon: {fileID: 21300000, guid: ad2be8b2143b0934a9b1b6679bf858a5, type: 3}
    CategoryIcon: {fileID: 0}
    Quantity: 20
    RewardType: 6
    ExtendId: 2
    IsSpecial: 0
  - Icon: {fileID: 21300000, guid: 59c4ee9aea754034b9e115b168a5edb5, type: 3}
    CategoryIcon: {fileID: 0}
    Quantity: 1
    RewardType: 9
    ExtendId: 2
    IsSpecial: 0
  - Icon: {fileID: 21300000, guid: 82f3f9b5099211643b18bfb47e5fb96a, type: 3}
    CategoryIcon: {fileID: 0}
    Quantity: 20
    RewardType: 6
    ExtendId: 3
    IsSpecial: 0
  - Icon: {fileID: 21300000, guid: 641de733afe99574f8ea4b1bd8d7407a, type: 3}
    CategoryIcon: {fileID: 0}
    Quantity: 1
    RewardType: 8
    ExtendId: 2
    IsSpecial: 1
  AfterRookies:
  - Icon: {fileID: 21300000, guid: d47523f84a7e379498381f2e023cd6d4, type: 3}
    CategoryIcon: {fileID: 0}
    Quantity: 2000
    RewardType: 0
    ExtendId: 0
    IsSpecial: 0
  - Icon: {fileID: 21300000, guid: 76e15aee5e0d4d04182cd382d4f943ba, type: 3}
    CategoryIcon: {fileID: 0}
    Quantity: 1
    RewardType: 3
    ExtendId: 0
    IsSpecial: 0
  - Icon: {fileID: 21300000, guid: adcf0859794c02043a246b828fc8fea5, type: 3}
    CategoryIcon: {fileID: 0}
    Quantity: 3
    RewardType: 1
    ExtendId: 0
    IsSpecial: 0
  - Icon: {fileID: 21300000, guid: a3f370f51a535bf489ea20dc2b2745eb, type: 3}
    CategoryIcon: {fileID: 0}
    Quantity: 5
    RewardType: 6
    ExtendId: 1
    IsSpecial: 0
  - Icon: {fileID: 21300000, guid: c901e87e66224484cbbb644bf65cfde2, type: 3}
    CategoryIcon: {fileID: 0}
    Quantity: 5
    RewardType: 2
    ExtendId: 0
    IsSpecial: 0
  - Icon: {fileID: 21300000, guid: 750e03842a0af634a8c1b244777baccd, type: 3}
    CategoryIcon: {fileID: 0}
    Quantity: 1
    RewardType: 5
    ExtendId: 0
    IsSpecial: 0
  - Icon: {fileID: 21300000, guid: 82f3f9b5099211643b18bfb47e5fb96a, type: 3}
    CategoryIcon: {fileID: 0}
    Quantity: 3
    RewardType: 6
    ExtendId: 3
    IsSpecial: 1
