%YAML 1.1
%TAG !u! tag:unity3d.com,2011:
--- !u!114 &11400000
MonoBehaviour:
  m_ObjectHideFlags: 0
  m_PrefabParentObject: {fileID: 0}
  m_PrefabInternal: {fileID: 0}
  m_GameObject: {fileID: 0}
  m_Enabled: 1
  m_EditorHideFlags: 0
  m_Script: {fileID: 11500000, guid: b6519e15a9bc2ce4899567c8c41d78bb, type: 3}
  m_Name: PacksItemData
  m_EditorClassIdentifier: 
  Packs:
  - Iap: Goi1
    Packs:
    - ItemIcon: {fileID: 21300000, guid: ee5839963dc7c5b46909956d061c9cd5, type: 3}
      TypeReward: 0
      Number: 10000
    - ItemIcon: {fileID: 21300000, guid: 6f214ab212694614b98e36a0490bb1cb, type: 3}
      TypeReward: 1
      Number: 200
    - ItemIcon: {fileID: 21300000, guid: 37542a7eaf517f64d816f65e44b67ac0, type: 3}
      TypeReward: 2
      Number: 20
    - ItemIcon: {fileID: 21300000, guid: d1832aebeeb4bda4daff19d338a528f0, type: 3}
      TypeReward: 3
      Number: 10
    - ItemIcon: {fileID: 21300000, guid: 9d52a43b60a54d64faa56188e4a89e18, type: 3}
      TypeReward: 4
      Number: 5
    - ItemIcon: {fileID: 21300000, guid: d1b1e476516c2934285761d779a8759b, type: 3}
      TypeReward: 5
      Number: 3
    - ItemIcon: {fileID: 21300000, guid: 5050a46e2fb316b4190d74b195b858ad, type: 3}
      TypeReward: 6
      Number: 100
    - ItemIcon: {fileID: 21300000, guid: 62df481928fbab647b8b540b4099a921, type: 3}
      TypeReward: 7
      Number: 5
    - ItemIcon: {fileID: 21300000, guid: 235faf6576ad8234b863f3d87e97fba8, type: 3}
      TypeReward: 7
      Number: 4
    Price: 100
    Percent: 80
  - Iap: Goi2
    Packs:
    - ItemIcon: {fileID: 21300000, guid: ee5839963dc7c5b46909956d061c9cd5, type: 3}
      TypeReward: 0
      Number: 10000
    - ItemIcon: {fileID: 21300000, guid: 6f214ab212694614b98e36a0490bb1cb, type: 3}
      TypeReward: 1
      Number: 200
    - ItemIcon: {fileID: 21300000, guid: 37542a7eaf517f64d816f65e44b67ac0, type: 3}
      TypeReward: 2
      Number: 20
    - ItemIcon: {fileID: 21300000, guid: d1832aebeeb4bda4daff19d338a528f0, type: 3}
      TypeReward: 3
      Number: 10
    - ItemIcon: {fileID: 21300000, guid: 9d52a43b60a54d64faa56188e4a89e18, type: 3}
      TypeReward: 4
      Number: 5
    - ItemIcon: {fileID: 21300000, guid: d1b1e476516c2934285761d779a8759b, type: 3}
      TypeReward: 5
      Number: 3
    - ItemIcon: {fileID: 21300000, guid: 5050a46e2fb316b4190d74b195b858ad, type: 3}
      TypeReward: 6
      Number: 100
    - ItemIcon: {fileID: 21300000, guid: 62df481928fbab647b8b540b4099a921, type: 3}
      TypeReward: 7
      Number: 5
    - ItemIcon: {fileID: 21300000, guid: 235faf6576ad8234b863f3d87e97fba8, type: 3}
      TypeReward: 7
      Number: 4
    Price: 10000
    Percent: 20
  - Iap: Goi3
    Packs:
    - ItemIcon: {fileID: 21300000, guid: ee5839963dc7c5b46909956d061c9cd5, type: 3}
      TypeReward: 0
      Number: 10000
    - ItemIcon: {fileID: 21300000, guid: 6f214ab212694614b98e36a0490bb1cb, type: 3}
      TypeReward: 1
      Number: 200
    - ItemIcon: {fileID: 21300000, guid: 37542a7eaf517f64d816f65e44b67ac0, type: 3}
      TypeReward: 2
      Number: 20
    - ItemIcon: {fileID: 21300000, guid: d1832aebeeb4bda4daff19d338a528f0, type: 3}
      TypeReward: 3
      Number: 10
    - ItemIcon: {fileID: 21300000, guid: 9d52a43b60a54d64faa56188e4a89e18, type: 3}
      TypeReward: 4
      Number: 5
    - ItemIcon: {fileID: 21300000, guid: d1b1e476516c2934285761d779a8759b, type: 3}
      TypeReward: 5
      Number: 3
    - ItemIcon: {fileID: 21300000, guid: 5050a46e2fb316b4190d74b195b858ad, type: 3}
      TypeReward: 6
      Number: 100
    - ItemIcon: {fileID: 21300000, guid: 62df481928fbab647b8b540b4099a921, type: 3}
      TypeReward: 7
      Number: 5
    - ItemIcon: {fileID: 21300000, guid: 235faf6576ad8234b863f3d87e97fba8, type: 3}
      TypeReward: 7
      Number: 4
    Price: 1000000
    Percent: 20
