{
"skeleton": { "hash": "EXZ0CjYLUBXQdullp4Sd8hYeThs", "spine": "3.7.94", "width": 303, "height": 297, "images": "./images/LV/", "audio": "" },
"bones": [
	{ "name": "root" },
	{ "name": "X", "parent": "root", "length": 53.02, "y": -64.21 },
	{ "name": "Y", "parent": "X", "length": 55.62, "rotation": -90, "x": -0.21, "y": -0.12 },
	{ "name": "S8_11", "parent": "Y", "length": 95.16, "rotation": 180, "x": -187.83, "y": -1.68 },
	{ "name": "Lv1_31", "parent": "S8_11", "length": 33.12, "rotation": 180, "x": -49.39, "y": -0.52 },
	{ "name": "Lv1_L_01", "parent": "S8_11", "length": 48.59, "rotation": 143.38, "x": 72.07, "y": 37.89 },
	{ "name": "Lv1_R_01", "parent": "S8_11", "length": 51.36, "rotation": -141.25, "x": 72.07, "y": -38.53 },
	{ "name": "Lv2_L_01", "parent": "S8_11", "length": 37, "rotation": 134.43, "x": 69.43, "y": 1.77 },
	{ "name": "Lv2_L_31", "parent": "Lv2_L_01", "length": 31.87, "rotation": 1.23, "x": 35.9, "y": -0.38 },
	{ "name": "Lv2_L_41", "parent": "S8_11", "length": 48.99, "rotation": 146.65, "x": -36.76, "y": 15.24 },
	{ "name": "Lv2_R_01", "parent": "S8_11", "length": 37.37, "rotation": -133.88, "x": 70.99, "y": -0.82 },
	{ "name": "Lv2_R_31", "parent": "Lv2_R_01", "length": 37.01, "rotation": 0.58, "x": 37.37 },
	{ "name": "Lv2_R_41", "parent": "S8_11", "length": 47.17, "rotation": -148.93, "x": -33.13, "y": -14.8 },
	{ "name": "S8_12", "parent": "S8_11", "x": -14.79, "y": -0.63, "color": "3afc32ff" },
	{ "name": "Lv3_01", "parent": "S8_12", "length": 10.78, "x": -2.06, "y": -0.07, "color": "6aff76ff" },
	{ "name": "Lv3_L_01", "parent": "Lv1_31", "length": 23.88, "rotation": -66.21, "x": 10.89, "y": -45.89 },
	{ "name": "Lv3_L_11", "parent": "Lv3_L_01", "length": 20.81, "rotation": -139.2, "x": 23.48, "y": -0.34 },
	{ "name": "Lv3_R_01", "parent": "Lv1_31", "length": 31.69, "rotation": 69.15, "x": 8.07, "y": 45.99 },
	{ "name": "Lv3_R_11", "parent": "Lv3_R_01", "length": 19.29, "rotation": 133.04, "x": 31.22, "y": 0.58 },
	{ "name": "Lv4_01", "parent": "S8_11", "length": 25.29, "x": -49.02, "y": -0.36 },
	{ "name": "Lv4_31", "parent": "Lv1_31", "length": 25.12, "rotation": 1.57, "x": 34.08, "y": -0.25 },
	{ "name": "Lv4_L_01", "parent": "Lv1_L_01", "length": 27.28, "rotation": 167.22, "x": -0.6, "y": 0.29 },
	{ "name": "Lv4_R_01", "parent": "Lv1_R_01", "length": 27.63, "rotation": -177.3, "x": -0.98, "y": 0.13 },
	{ "name": "S8_13", "parent": "S8_12", "length": 23.03, "rotation": -90, "x": 0.14 }
],
"slots": [
	{ "name": "Clip", "bone": "X" },
	{ "name": "Lv4_31", "bone": "Lv4_31", "attachment": "Lv4_31" },
	{ "name": "Lv2_L_41", "bone": "Lv2_L_41", "attachment": "Lv2_L_41" },
	{ "name": "Lv1_31", "bone": "Lv1_31", "attachment": "Lv1_31" },
	{ "name": "Lv2_L_31", "bone": "Lv2_L_31", "attachment": "Lv2_L_31" },
	{ "name": "Lv2_R_41", "bone": "Lv2_R_41", "attachment": "Lv2_R_41" },
	{ "name": "Lv1_R_31", "bone": "Lv1_31", "attachment": "Lv1_R_31" },
	{ "name": "Lv2_R_31", "bone": "Lv2_R_31", "attachment": "Lv2_R_31" },
	{ "name": "S8_01", "bone": "S8_11", "attachment": "S8_01" },
	{ "name": "Lv3_R_11", "bone": "Lv3_R_11", "attachment": "Lv3_R_11" },
	{ "name": "Lv3_R_01", "bone": "Lv3_R_01", "attachment": "Lv3_R_01" },
	{ "name": "Lv2_R_01", "bone": "Lv2_R_01", "attachment": "Lv2_R_01" },
	{ "name": "Lv4_R_01", "bone": "Lv4_R_01", "attachment": "Lv4_R_01" },
	{ "name": "Lv1_R_01", "bone": "Lv1_R_01", "attachment": "Lv1_R_01" },
	{ "name": "Lv3_L_11", "bone": "Lv3_L_11", "attachment": "Lv3_L_11" },
	{ "name": "Lv3_L_01", "bone": "Lv3_L_01", "attachment": "Lv3_L_01" },
	{ "name": "Lv2_L_01", "bone": "Lv2_L_01", "attachment": "Lv2_L_01" },
	{ "name": "Lv4_L_01", "bone": "Lv4_L_01", "attachment": "Lv4_L_01" },
	{ "name": "Lv1_L_01", "bone": "Lv1_L_01", "attachment": "Lv1_L_01" },
	{ "name": "S8_11", "bone": "S8_11", "attachment": "S8_11" },
	{ "name": "Lv3_01", "bone": "Lv3_01", "attachment": "Lv3_01" },
	{ "name": "Lv4_01", "bone": "Lv4_01", "attachment": "Lv4_01" },
	{ "name": "Ellipse", "bone": "S8_13" }
],
"skins": {
	"default": {
		"Ellipse": {
			"Ellipse": { "x": -0.22, "y": -1.42, "width": 54, "height": 54 }
		},
		"S8_01": {
			"S8_01": { "x": -0.12, "y": -0.77, "rotation": -90, "width": 303, "height": 297 }
		},
		"S8_11": {
			"S8_11": { "x": -1.62, "y": -1.27, "rotation": -90, "width": 146, "height": 194 }
		}
	},
	"Skin_Lv0": {
		"Clip": {
			"Clip": {
				"name": "Clip2",
				"type": "clipping",
				"end": "Clip",
				"vertexCount": 74,
				"vertices": [ 1, 3, -81.73, 16.59, 1, 1, 3, -83.16, 6.42, 1, 1, 3, -80.69, 2.51, 1, 1, 3, -71.6, 1.5, 1, 1, 3, -67.87, 4.23, 1, 1, 3, -64.1, 4.63, 1, 1, 3, -63.99, -7.19, 1, 1, 3, -68.1, -6.9, 1, 1, 3, -71.91, -4.18, 1, 1, 3, -80.33, -4.88, 1, 1, 3, -82.32, -8.77, 1, 1, 3, -81.74, -19.66, 1, 1, 3, -63.83, -35.12, 1, 1, 3, -71.87, -48.5, 1, 1, 3, -85.17, -50.96, 1, 1, 3, -102.45, -76.85, 1, 1, 3, -90.49, -75.8, 1, 1, 3, -116.36, -116.21, 1, 1, 3, -79.21, -107.62, 1, 1, 3, -46.08, -90.15, 1, 1, 3, -27.54, -70.44, 1, 1, 3, -9.68, -47.33, 1, 1, 3, 10.7, -41.16, 1, 1, 3, 18.93, -30.69, 1, 1, 3, 26.97, -29.99, 1, 1, 3, 42.09, -15.14, 1, 1, 3, 50.37, -15.34, 1, 1, 3, 48.3, -25.16, 1, 1, 3, 43.54, -35.13, 1, 1, 3, 35.6, -35.78, 1, 1, 3, 29.67, -48.5, 1, 1, 3, 27.34, -55.82, 1, 1, 3, 17, -66.28, 1, 1, 3, -6, -87.43, 1, 1, 3, 8.67, -86.39, 1, 1, 3, 23.89, -81.28, 1, 1, 3, 47.32, -73.91, 1, 1, 3, 68.13, -62.83, 1, 1, 3, 80.19, -54.16, 1, 1, 3, 95.21, -39.43, 1, 1, 3, 103.94, -24.59, 1, 1, 3, 106.75, -13.01, 1, 1, 3, 108.72, -1.3, 1, 1, 3, 106.51, 12.27, 1, 1, 3, 101.72, 24.57, 1, 1, 3, 93.51, 37.91, 1, 1, 3, 82.46, 48.9, 1, 1, 3, 68.51, 60.73, 1, 1, 3, 48.29, 71.62, 1, 1, 3, 25.9, 79.78, 1, 1, 3, 10.33, 82.97, 1, 1, 3, -6.89, 84.81, 1, 1, 3, 17.1, 63.29, 1, 1, 3, 26.19, 53.5, 1, 1, 3, 27.85, 45.8, 1, 1, 3, 37.33, 32.6, 1, 1, 3, 42.56, 32.36, 1, 1, 3, 47.06, 22.89, 1, 1, 3, 49.53, 13.66, 1, 1, 3, 42.22, 12.88, 1, 1, 3, 24.92, 27.94, 1, 1, 3, 18.16, 28.64, 1, 1, 3, 10.4, 37.95, 1, 1, 3, -10.33, 44.86, 1, 1, 3, -26.64, 68.62, 1, 1, 3, -46.16, 89.69, 1, 1, 3, -66.66, 100.9, 1, 1, 3, -84.59, 108.52, 1, 1, 3, -118.85, 114.5, 1, 1, 3, -93.59, 73.87, 1, 1, 3, -101.57, 74.07, 1, 1, 3, -83.22, 48.69, 1, 1, 3, -73.17, 46.08, 1, 1, 3, -63.89, 32.9, 1 ],
				"color": "ce3a3aff"
			}
		}
	},
	"Skin_Lv1": {
		"Clip": {
			"Clip": {
				"name": "Clip2",
				"type": "clipping",
				"end": "Clip",
				"vertexCount": 84,
				"vertices": [ 1, 3, -81.73, 16.59, 1, 1, 3, -83.16, 6.42, 1, 1, 3, -80.69, 2.51, 1, 1, 3, -71.6, 1.5, 1, 1, 3, -67.87, 4.23, 1, 1, 3, -64.1, 4.63, 1, 1, 3, -63.99, -7.19, 1, 1, 3, -68.1, -6.9, 1, 1, 3, -71.91, -4.18, 1, 1, 3, -80.33, -4.88, 1, 1, 3, -82.32, -8.77, 1, 1, 3, -81.74, -19.66, 1, 2, 3, -63.83, -35.12, 0.47, 4, 14.44, 34.6, 0.53, 1, 4, 23, 39.22, 1, 1, 4, 35.27, 41.67, 1, 1, 4, 47.72, 42.58, 1, 1, 4, 54.95, 53.93, 1, 1, 4, 67.09, 67.85, 1, 1, 4, 80.41, 80.72, 1, 2, 3, -98.23, -86.12, 0.6, 4, 48.84, 85.61, 0.4, 1, 3, -116.36, -116.21, 1, 1, 3, -79.21, -107.62, 1, 1, 3, -46.08, -90.15, 1, 1, 3, -27.54, -70.44, 1, 1, 3, -9.68, -47.33, 1, 1, 3, 10.7, -41.16, 1, 1, 3, 18.93, -30.69, 1, 1, 3, 26.97, -29.99, 1, 1, 3, 42.09, -15.14, 1, 1, 3, 50.37, -15.34, 1, 1, 3, 48.3, -25.16, 1, 1, 3, 43.54, -35.13, 1, 1, 3, 35.6, -35.78, 1, 1, 3, 29.67, -48.5, 1, 1, 3, 27.34, -55.82, 1, 1, 3, 17, -66.28, 1, 1, 3, -6, -87.43, 1, 1, 3, 8.39, -84.73, 1, 2, 3, 22.79, -80.18, 0.5, 6, 64.5, 1.63, 0.5, 1, 6, 78.45, 6.83, 1, 1, 6, 60.09, 19, 1, 1, 6, 26.7, 29.1, 1, 1, 6, -15.07, 30.91, 1, 1, 6, -36.51, 27.24, 1, 2, 3, 92.46, -37.55, 0.5, 5, -61.37, 48.38, 0.5, 1, 3, 100.94, -24.97, 1, 1, 3, 105.62, -13.01, 1, 1, 3, 106.72, -1.3, 1, 1, 3, 104.89, 11.14, 1, 1, 3, 100.4, 24.38, 1, 2, 3, 91.47, 36.5, 0.5, 5, -16.4, -10.46, 0.5, 1, 5, -36.6, -25.35, 1, 1, 5, -14.94, -29.77, 1, 1, 5, 26.5, -29.33, 1, 1, 5, 60.68, -20.77, 1, 1, 5, 77.83, -8.79, 1, 2, 3, 23.04, 78.46, 0.5, 5, 63.55, -3.32, 0.5, 1, 3, 10.33, 82.97, 1, 1, 3, -6.89, 84.81, 1, 1, 3, 17.1, 63.29, 1, 1, 3, 26.19, 53.5, 1, 1, 3, 27.85, 45.8, 1, 1, 3, 37.33, 32.6, 1, 1, 3, 42.56, 32.36, 1, 1, 3, 47.06, 22.89, 1, 1, 3, 49.53, 13.66, 1, 1, 3, 42.22, 12.88, 1, 1, 3, 24.92, 27.94, 1, 1, 3, 18.16, 28.64, 1, 1, 3, 10.4, 37.95, 1, 1, 3, -10.33, 44.86, 1, 1, 3, -26.64, 68.62, 1, 1, 3, -46.16, 89.69, 1, 1, 3, -66.66, 100.9, 1, 1, 3, -84.59, 108.52, 1, 1, 3, -118.85, 114.5, 1, 2, 3, -101.99, 84.18, 0.6, 4, 52.6, -84.7, 0.4, 1, 4, 83.13, -78.6, 1, 1, 4, 67.61, -65.56, 1, 1, 4, 56.76, -52, 1, 1, 4, 44.98, -40.36, 1, 1, 4, 34.4, -39.84, 1, 1, 4, 23.59, -36.85, 1, 2, 3, -63.89, 32.9, 0.47, 4, 14.5, -33.42, 0.53 ],
				"color": "ce3a3aff"
			}
		},
		"Lv1_31": {
			"Lv1_31": { "path": "Lv1_L_31", "x": 30.23, "y": -58.75, "rotation": 90, "width": 51, "height": 98 }
		},
		"Lv1_L_01": {
			"Lv1_L_01": { "x": 14.61, "y": -10.13, "rotation": 126.62, "width": 72, "height": 98 }
		},
		"Lv1_R_01": {
			"Lv1_R_01": { "x": 15.53, "y": 10.28, "rotation": 51.25, "width": 72, "height": 98 }
		},
		"Lv1_R_31": {
			"Lv1_R_31": { "x": 30.23, "y": 60.25, "rotation": 90, "width": 51, "height": 98 }
		}
	},
	"Skin_Lv2": {
		"Clip": {
			"Clip": {
				"name": "Clip2",
				"type": "clipping",
				"end": "Clip",
				"vertexCount": 72,
				"vertices": [ 2, 3, -82.09, 6.73, 0.5, 20, -1.57, -6.96, 0.5, 1, 3, -80.69, 2.51, 1, 1, 3, -71.6, 1.5, 1, 1, 3, -67.87, 4.23, 1, 1, 3, -64.1, 4.63, 1, 1, 3, -63.99, -7.19, 1, 1, 3, -68.1, -6.9, 1, 1, 3, -71.91, -4.18, 1, 1, 3, -80.33, -4.88, 1, 2, 3, -82.32, -8.77, 0.5, 20, -0.92, 8.53, 0.5, 1, 12, 95.31, -56.94, 1, 1, 12, 87.64, -21.21, 1, 2, 12, 81.46, -2.8, 0.5, 4, 54.95, 53.93, 0.5, 1, 4, 67.09, 67.85, 1, 1, 4, 80.41, 80.72, 1, 2, 3, -98.23, -86.12, 0.6, 4, 48.84, 85.61, 0.4, 1, 3, -116.36, -116.21, 1, 1, 3, -79.21, -107.62, 1, 1, 3, -46.08, -90.15, 1, 1, 3, -27.54, -70.44, 1, 1, 3, -9.68, -47.33, 1, 1, 3, 10.7, -41.16, 1, 1, 3, 18.93, -30.69, 1, 1, 3, 26.97, -29.99, 1, 2, 3, 30.17, -26.18, 0.5, 11, 9.09, -11.94, 0.5, 2, 3, 37.3, -28.52, 0.5, 11, 5.9, -5.14, 0.5, 1, 11, 44.41, -6.38, 1, 2, 3, 27.34, -55.82, 0.5, 11, 32.6, 6.33, 0.5, 1, 3, 17, -66.28, 1, 1, 3, -6, -87.43, 1, 1, 3, 8.39, -84.73, 1, 2, 3, 22.79, -80.18, 0.5, 6, 64.5, 1.63, 0.5, 1, 6, 78.45, 6.83, 1, 1, 6, 60.09, 19, 1, 1, 6, 26.7, 29.1, 1, 1, 6, -15.07, 30.91, 1, 1, 6, -36.51, 27.24, 1, 2, 3, 92.46, -37.55, 0.5, 5, -61.37, 48.38, 0.5, 1, 3, 100.94, -24.97, 1, 1, 3, 105.62, -13.01, 1, 1, 3, 106.72, -1.3, 1, 1, 3, 104.89, 11.14, 1, 1, 3, 100.4, 24.38, 1, 2, 3, 91.47, 36.5, 0.5, 5, -16.4, -10.46, 0.5, 1, 5, -36.6, -25.35, 1, 1, 5, -14.94, -29.77, 1, 1, 5, 26.5, -29.33, 1, 1, 5, 60.68, -20.77, 1, 1, 5, 77.83, -8.79, 1, 2, 3, 23.04, 78.46, 0.5, 5, 63.55, -3.32, 0.5, 1, 3, 10.33, 82.97, 1, 1, 3, -6.89, 84.81, 1, 1, 3, 17.1, 63.29, 1, 2, 3, 25.91, 54.06, 0.5, 8, 31.79, -5.83, 0.5, 1, 8, 42.79, 5.78, 1, 2, 3, 35.75, 26.8, 0.5, 8, 5.69, 6.79, 0.5, 2, 3, 29.29, 24.84, 0.5, 8, 8.94, 12.7, 0.5, 1, 3, 24.92, 27.94, 1, 1, 3, 18.16, 28.64, 1, 1, 3, 10.4, 37.95, 1, 1, 3, -10.33, 44.86, 1, 1, 3, -26.64, 68.62, 1, 1, 3, -46.16, 89.69, 1, 1, 3, -66.66, 100.9, 1, 1, 3, -84.59, 108.52, 1, 1, 3, -118.85, 114.5, 1, 2, 3, -101.99, 84.18, 0.6, 4, 52.6, -84.7, 0.4, 1, 4, 83.13, -78.6, 1, 1, 4, 67.61, -65.56, 1, 2, 4, 56.76, -52, 0.5, 9, 77.89, 7.87, 0.5, 1, 9, 82.58, 27.47, 1, 1, 9, 86.54, 60.92, 1 ],
				"color": "ce3a3aff"
			}
		},
		"Lv1_31": {
			"Lv1_31": { "path": "Lv1_L_31", "x": 30.23, "y": -58.75, "rotation": 90, "width": 51, "height": 98 }
		},
		"Lv1_L_01": {
			"Lv1_L_01": { "x": 14.61, "y": -10.13, "rotation": 126.62, "width": 72, "height": 98 }
		},
		"Lv1_R_01": {
			"Lv1_R_01": { "x": 15.53, "y": 10.28, "rotation": 51.25, "width": 72, "height": 98 }
		},
		"Lv1_R_31": {
			"Lv1_R_31": { "x": 30.23, "y": 60.25, "rotation": 90, "width": 51, "height": 98 }
		},
		"Lv2_L_01": {
			"Lv2_L_01": { "x": 26.47, "y": 4.92, "rotation": 135.57, "width": 35, "height": 86 }
		},
		"Lv2_L_31": {
			"Lv2_L_31": { "x": -3.09, "y": -6.59, "rotation": 134.34, "width": 47, "height": 78 }
		},
		"Lv2_L_41": {
			"Lv2_L_41": { "x": 37.16, "y": -3.06, "rotation": 123.35, "width": 71, "height": 147 }
		},
		"Lv2_R_01": {
			"Lv2_R_01": { "x": 29.3, "y": -4.57, "rotation": 43.88, "width": 35, "height": 86 }
		},
		"Lv2_R_31": {
			"Lv2_R_31": { "x": -0.67, "y": 8.02, "rotation": 43.3, "width": 47, "height": 78 }
		},
		"Lv2_R_41": {
			"Lv2_R_41": { "x": 41.65, "y": 5.22, "rotation": 58.93, "width": 71, "height": 147 }
		}
	},
	"Skin_Lv3": {
		"Clip": {
			"Clip": {
				"name": "Clip2",
				"type": "clipping",
				"end": "Clip",
				"vertexCount": 85,
				"vertices": [ 2, 3, -82.09, 6.73, 0.5, 20, -1.57, -6.96, 0.5, 1, 3, -80.69, 2.51, 1, 1, 3, -71.6, 1.5, 1, 1, 3, -67.87, 4.23, 1, 1, 3, -64.1, 4.63, 1, 1, 3, -63.99, -7.19, 1, 1, 3, -68.1, -6.9, 1, 1, 3, -71.91, -4.18, 1, 1, 3, -80.33, -4.88, 1, 2, 3, -82.32, -8.77, 0.5, 20, -0.92, 8.53, 0.5, 1, 12, 95.31, -56.94, 1, 1, 12, 87.64, -21.21, 1, 2, 12, 81.46, -2.8, 0.5, 4, 54.95, 53.93, 0.5, 1, 4, 67.09, 67.85, 1, 1, 4, 80.41, 80.72, 1, 2, 17, 53.7, -33.84, 0.5, 4, 58.8, 84.13, 0.5, 1, 17, 75.76, -49.34, 1, 1, 17, 102.91, -75.55, 1, 1, 17, 96.72, -33.68, 1, 1, 17, 78.5, 9.97, 1, 1, 17, 51.36, 42.46, 1, 1, 17, 28.37, 57.97, 1, 1, 17, 29.95, 51.19, 1, 2, 18, 30.54, -27.61, 0.5, 17, 30.54, 41.74, 0.5, 1, 18, 40.98, -25.69, 1, 1, 18, 50.76, -22.37, 1, 1, 18, 42.99, -17.18, 1, 2, 3, -29.43, -70.25, 0.5, 18, 37.87, -9.37, 0.5, 1, 3, -9.68, -47.33, 1, 1, 3, 10.7, -41.16, 1, 1, 3, 18.93, -30.69, 1, 1, 3, 26.97, -29.99, 1, 2, 3, 30.17, -26.18, 0.5, 11, 9.09, -11.94, 0.5, 2, 3, 37.3, -28.52, 0.5, 11, 5.9, -5.14, 0.5, 1, 11, 44.41, -6.38, 1, 2, 3, 27.34, -55.82, 0.5, 11, 32.6, 6.33, 0.5, 1, 3, 17, -66.28, 1, 1, 3, -6, -87.43, 1, 1, 3, 8.39, -84.73, 1, 2, 3, 22.79, -80.18, 0.5, 6, 64.5, 1.63, 0.5, 1, 6, 78.45, 6.83, 1, 1, 6, 60.09, 19, 1, 1, 6, 26.7, 29.1, 1, 1, 6, -15.07, 30.91, 1, 1, 6, -36.51, 27.24, 1, 2, 3, 92.46, -37.55, 0.5, 5, -61.37, 48.38, 0.5, 1, 3, 100.94, -24.97, 1, 1, 3, 105.62, -13.01, 1, 1, 3, 106.72, -1.3, 1, 1, 3, 104.89, 11.14, 1, 1, 3, 100.4, 24.38, 1, 2, 3, 91.47, 36.5, 0.5, 5, -16.4, -10.46, 0.5, 1, 5, -36.6, -25.35, 1, 1, 5, -14.94, -29.77, 1, 1, 5, 26.5, -29.33, 1, 1, 5, 60.68, -20.77, 1, 1, 5, 77.83, -8.79, 1, 2, 3, 23.04, 78.46, 0.5, 5, 63.55, -3.32, 0.5, 1, 3, 10.33, 82.97, 1, 1, 3, -6.89, 84.81, 1, 1, 3, 17.1, 63.29, 1, 2, 3, 25.91, 54.06, 0.5, 8, 31.79, -5.83, 0.5, 1, 8, 42.79, 5.78, 1, 2, 3, 35.75, 26.8, 0.5, 8, 5.69, 6.79, 0.5, 2, 3, 29.29, 24.84, 0.5, 8, 8.94, 12.7, 0.5, 1, 3, 24.92, 27.94, 1, 1, 3, 18.16, 28.64, 1, 1, 3, 10.4, 37.95, 1, 1, 3, -10.33, 44.86, 1, 2, 3, -29.64, 67.7, 0.5, 16, 35.65, 17.71, 0.5, 1, 16, 39.49, 24.96, 1, 1, 16, 47.3, 33.5, 1, 2, 15, 26.53, -45.74, 0.5, 16, 27.36, 36.37, 0.5, 1, 15, 24.53, -60.42, 1, 1, 15, 46.67, -46.67, 1, 1, 15, 75.98, -17.6, 1, 1, 15, 96.91, 26.52, 1, 1, 15, 104.41, 69.3, 1, 1, 15, 77.59, 44.33, 1, 2, 4, 59.25, -84.1, 0.5, 15, 54.46, 28.84, 0.5, 1, 4, 83.43, -77.99, 1, 1, 4, 67.61, -65.56, 1, 2, 4, 56.76, -52, 0.5, 9, 77.89, 7.87, 0.5, 1, 9, 82.58, 27.47, 1, 1, 9, 86.54, 60.92, 1 ],
				"color": "ce3a3aff"
			}
		},
		"Lv1_31": {
			"Lv1_31": { "path": "Lv1_L_31", "x": 30.23, "y": -58.75, "rotation": 90, "width": 51, "height": 98 }
		},
		"Lv1_L_01": {
			"Lv1_L_01": { "x": 14.61, "y": -10.13, "rotation": 126.62, "width": 72, "height": 98 }
		},
		"Lv1_R_01": {
			"Lv1_R_01": { "x": 15.53, "y": 10.28, "rotation": 51.25, "width": 72, "height": 98 }
		},
		"Lv1_R_31": {
			"Lv1_R_31": { "x": 30.23, "y": 60.25, "rotation": 90, "width": 51, "height": 98 }
		},
		"Lv2_L_01": {
			"Lv2_L_01": { "x": 26.47, "y": 4.92, "rotation": 135.57, "width": 35, "height": 86 }
		},
		"Lv2_L_31": {
			"Lv2_L_31": { "x": -3.09, "y": -6.59, "rotation": 134.34, "width": 47, "height": 78 }
		},
		"Lv2_L_41": {
			"Lv2_L_41": { "x": 37.16, "y": -3.06, "rotation": 123.35, "width": 71, "height": 147 }
		},
		"Lv2_R_01": {
			"Lv2_R_01": { "x": 29.3, "y": -4.57, "rotation": 43.88, "width": 35, "height": 86 }
		},
		"Lv2_R_31": {
			"Lv2_R_31": { "x": -0.67, "y": 8.02, "rotation": 43.3, "width": 47, "height": 78 }
		},
		"Lv2_R_41": {
			"Lv2_R_41": { "x": 41.65, "y": 5.22, "rotation": 58.93, "width": 71, "height": 147 }
		},
		"Lv3_01": {
			"Lv3_01": { "name": "Lv3_02", "x": -0.09, "y": -0.07, "width": 85, "height": 82 }
		},
		"Lv3_L_01": {
			"Lv3_L_01": { "x": 39, "y": 13.23, "rotation": 156.21, "width": 94, "height": 143 }
		},
		"Lv3_L_11": {
			"Lv3_L_11": { "x": 5.32, "y": 10.54, "rotation": -64.59, "width": 75, "height": 89 }
		},
		"Lv3_R_01": {
			"Lv3_R_01": { "x": 39.66, "y": -17.7, "rotation": 20.85, "width": 94, "height": 143 }
		},
		"Lv3_R_11": {
			"Lv3_R_11": { "x": 7.37, "y": -2.89, "rotation": -112.19, "width": 75, "height": 89 }
		}
	},
	"Skin_Lv4": {
		"Clip": {
			"Clip": {
				"type": "clipping",
				"end": "Clip",
				"vertexCount": 80,
				"vertices": [ 2, 20, 14.12, -9.11, 0.5, 9, 47.28, 39.25, 0.5, 1, 20, 27.12, 0.6, 1, 2, 12, 53.95, -37.54, 0.5, 20, 15.53, 9.8, 0.5, 1, 12, 95.31, -56.94, 1, 1, 12, 87.64, -21.21, 1, 2, 12, 81.46, -2.8, 0.5, 4, 54.95, 53.93, 0.5, 1, 4, 67.09, 67.85, 1, 1, 4, 80.41, 80.72, 1, 2, 17, 53.7, -33.84, 0.5, 4, 58.8, 84.13, 0.5, 1, 17, 75.76, -49.34, 1, 1, 17, 102.91, -75.55, 1, 1, 17, 96.72, -33.68, 1, 1, 17, 78.5, 9.97, 1, 1, 17, 51.36, 42.46, 1, 1, 17, 28.37, 57.97, 1, 1, 17, 29.95, 51.19, 1, 2, 18, 30.54, -27.61, 0.5, 17, 30.54, 41.74, 0.5, 1, 18, 40.98, -25.69, 1, 1, 18, 50.76, -22.37, 1, 1, 18, 42.99, -17.18, 1, 2, 3, -29.43, -70.25, 0.5, 18, 37.87, -9.37, 0.5, 1, 3, -9.68, -47.33, 1, 1, 3, 10.7, -41.16, 1, 1, 3, 18.93, -30.69, 1, 1, 3, 26.97, -29.99, 1, 2, 3, 30.17, -26.18, 0.5, 11, 9.09, -11.94, 0.5, 2, 3, 37.3, -28.52, 0.5, 11, 5.9, -5.14, 0.5, 1, 11, 44.41, -6.38, 1, 2, 3, 27.34, -55.82, 0.5, 11, 32.6, 6.33, 0.5, 1, 3, 17, -66.28, 1, 1, 3, -6, -87.43, 1, 1, 3, 8.39, -84.73, 1, 2, 3, 22.79, -80.18, 0.5, 6, 64.5, 1.63, 0.5, 1, 6, 78.45, 6.83, 1, 1, 6, 60.09, 19, 1, 1, 6, 26.7, 29.1, 1, 1, 6, -15.07, 30.91, 1, 1, 6, -36.51, 27.24, 1, 2, 6, -23.99, 17.43, 0.5, 22, 22.18, -18.36, 0.5, 1, 22, 34.38, -16.55, 1, 1, 22, 49.45, -10.11, 1, 2, 3, 105.62, -13.01, 0.5, 22, 41.07, -2.91, 0.5, 1, 3, 106.72, -1.3, 1, 2, 3, 104.89, 11.14, 0.5, 21, 41.02, 7.67, 0.5, 1, 21, 48.55, 16.64, 1, 1, 21, 31.18, 20.57, 1, 2, 5, -23.51, -15.37, 0.5, 21, 18.88, 20.34, 0.5, 1, 5, -36.6, -25.35, 1, 1, 5, -14.94, -29.77, 1, 1, 5, 26.5, -29.33, 1, 1, 5, 60.68, -20.77, 1, 1, 5, 77.83, -8.79, 1, 2, 3, 23.04, 78.46, 0.5, 5, 63.55, -3.32, 0.5, 1, 3, 10.33, 82.97, 1, 1, 3, -6.89, 84.81, 1, 1, 3, 17.1, 63.29, 1, 2, 3, 25.91, 54.06, 0.5, 8, 31.79, -5.83, 0.5, 1, 8, 42.79, 5.78, 1, 2, 3, 35.75, 26.8, 0.5, 8, 5.69, 6.79, 0.5, 2, 3, 29.29, 24.84, 0.5, 8, 8.94, 12.7, 0.5, 1, 3, 24.92, 27.94, 1, 1, 3, 18.16, 28.64, 1, 1, 3, 10.4, 37.95, 1, 1, 3, -10.33, 44.86, 1, 2, 3, -29.64, 67.7, 0.5, 16, 35.65, 17.71, 0.5, 1, 16, 39.49, 24.96, 1, 1, 16, 47.3, 33.5, 1, 2, 15, 26.53, -45.74, 0.5, 16, 27.36, 36.37, 0.5, 1, 15, 24.53, -60.42, 1, 1, 15, 46.67, -46.67, 1, 1, 15, 75.98, -17.6, 1, 1, 15, 96.91, 26.52, 1, 1, 15, 104.41, 69.3, 1, 1, 15, 77.59, 44.33, 1, 2, 4, 59.25, -84.1, 0.5, 15, 54.46, 28.84, 0.5, 1, 4, 83.43, -77.99, 1, 1, 4, 67.61, -65.56, 1, 2, 4, 56.76, -52, 0.5, 9, 77.89, 7.87, 0.5, 1, 9, 82.58, 27.47, 1, 1, 9, 86.54, 60.92, 1 ],
				"color": "ce3a3aff"
			}
		},
		"Lv1_31": {
			"Lv1_31": { "path": "Lv1_L_31", "x": 30.23, "y": -58.75, "rotation": 90, "width": 51, "height": 98 }
		},
		"Lv1_L_01": {
			"Lv1_L_01": { "x": 14.61, "y": -10.13, "rotation": 126.62, "width": 72, "height": 98 }
		},
		"Lv1_R_01": {
			"Lv1_R_01": { "x": 15.53, "y": 10.28, "rotation": 51.25, "width": 72, "height": 98 }
		},
		"Lv1_R_31": {
			"Lv1_R_31": { "x": 30.23, "y": 60.25, "rotation": 90, "width": 51, "height": 98 }
		},
		"Lv2_L_01": {
			"Lv2_L_01": { "x": 26.47, "y": 4.92, "rotation": 135.57, "width": 35, "height": 86 }
		},
		"Lv2_L_31": {
			"Lv2_L_31": { "x": -3.09, "y": -6.59, "rotation": 134.34, "width": 47, "height": 78 }
		},
		"Lv2_L_41": {
			"Lv2_L_41": { "x": 37.16, "y": -3.06, "rotation": 123.35, "width": 71, "height": 147 }
		},
		"Lv2_R_01": {
			"Lv2_R_01": { "x": 29.3, "y": -4.57, "rotation": 43.88, "width": 35, "height": 86 }
		},
		"Lv2_R_31": {
			"Lv2_R_31": { "x": -0.67, "y": 8.02, "rotation": 43.3, "width": 47, "height": 78 }
		},
		"Lv2_R_41": {
			"Lv2_R_41": { "x": 41.65, "y": 5.22, "rotation": 58.93, "width": 71, "height": 147 }
		},
		"Lv3_01": {
			"Lv3_01": { "name": "Lv3_02", "x": -0.09, "y": -0.07, "width": 85, "height": 82 }
		},
		"Lv3_L_01": {
			"Lv3_L_01": { "x": 39, "y": 13.23, "rotation": 156.21, "width": 94, "height": 143 }
		},
		"Lv3_L_11": {
			"Lv3_L_11": { "x": 5.32, "y": 10.54, "rotation": -64.59, "width": 75, "height": 89 }
		},
		"Lv3_R_01": {
			"Lv3_R_01": { "x": 39.66, "y": -17.7, "rotation": 20.85, "width": 94, "height": 143 }
		},
		"Lv3_R_11": {
			"Lv3_R_11": { "x": 7.37, "y": -2.89, "rotation": -112.19, "width": 75, "height": 89 }
		},
		"Lv4_01": {
			"Lv4_01": { "x": 78.9, "y": -1.41, "rotation": -90, "width": 65, "height": 75 }
		},
		"Lv4_31": {
			"Lv4_31": { "x": -12.82, "y": 1.35, "rotation": 88.43, "width": 96, "height": 80 }
		},
		"Lv4_L_01": {
			"Lv4_L_01": { "x": 7.92, "y": 3.76, "rotation": -40.6, "width": 50, "height": 68 }
		},
		"Lv4_R_01": {
			"Lv4_R_01": { "x": 7.43, "y": -2.89, "rotation": -131.45, "width": 50, "height": 68 }
		}
	}
},
"animations": {
	"Idle_1": {
		"slots": {
			"Clip": {
				"attachment": [
					{ "time": 0, "name": "Clip" }
				]
			},
			"Ellipse": {
				"attachment": [
					{ "time": 0, "name": "Ellipse" },
					{ "time": 1.2333, "name": null }
				]
			}
		},
		"bones": {
			"Lv1_L_01": {
				"rotate": [
					{
						"time": 0,
						"angle": 0,
						"curve": [ 0.298, 0.45, 0.732, 1 ]
					},
					{
						"time": 0.5,
						"angle": -6.61,
						"curve": [ 0.25, 0, 0.75, 1 ]
					},
					{
						"time": 1.5,
						"angle": 6.04,
						"curve": [ 0.25, 0, 0.765, 0.67 ]
					},
					{ "time": 2, "angle": 0 }
				]
			},
			"Lv1_R_01": {
				"rotate": [
					{
						"time": 0,
						"angle": 0,
						"curve": [ 0.298, 0.45, 0.732, 1 ]
					},
					{
						"time": 0.5,
						"angle": 6.71,
						"curve": [ 0.25, 0, 0.75, 1 ]
					},
					{
						"time": 1.5,
						"angle": -4.6,
						"curve": [ 0.25, 0, 0.765, 0.67 ]
					},
					{ "time": 2, "angle": 0 }
				]
			},
			"Lv1_31": {
				"translate": [
					{
						"time": 0,
						"x": 0,
						"y": 0,
						"curve": [ 0.25, 0, 0.75, 1 ]
					},
					{
						"time": 1,
						"x": -3.24,
						"y": 0,
						"curve": [ 0.25, 0, 0.75, 1 ]
					},
					{ "time": 2, "x": 0, "y": 0 }
				]
			},
			"Lv2_L_01": {
				"scale": [
					{ "time": 0, "x": 1, "y": 1 },
					{ "time": 0.5, "x": 0.948, "y": 1 },
					{ "time": 1.5, "x": 1.046, "y": 1 },
					{ "time": 2, "x": 1, "y": 1 }
				]
			},
			"Lv2_R_01": {
				"scale": [
					{ "time": 0, "x": 1, "y": 1 },
					{ "time": 0.5, "x": 0.948, "y": 1 },
					{ "time": 1.5, "x": 1.046, "y": 1 },
					{ "time": 2, "x": 1, "y": 1 }
				]
			},
			"Lv2_L_31": {
				"rotate": [
					{ "time": 0, "angle": 0 },
					{ "time": 0.5, "angle": 5.21 },
					{ "time": 1.5, "angle": -4.86 },
					{ "time": 2, "angle": 0 }
				]
			},
			"Lv2_R_31": {
				"rotate": [
					{ "time": 0, "angle": 0 },
					{ "time": 0.5, "angle": -3.25 },
					{ "time": 1.5, "angle": 5.38 },
					{ "time": 2, "angle": 0 }
				]
			},
			"Lv2_L_41": {
				"rotate": [
					{
						"time": 0,
						"angle": 0,
						"curve": [ 0.25, 0, 0.75, 1 ]
					},
					{
						"time": 1,
						"angle": -7.4,
						"curve": [ 0.25, 0, 0.75, 1 ]
					},
					{ "time": 2, "angle": 0 }
				],
				"scale": [
					{
						"time": 0,
						"x": 1,
						"y": 1,
						"curve": [ 0.25, 0, 0.75, 1 ]
					},
					{
						"time": 1,
						"x": 1.036,
						"y": 1,
						"curve": [ 0.25, 0, 0.75, 1 ]
					},
					{ "time": 2, "x": 1, "y": 1 }
				]
			},
			"Lv2_R_41": {
				"rotate": [
					{
						"time": 0,
						"angle": 0,
						"curve": [ 0.25, 0, 0.75, 1 ]
					},
					{
						"time": 1,
						"angle": 5.05,
						"curve": [ 0.25, 0, 0.75, 1 ]
					},
					{ "time": 2, "angle": 0 }
				],
				"scale": [
					{
						"time": 0,
						"x": 1,
						"y": 1,
						"curve": [ 0.25, 0, 0.75, 1 ]
					},
					{
						"time": 1,
						"x": 1.029,
						"y": 1,
						"curve": [ 0.25, 0, 0.75, 1 ]
					},
					{ "time": 2, "x": 1, "y": 1 }
				]
			},
			"S8_13": {
				"scale": [
					{ "time": 0, "x": 0, "y": 0, "curve": "stepped" },
					{
						"time": 0.3333,
						"x": 0,
						"y": 0,
						"curve": [ 0.482, 0.03, 0.696, 1 ]
					},
					{ "time": 1.2, "x": 6.915, "y": 6.915, "curve": "stepped" },
					{ "time": 1.2333, "x": 6.915, "y": 6.915 },
					{ "time": 2, "x": 1, "y": 1 }
				]
			},
			"Lv3_01": {
				"rotate": [
					{ "time": 0, "angle": 0 },
					{ "time": 0.5, "angle": -179.95 },
					{ "time": 0.7667, "angle": -269.5 },
					{ "time": 1, "angle": 0 },
					{ "time": 1.5, "angle": -179.95 },
					{ "time": 1.7667, "angle": -269.5 },
					{ "time": 2, "angle": 0 }
				]
			},
			"Lv3_L_01": {
				"rotate": [
					{
						"time": 0,
						"angle": 0,
						"curve": [ 0.25, 0, 0.75, 1 ]
					},
					{
						"time": 1,
						"angle": -10.38,
						"curve": [ 0.25, 0, 0.75, 1 ]
					},
					{ "time": 2, "angle": 0 }
				],
				"translate": [
					{
						"time": 0,
						"x": 0,
						"y": 0,
						"curve": [ 0.25, 0, 0.75, 1 ]
					},
					{
						"time": 1,
						"x": -11.79,
						"y": 0.43,
						"curve": [ 0.25, 0, 0.75, 1 ]
					},
					{ "time": 2, "x": 0, "y": 0 }
				]
			},
			"Lv3_L_11": {
				"rotate": [
					{ "time": 0, "angle": 0 },
					{ "time": 0.5, "angle": -4.49 },
					{ "time": 1.5, "angle": 8.76 },
					{ "time": 2, "angle": 0 }
				]
			},
			"Lv3_R_01": {
				"rotate": [
					{
						"time": 0,
						"angle": 0,
						"curve": [ 0.25, 0, 0.75, 1 ]
					},
					{
						"time": 1,
						"angle": 10.42,
						"curve": [ 0.25, 0, 0.75, 1 ]
					},
					{ "time": 2, "angle": 0 }
				],
				"translate": [
					{
						"time": 0,
						"x": 0,
						"y": 0,
						"curve": [ 0.25, 0, 0.75, 1 ]
					},
					{
						"time": 1,
						"x": -11.88,
						"y": 2.7,
						"curve": [ 0.25, 0, 0.75, 1 ]
					},
					{ "time": 2, "x": 0, "y": 0 }
				]
			},
			"Lv3_R_11": {
				"rotate": [
					{ "time": 0, "angle": 0 },
					{ "time": 0.5, "angle": 3.58 },
					{ "time": 1.5, "angle": -9.49 },
					{ "time": 2, "angle": 0 }
				]
			},
			"Lv4_31": {
				"rotate": [
					{ "time": 0, "angle": 0 },
					{ "time": 0.5, "angle": -8.32 },
					{ "time": 1.5, "angle": 4.5 },
					{ "time": 2, "angle": 0 }
				],
				"translate": [
					{ "time": 0, "x": 0, "y": 0 },
					{ "time": 0.5, "x": -2.98, "y": 0 },
					{ "time": 1, "x": 3.97, "y": 1.19 },
					{ "time": 1.5, "x": 0.2, "y": 0 },
					{ "time": 2, "x": 0, "y": 0 }
				]
			},
			"Lv4_L_01": {
				"rotate": [
					{ "time": 0, "angle": 0 },
					{ "time": 0.5, "angle": 5.73 },
					{ "time": 1.5, "angle": -4.91 },
					{ "time": 2, "angle": 0 }
				]
			},
			"Lv4_R_01": {
				"rotate": [
					{ "time": 0, "angle": 0 },
					{ "time": 0.5, "angle": 352.37 },
					{ "time": 1.5, "angle": 5.98 },
					{ "time": 2, "angle": 0 }
				]
			}
		}
	},
	"Idle_2": {
		"bones": {
			"Lv4_31": {
				"rotate": [
					{ "time": 0, "angle": 0 },
					{ "time": 0.5, "angle": -8.32 },
					{ "time": 1.5, "angle": 4.5 },
					{ "time": 2, "angle": 0 }
				],
				"translate": [
					{ "time": 0, "x": 0, "y": 0 },
					{ "time": 0.5, "x": -2.98, "y": 0 },
					{ "time": 1, "x": 3.97, "y": 1.19 },
					{ "time": 1.5, "x": 0.2, "y": 0 },
					{ "time": 2, "x": 0, "y": 0 }
				]
			},
			"Lv4_L_01": {
				"rotate": [
					{ "time": 0, "angle": 0 },
					{ "time": 0.5, "angle": 5.73 },
					{ "time": 1.5, "angle": -4.91 },
					{ "time": 2, "angle": 0 }
				]
			},
			"Lv1_L_01": {
				"rotate": [
					{
						"time": 0,
						"angle": 0,
						"curve": [ 0.298, 0.45, 0.732, 1 ]
					},
					{
						"time": 0.5,
						"angle": -6.61,
						"curve": [ 0.25, 0, 0.75, 1 ]
					},
					{
						"time": 1.5,
						"angle": 6.04,
						"curve": [ 0.25, 0, 0.765, 0.67 ]
					},
					{ "time": 2, "angle": 0 }
				]
			},
			"Lv1_R_01": {
				"rotate": [
					{
						"time": 0,
						"angle": 0,
						"curve": [ 0.298, 0.45, 0.732, 1 ]
					},
					{
						"time": 0.5,
						"angle": 6.71,
						"curve": [ 0.25, 0, 0.75, 1 ]
					},
					{
						"time": 1.5,
						"angle": -4.6,
						"curve": [ 0.25, 0, 0.765, 0.67 ]
					},
					{ "time": 2, "angle": 0 }
				]
			},
			"Lv1_31": {
				"translate": [
					{
						"time": 0,
						"x": 0,
						"y": 0,
						"curve": [ 0.25, 0, 0.75, 1 ]
					},
					{
						"time": 1,
						"x": -3.24,
						"y": 0,
						"curve": [ 0.25, 0, 0.75, 1 ]
					},
					{ "time": 2, "x": 0, "y": 0 }
				]
			},
			"Lv2_L_01": {
				"scale": [
					{ "time": 0, "x": 1, "y": 1 },
					{ "time": 0.5, "x": 0.948, "y": 1 },
					{ "time": 1.5, "x": 1.046, "y": 1 },
					{ "time": 2, "x": 1, "y": 1 }
				]
			},
			"Lv2_R_01": {
				"scale": [
					{ "time": 0, "x": 1, "y": 1 },
					{ "time": 0.5, "x": 0.948, "y": 1 },
					{ "time": 1.5, "x": 1.046, "y": 1 },
					{ "time": 2, "x": 1, "y": 1 }
				]
			},
			"Lv3_R_01": {
				"rotate": [
					{
						"time": 0,
						"angle": 0,
						"curve": [ 0.25, 0, 0.75, 1 ]
					},
					{
						"time": 1,
						"angle": 10.42,
						"curve": [ 0.25, 0, 0.75, 1 ]
					},
					{ "time": 2, "angle": 0 }
				],
				"translate": [
					{
						"time": 0,
						"x": 0,
						"y": 0,
						"curve": [ 0.25, 0, 0.75, 1 ]
					},
					{
						"time": 1,
						"x": -11.88,
						"y": 2.7,
						"curve": [ 0.25, 0, 0.75, 1 ]
					},
					{ "time": 2, "x": 0, "y": 0 }
				]
			},
			"Lv2_L_31": {
				"rotate": [
					{ "time": 0, "angle": 0 },
					{ "time": 0.5, "angle": 5.21 },
					{ "time": 1.5, "angle": -4.86 },
					{ "time": 2, "angle": 0 }
				]
			},
			"Lv3_R_11": {
				"rotate": [
					{ "time": 0, "angle": 0 },
					{ "time": 0.5, "angle": 3.58 },
					{ "time": 1.5, "angle": -9.49 },
					{ "time": 2, "angle": 0 }
				]
			},
			"Lv2_R_31": {
				"rotate": [
					{ "time": 0, "angle": 0 },
					{ "time": 0.5, "angle": -3.25 },
					{ "time": 1.5, "angle": 5.38 },
					{ "time": 2, "angle": 0 }
				]
			},
			"Lv2_L_41": {
				"rotate": [
					{
						"time": 0,
						"angle": 0,
						"curve": [ 0.25, 0, 0.75, 1 ]
					},
					{
						"time": 1,
						"angle": -7.4,
						"curve": [ 0.25, 0, 0.75, 1 ]
					},
					{ "time": 2, "angle": 0 }
				],
				"scale": [
					{
						"time": 0,
						"x": 1,
						"y": 1,
						"curve": [ 0.25, 0, 0.75, 1 ]
					},
					{
						"time": 1,
						"x": 1.036,
						"y": 1,
						"curve": [ 0.25, 0, 0.75, 1 ]
					},
					{ "time": 2, "x": 1, "y": 1 }
				]
			},
			"Lv2_R_41": {
				"rotate": [
					{
						"time": 0,
						"angle": 0,
						"curve": [ 0.25, 0, 0.75, 1 ]
					},
					{
						"time": 1,
						"angle": 5.05,
						"curve": [ 0.25, 0, 0.75, 1 ]
					},
					{ "time": 2, "angle": 0 }
				],
				"scale": [
					{
						"time": 0,
						"x": 1,
						"y": 1,
						"curve": [ 0.25, 0, 0.75, 1 ]
					},
					{
						"time": 1,
						"x": 1.029,
						"y": 1,
						"curve": [ 0.25, 0, 0.75, 1 ]
					},
					{ "time": 2, "x": 1, "y": 1 }
				]
			},
			"S8_13": {
				"scale": [
					{ "time": 0, "x": 0, "y": 0, "curve": "stepped" },
					{
						"time": 0.3333,
						"x": 0,
						"y": 0,
						"curve": [ 0.482, 0.03, 0.696, 1 ]
					},
					{ "time": 1.2, "x": 6.915, "y": 6.915, "curve": "stepped" },
					{ "time": 1.2333, "x": 6.915, "y": 6.915 },
					{ "time": 2, "x": 1, "y": 1 }
				]
			},
			"Lv3_01": {
				"rotate": [
					{ "time": 0, "angle": 0 },
					{ "time": 0.5, "angle": -179.95 },
					{ "time": 0.7667, "angle": -269.5 },
					{ "time": 1, "angle": 0 },
					{ "time": 1.5, "angle": -179.95 },
					{ "time": 1.7667, "angle": -269.5 },
					{ "time": 2, "angle": 0 }
				]
			},
			"Lv3_L_01": {
				"rotate": [
					{
						"time": 0,
						"angle": 0,
						"curve": [ 0.25, 0, 0.75, 1 ]
					},
					{
						"time": 1,
						"angle": -10.38,
						"curve": [ 0.25, 0, 0.75, 1 ]
					},
					{ "time": 2, "angle": 0 }
				],
				"translate": [
					{
						"time": 0,
						"x": 0,
						"y": 0,
						"curve": [ 0.25, 0, 0.75, 1 ]
					},
					{
						"time": 1,
						"x": -11.79,
						"y": 0.43,
						"curve": [ 0.25, 0, 0.75, 1 ]
					},
					{ "time": 2, "x": 0, "y": 0 }
				]
			},
			"Lv3_L_11": {
				"rotate": [
					{ "time": 0, "angle": 0 },
					{ "time": 0.5, "angle": -4.49 },
					{ "time": 1.5, "angle": 8.76 },
					{ "time": 2, "angle": 0 }
				]
			},
			"Lv4_R_01": {
				"rotate": [
					{ "time": 0, "angle": 0 },
					{ "time": 0.5, "angle": 352.37 },
					{ "time": 1.5, "angle": 5.98 },
					{ "time": 2, "angle": 0 }
				]
			}
		}
	},
	"Up_Lv1": {
		"slots": {
			"Lv1_31": {
				"attachment": [
					{ "time": 0, "name": null },
					{ "time": 0.2, "name": "Lv1_31" }
				]
			},
			"Lv1_L_01": {
				"attachment": [
					{ "time": 0, "name": null },
					{ "time": 0.1333, "name": "Lv1_L_01" }
				]
			},
			"Lv1_R_01": {
				"attachment": [
					{ "time": 0, "name": null },
					{ "time": 0.1333, "name": "Lv1_R_01" }
				]
			},
			"Lv1_R_31": {
				"attachment": [
					{ "time": 0, "name": null },
					{ "time": 0.2, "name": "Lv1_R_31" }
				]
			},
			"Lv2_L_01": {
				"attachment": [
					{ "time": 0, "name": null }
				]
			},
			"Lv2_L_31": {
				"attachment": [
					{ "time": 0, "name": null }
				]
			},
			"Lv2_L_41": {
				"attachment": [
					{ "time": 0, "name": null }
				]
			},
			"Lv2_R_01": {
				"attachment": [
					{ "time": 0, "name": null }
				]
			},
			"Lv2_R_31": {
				"attachment": [
					{ "time": 0, "name": null }
				]
			},
			"Lv2_R_41": {
				"attachment": [
					{ "time": 0, "name": null }
				]
			},
			"Lv3_01": {
				"attachment": [
					{ "time": 0, "name": null }
				]
			},
			"Lv3_L_01": {
				"attachment": [
					{ "time": 0, "name": null }
				]
			},
			"Lv3_L_11": {
				"attachment": [
					{ "time": 0, "name": null }
				]
			},
			"Lv3_R_01": {
				"attachment": [
					{ "time": 0, "name": null }
				]
			},
			"Lv3_R_11": {
				"attachment": [
					{ "time": 0, "name": null }
				]
			},
			"Lv4_01": {
				"attachment": [
					{ "time": 0, "name": null }
				]
			},
			"Lv4_31": {
				"attachment": [
					{ "time": 0, "name": null }
				]
			},
			"Lv4_L_01": {
				"attachment": [
					{ "time": 0, "name": null }
				]
			},
			"Lv4_R_01": {
				"attachment": [
					{ "time": 0, "name": null }
				]
			}
		},
		"bones": {
			"S8_11": {
				"translate": [
					{ "time": 0, "x": 0, "y": 0 },
					{ "time": 0.2, "x": 10.68, "y": 0 },
					{ "time": 0.2667, "x": 2.31, "y": 0 },
					{ "time": 0.3333, "x": 7.97, "y": 0 },
					{ "time": 0.4, "x": -0.03, "y": 1.78 },
					{ "time": 0.4667, "x": 4.44, "y": -2.67 },
					{ "time": 0.5333, "x": 2.67, "y": 5.34 },
					{ "time": 0.6, "x": 2, "y": 1.34 },
					{ "time": 0.6667, "x": 4.89, "y": 0.89 },
					{ "time": 0.8, "x": 0, "y": 0 }
				]
			},
			"Lv1_L_01": {
				"rotate": [
					{ "time": 0, "angle": 0 },
					{ "time": 0.1333, "angle": -27.82 },
					{ "time": 0.5333, "angle": 0 }
				],
				"translate": [
					{ "time": 0, "x": 0, "y": 0 },
					{ "time": 0.1333, "x": 13.42, "y": -28.76 },
					{ "time": 0.5333, "x": 0, "y": 0 }
				],
				"scale": [
					{ "time": 0, "x": 1, "y": 1 },
					{ "time": 0.1333, "x": 0.6, "y": 0.6 },
					{ "time": 0.5333, "x": 1, "y": 1 }
				]
			},
			"Lv1_R_01": {
				"rotate": [
					{ "time": 0, "angle": 0 },
					{ "time": 0.1333, "angle": 26.54 },
					{ "time": 0.5333, "angle": 0 }
				],
				"translate": [
					{ "time": 0, "x": 0, "y": 0 },
					{ "time": 0.1333, "x": 12.47, "y": 26.11 },
					{ "time": 0.5333, "x": 0, "y": 0 }
				],
				"scale": [
					{ "time": 0, "x": 1, "y": 1 },
					{ "time": 0.1333, "x": 0.6, "y": 0.6 },
					{ "time": 0.5333, "x": 1, "y": 1 }
				]
			},
			"Lv1_31": {
				"translate": [
					{ "time": 0, "x": 0, "y": 0 },
					{ "time": 0.2, "x": 25.08, "y": 0 },
					{ "time": 0.5333, "x": 0, "y": 0 }
				]
			}
		}
	},
	"Up_Lv2": {
		"slots": {
			"Lv2_L_01": {
				"attachment": [
					{ "time": 0, "name": null },
					{ "time": 0.2, "name": "Lv2_L_01" }
				]
			},
			"Lv2_L_31": {
				"attachment": [
					{ "time": 0, "name": null },
					{ "time": 0.4, "name": "Lv2_L_31" }
				]
			},
			"Lv2_L_41": {
				"attachment": [
					{ "time": 0, "name": null },
					{ "time": 0.2667, "name": "Lv2_L_41" }
				]
			},
			"Lv2_R_01": {
				"attachment": [
					{ "time": 0, "name": null },
					{ "time": 0.2, "name": "Lv2_R_01" }
				]
			},
			"Lv2_R_31": {
				"attachment": [
					{ "time": 0, "name": null },
					{ "time": 0.4, "name": "Lv2_R_31" }
				]
			},
			"Lv2_R_41": {
				"attachment": [
					{ "time": 0, "name": null },
					{ "time": 0.2667, "name": "Lv2_R_41" }
				]
			},
			"Lv3_01": {
				"attachment": [
					{ "time": 0, "name": null }
				]
			},
			"Lv3_L_01": {
				"attachment": [
					{ "time": 0, "name": null }
				]
			},
			"Lv3_L_11": {
				"attachment": [
					{ "time": 0, "name": null }
				]
			},
			"Lv3_R_01": {
				"attachment": [
					{ "time": 0, "name": null }
				]
			},
			"Lv3_R_11": {
				"attachment": [
					{ "time": 0, "name": null }
				]
			},
			"Lv4_01": {
				"attachment": [
					{ "time": 0, "name": null }
				]
			},
			"Lv4_31": {
				"attachment": [
					{ "time": 0, "name": null }
				]
			},
			"Lv4_L_01": {
				"attachment": [
					{ "time": 0, "name": null }
				]
			},
			"Lv4_R_01": {
				"attachment": [
					{ "time": 0, "name": null }
				]
			}
		},
		"bones": {
			"S8_11": {
				"translate": [
					{ "time": 0, "x": 0, "y": 0 },
					{ "time": 0.2, "x": 10.68, "y": 0 },
					{ "time": 0.2667, "x": 2.31, "y": 0 },
					{ "time": 0.3333, "x": -2.32, "y": 0 },
					{ "time": 0.4, "x": -0.03, "y": 1.78 },
					{ "time": 0.4667, "x": 4.44, "y": -2.67 },
					{ "time": 0.5333, "x": 15.89, "y": 5.34 },
					{ "time": 0.6, "x": -6.81, "y": 1.34 },
					{ "time": 0.6667, "x": 21.05, "y": 0.89 },
					{ "time": 0.8, "x": 0, "y": 0 }
				]
			},
			"Lv1_L_01": {
				"rotate": [
					{ "time": 0, "angle": 0 },
					{ "time": 0.2, "angle": -4.61 },
					{ "time": 0.5333, "angle": 0 }
				],
				"translate": [
					{ "time": 0, "x": 0, "y": 0 },
					{ "time": 0.2, "x": 1.97, "y": -7.23 },
					{ "time": 0.5333, "x": 0, "y": 0 }
				]
			},
			"Lv1_R_01": {
				"rotate": [
					{ "time": 0, "angle": 0 },
					{ "time": 0.2, "angle": 6.3 },
					{ "time": 0.5333, "angle": 0 }
				],
				"translate": [
					{ "time": 0, "x": 0, "y": 0 },
					{ "time": 0.2, "x": 2.63, "y": 7.88 },
					{ "time": 0.5333, "x": 0, "y": 0 }
				]
			},
			"Lv1_31": {
				"translate": [
					{ "time": 0, "x": 0, "y": 0 },
					{ "time": 0.2, "x": 25.08, "y": 0 },
					{ "time": 0.5333, "x": 0, "y": 0 }
				]
			},
			"Lv2_L_31": {
				"translate": [
					{ "time": 0, "x": 0, "y": 0 },
					{ "time": 0.4, "x": -22.34, "y": 0.61 },
					{ "time": 0.5333, "x": 0, "y": 0 }
				],
				"scale": [
					{ "time": 0, "x": 1, "y": 1 },
					{ "time": 0.4, "x": 0.901, "y": 1 },
					{ "time": 0.5333, "x": 1, "y": 1 }
				]
			},
			"Lv2_R_31": {
				"rotate": [
					{ "time": 0, "angle": 0 },
					{ "time": 0.4, "angle": -1.78 },
					{ "time": 0.5333, "angle": 0 }
				],
				"translate": [
					{ "time": 0, "x": 0, "y": 0 },
					{ "time": 0.4, "x": -25.64, "y": 0.5 },
					{ "time": 0.5333, "x": 0, "y": 0 }
				],
				"scale": [
					{ "time": 0, "x": 1, "y": 1 },
					{ "time": 0.4, "x": 0.902, "y": 1 },
					{ "time": 0.5333, "x": 1, "y": 1 }
				]
			},
			"Lv2_L_41": {
				"rotate": [
					{
						"time": 0.2667,
						"angle": 0,
						"curve": [ 0.232, 0.3, 0.75, 1 ]
					},
					{
						"time": 0.6667,
						"angle": -5.33,
						"curve": [ 0.25, 0, 0.631, 0.51 ]
					},
					{ "time": 0.8, "angle": 0 }
				],
				"scale": [
					{ "time": 0, "x": 1, "y": 1 },
					{
						"time": 0.2667,
						"x": 0.535,
						"y": 0.535,
						"curve": [ 0.232, 0.3, 0.75, 1 ]
					},
					{
						"time": 0.6667,
						"x": 1.042,
						"y": 1,
						"curve": [ 0.25, 0, 0.631, 0.51 ]
					},
					{ "time": 0.8, "x": 1, "y": 1 }
				]
			},
			"Lv2_R_41": {
				"rotate": [
					{
						"time": 0.2667,
						"angle": 0,
						"curve": [ 0.232, 0.3, 0.75, 1 ]
					},
					{
						"time": 0.6667,
						"angle": 5.63,
						"curve": [ 0.25, 0, 0.631, 0.51 ]
					},
					{ "time": 0.8, "angle": 0 }
				],
				"scale": [
					{ "time": 0, "x": 1, "y": 1 },
					{
						"time": 0.2667,
						"x": 0.53,
						"y": 0.53,
						"curve": [ 0.232, 0.3, 0.75, 1 ]
					},
					{
						"time": 0.6667,
						"x": 1.042,
						"y": 1,
						"curve": [ 0.25, 0, 0.631, 0.51 ]
					},
					{ "time": 0.8, "x": 1, "y": 1 }
				]
			}
		}
	},
	"Up_Lv3": {
		"slots": {
			"Lv3_01": {
				"color": [
					{ "time": 0, "color": "ffffff00" },
					{ "time": 0.0667, "color": "59ab6d9d" },
					{ "time": 0.1333, "color": "e5ed86dd" },
					{ "time": 0.2, "color": "f9d0c5ff" },
					{ "time": 0.2667, "color": "ffffffff" }
				],
				"attachment": [
					{ "time": 0.5333, "name": null },
					{ "time": 0.8, "name": "Lv3_01" }
				]
			},
			"Lv3_L_01": {
				"attachment": [
					{ "time": 0, "name": null }
				]
			},
			"Lv3_L_11": {
				"attachment": [
					{ "time": 0, "name": null }
				]
			},
			"Lv3_R_01": {
				"attachment": [
					{ "time": 0, "name": null }
				]
			},
			"Lv3_R_11": {
				"attachment": [
					{ "time": 0, "name": null }
				]
			},
			"Lv4_01": {
				"attachment": [
					{ "time": 0, "name": null }
				]
			},
			"Lv4_31": {
				"attachment": [
					{ "time": 0, "name": null }
				]
			},
			"Lv4_L_01": {
				"attachment": [
					{ "time": 0, "name": null }
				]
			},
			"Lv4_R_01": {
				"attachment": [
					{ "time": 0, "name": null }
				]
			}
		},
		"bones": {
			"S8_11": {
				"translate": [
					{ "time": 0, "x": 0, "y": 0 },
					{ "time": 0.2, "x": 10.68, "y": 0 },
					{ "time": 0.2667, "x": 2.31, "y": 0 },
					{ "time": 0.3333, "x": -2.32, "y": 0 },
					{ "time": 0.4, "x": -0.03, "y": 1.78 },
					{ "time": 0.4667, "x": 4.44, "y": -2.67 },
					{ "time": 0.5333, "x": 15.89, "y": 5.34 },
					{ "time": 0.6, "x": -6.81, "y": 1.34 },
					{ "time": 0.6667, "x": 21.05, "y": 0.89 },
					{ "time": 0.8, "x": 0, "y": 0 }
				]
			},
			"Lv1_L_01": {
				"rotate": [
					{ "time": 0, "angle": 0 },
					{ "time": 0.2, "angle": 3.1 },
					{ "time": 0.5333, "angle": 0 }
				],
				"translate": [
					{ "time": 0, "x": 0, "y": 0 },
					{ "time": 0.2, "x": -10.12, "y": 0.59 },
					{ "time": 0.5333, "x": 0, "y": 0 }
				]
			},
			"Lv1_R_01": {
				"rotate": [
					{ "time": 0, "angle": 0 },
					{ "time": 0.2, "angle": -6.97 },
					{ "time": 0.5333, "angle": 0 }
				],
				"translate": [
					{ "time": 0, "x": 0, "y": 0 },
					{ "time": 0.2, "x": -5.9, "y": -4.2 },
					{ "time": 0.5333, "x": 0, "y": 0 }
				]
			},
			"Lv1_31": {
				"translate": [
					{ "time": 0, "x": 0, "y": 0 },
					{ "time": 0.4, "x": 8.95, "y": 0 },
					{ "time": 0.8, "x": 0, "y": 0 }
				]
			},
			"Lv2_L_41": {
				"rotate": [
					{ "time": 0, "angle": 0 },
					{ "time": 0.3333, "angle": -3.29 },
					{ "time": 0.8, "angle": 0 }
				]
			},
			"Lv2_R_41": {
				"rotate": [
					{ "time": 0, "angle": 0 },
					{ "time": 0.3333, "angle": 3.74 },
					{ "time": 0.8, "angle": 0 }
				]
			},
			"Lv3_01": {
				"rotate": [
					{ "time": 0, "angle": 0 },
					{ "time": 0.4, "angle": -179.95 },
					{ "time": 0.6, "angle": -269.5 },
					{ "time": 0.8, "angle": 0 }
				]
			}
		}
	},
	"Up_Lv4": {
		"slots": {
			"Lv3_01": {
				"color": [
					{ "time": 0, "color": "ffffff00" },
					{ "time": 0.0667, "color": "59ab6d9d" },
					{ "time": 0.1333, "color": "e5ed86dd" },
					{ "time": 0.2, "color": "f9d0c5ff" },
					{ "time": 0.2667, "color": "ffffffff" }
				],
				"attachment": [
					{ "time": 0.5333, "name": null },
					{ "time": 0.8, "name": "Lv3_01" }
				]
			},
			"Lv3_L_01": {
				"attachment": [
					{ "time": 0, "name": null }
				]
			},
			"Lv3_L_11": {
				"attachment": [
					{ "time": 0, "name": null }
				]
			},
			"Lv3_R_01": {
				"attachment": [
					{ "time": 0, "name": null }
				]
			},
			"Lv3_R_11": {
				"attachment": [
					{ "time": 0, "name": null }
				]
			},
			"Lv4_01": {
				"attachment": [
					{ "time": 0, "name": null },
					{ "time": 0.8, "name": "Lv4_01" }
				]
			},
			"Lv4_31": {
				"attachment": [
					{ "time": 0, "name": null }
				]
			},
			"Lv4_L_01": {
				"attachment": [
					{ "time": 0, "name": null },
					{ "time": 0.2667, "name": "Lv4_L_01" }
				]
			},
			"Lv4_R_01": {
				"attachment": [
					{ "time": 0, "name": null },
					{ "time": 0.2667, "name": "Lv4_R_01" }
				]
			}
		},
		"bones": {
			"S8_11": {
				"translate": [
					{ "time": 0, "x": 0, "y": 0 },
					{ "time": 0.2, "x": 10.68, "y": 0 },
					{ "time": 0.2667, "x": 2.31, "y": 0 },
					{ "time": 0.3333, "x": -2.32, "y": 0 },
					{ "time": 0.4, "x": -0.03, "y": 1.78 },
					{ "time": 0.4667, "x": 4.44, "y": -2.67 },
					{ "time": 0.5333, "x": 15.89, "y": 5.34 },
					{ "time": 0.6, "x": -6.81, "y": 1.34 },
					{ "time": 0.6667, "x": 21.05, "y": 0.89 },
					{ "time": 0.8, "x": 0, "y": 0 }
				]
			},
			"Lv1_L_01": {
				"rotate": [
					{ "time": 0, "angle": 0 },
					{ "time": 0.2, "angle": 3.1 },
					{ "time": 0.5333, "angle": 0 }
				],
				"translate": [
					{ "time": 0, "x": 0, "y": 0 },
					{ "time": 0.2, "x": -10.12, "y": 0.59 },
					{ "time": 0.5333, "x": 0, "y": 0 }
				]
			},
			"Lv1_R_01": {
				"rotate": [
					{ "time": 0, "angle": 0 },
					{ "time": 0.2, "angle": -6.97 },
					{ "time": 0.5333, "angle": 0 }
				],
				"translate": [
					{ "time": 0, "x": 0, "y": 0 },
					{ "time": 0.2, "x": -5.9, "y": -4.2 },
					{ "time": 0.5333, "x": 0, "y": 0 }
				]
			},
			"Lv1_31": {
				"translate": [
					{ "time": 0, "x": 0, "y": 0 },
					{ "time": 0.4, "x": 8.95, "y": 0 },
					{ "time": 0.8, "x": 0, "y": 0 }
				]
			},
			"Lv2_L_41": {
				"rotate": [
					{ "time": 0, "angle": 0 },
					{ "time": 0.3333, "angle": -3.29 },
					{ "time": 0.8, "angle": 0 }
				]
			},
			"Lv2_R_41": {
				"rotate": [
					{ "time": 0, "angle": 0 },
					{ "time": 0.3333, "angle": 3.74 },
					{ "time": 0.8, "angle": 0 }
				]
			},
			"Lv3_01": {
				"rotate": [
					{ "time": 0, "angle": 0 },
					{ "time": 0.4, "angle": -179.95 },
					{ "time": 0.6, "angle": -269.5 },
					{ "time": 0.8, "angle": 0 }
				]
			},
			"Lv4_L_01": {
				"rotate": [
					{ "time": 0, "angle": 0 },
					{ "time": 0.2667, "angle": 4.93 },
					{ "time": 0.5333, "angle": 0 }
				],
				"translate": [
					{ "time": 0, "x": 0, "y": 0 },
					{ "time": 0.2667, "x": 16.21, "y": -3.57 },
					{ "time": 0.5333, "x": 0, "y": 0 }
				]
			},
			"Lv4_R_01": {
				"rotate": [
					{ "time": 0, "angle": 0 },
					{ "time": 0.2667, "angle": 351.61 },
					{ "time": 0.5333, "angle": 0 }
				],
				"translate": [
					{ "time": 0, "x": 0, "y": 0 },
					{ "time": 0.2667, "x": 19.51, "y": 0.88 },
					{ "time": 0.5333, "x": 0, "y": 0 }
				]
			}
		}
	}
}
}