%YAML 1.1
%TAG !u! tag:unity3d.com,2011:
--- !u!114 &11400000
MonoBehaviour:
  m_ObjectHideFlags: 0
  m_CorrespondingSourceObject: {fileID: 0}
  m_PrefabInstance: {fileID: 0}
  m_PrefabAsset: {fileID: 0}
  m_GameObject: {fileID: 0}
  m_Enabled: 1
  m_EditorHideFlags: 0
  m_Script: {fileID: 11500000, guid: f3e497dea0c7623428e0a8823f6b5ae7, type: 3}
  m_Name: BulletLevelsPosition 4
  m_EditorClassIdentifier: 
  BulletLvlByRank:
  - LvlPosInfors:
    - Infors:
      - Offset: {x: 0, y: 0, z: 0}
        Angle: {x: 0, y: 0, z: 0}
        DamScale: 1
        SizeScale: 1
        SpeedBullet: 9
        BulletIcon: {fileID: 0}
      FireRate: 0.5
    - Infors:
      - Offset: {x: 0.25, y: 0, z: 0}
        Angle: {x: 0, y: 0, z: 0}
        DamScale: 1
        SizeScale: 1
        SpeedBullet: 9
        BulletIcon: {fileID: 0}
      - Offset: {x: -0.25, y: 0, z: 0}
        Angle: {x: 0, y: 0, z: 0}
        DamScale: 1
        SizeScale: 1
        SpeedBullet: 9
        BulletIcon: {fileID: 0}
      FireRate: 0.5
    - Infors:
      - Offset: {x: 0.25, y: 0, z: 0}
        Angle: {x: 0, y: 0, z: 0}
        DamScale: 1
        SizeScale: 1
        SpeedBullet: 9
        BulletIcon: {fileID: 0}
      - Offset: {x: -0.25, y: 0, z: 0}
        Angle: {x: 0, y: 0, z: 0}
        DamScale: 1
        SizeScale: 1
        SpeedBullet: 9
        BulletIcon: {fileID: 0}
      - Offset: {x: 0, y: 0.25, z: 0}
        Angle: {x: 0, y: 0, z: 0}
        DamScale: 1
        SizeScale: 1
        SpeedBullet: 9
        BulletIcon: {fileID: 0}
      FireRate: 0.5
    - Infors:
      - Offset: {x: 0.5, y: 0, z: 0}
        Angle: {x: 0, y: 0, z: 0}
        DamScale: 1
        SizeScale: 1
        SpeedBullet: 9
        BulletIcon: {fileID: 0}
      - Offset: {x: -0.5, y: 0, z: 0}
        Angle: {x: 0, y: 0, z: 0}
        DamScale: 1
        SizeScale: 1
        SpeedBullet: 9
        BulletIcon: {fileID: 0}
      - Offset: {x: 0.25, y: 0.25, z: 0}
        Angle: {x: 0, y: 0, z: 0}
        DamScale: 1
        SizeScale: 1
        SpeedBullet: 9
        BulletIcon: {fileID: 0}
      - Offset: {x: -0.25, y: 0.25, z: 0}
        Angle: {x: 0, y: 0, z: 0}
        DamScale: 1
        SizeScale: 1
        SpeedBullet: 9
        BulletIcon: {fileID: 0}
      FireRate: 0.5
    - Infors:
      - Offset: {x: 0.5, y: 0, z: 0}
        Angle: {x: 0, y: 0, z: 0}
        DamScale: 1
        SizeScale: 1
        SpeedBullet: 9
        BulletIcon: {fileID: 0}
      - Offset: {x: -0.5, y: 0, z: 0}
        Angle: {x: 0, y: 0, z: 0}
        DamScale: 1
        SizeScale: 1
        SpeedBullet: 9
        BulletIcon: {fileID: 0}
      - Offset: {x: 0.25, y: 0.25, z: 0}
        Angle: {x: 0, y: 0, z: 0}
        DamScale: 1
        SizeScale: 1
        SpeedBullet: 9
        BulletIcon: {fileID: 0}
      - Offset: {x: -0.25, y: 0.25, z: 0}
        Angle: {x: 0, y: 0, z: 0}
        DamScale: 1
        SizeScale: 1
        SpeedBullet: 9
        BulletIcon: {fileID: 0}
      FireRate: 0.45
    - Infors:
      - Offset: {x: 0.3, y: 0, z: 0}
        Angle: {x: 0, y: 0, z: 0}
        DamScale: 1
        SizeScale: 1
        SpeedBullet: 9
        BulletIcon: {fileID: 0}
      - Offset: {x: -0.3, y: 0, z: 0}
        Angle: {x: 0, y: 0, z: 0}
        DamScale: 1
        SizeScale: 1
        SpeedBullet: 9
        BulletIcon: {fileID: 0}
      - Offset: {x: 0.6, y: 0, z: 0}
        Angle: {x: 0, y: 0, z: 0}
        DamScale: 1
        SizeScale: 1
        SpeedBullet: 9
        BulletIcon: {fileID: 0}
      - Offset: {x: -0.6, y: 0, z: 0}
        Angle: {x: 0, y: 0, z: 0}
        DamScale: 1
        SizeScale: 1
        SpeedBullet: 9
        BulletIcon: {fileID: 0}
      - Offset: {x: 0, y: 0.25, z: 0}
        Angle: {x: 0, y: 0, z: 0}
        DamScale: 1
        SizeScale: 1
        SpeedBullet: 9
        BulletIcon: {fileID: 0}
      FireRate: 0.45
    - Infors:
      - Offset: {x: 0.3, y: 0.1, z: 0}
        Angle: {x: 0, y: 0, z: 0}
        DamScale: 1
        SizeScale: 1
        SpeedBullet: 9
        BulletIcon: {fileID: 0}
      - Offset: {x: -0.3, y: 0.1, z: 0}
        Angle: {x: 0, y: 0, z: 0}
        DamScale: 1
        SizeScale: 1
        SpeedBullet: 9
        BulletIcon: {fileID: 0}
      - Offset: {x: 0.6, y: 0, z: 0}
        Angle: {x: 0, y: 0, z: 0}
        DamScale: 1
        SizeScale: 1
        SpeedBullet: 9
        BulletIcon: {fileID: 0}
      - Offset: {x: -0.6, y: 0, z: 0}
        Angle: {x: 0, y: 0, z: 0}
        DamScale: 1
        SizeScale: 1
        SpeedBullet: 9
        BulletIcon: {fileID: 0}
      - Offset: {x: 0, y: 0.25, z: 0}
        Angle: {x: 0, y: 0, z: 0}
        DamScale: 1
        SizeScale: 1
        SpeedBullet: 9
        BulletIcon: {fileID: 0}
      FireRate: 0.4
    - Infors:
      - Offset: {x: 0.9, y: -0.5, z: 0}
        Angle: {x: 0, y: 0, z: 0}
        DamScale: 1
        SizeScale: 1
        SpeedBullet: 9
        BulletIcon: {fileID: 0}
      - Offset: {x: -0.9, y: -0.5, z: 0}
        Angle: {x: 0, y: 0, z: 0}
        DamScale: 1
        SizeScale: 1
        SpeedBullet: 9
        BulletIcon: {fileID: 0}
      - Offset: {x: 0.5, y: 0, z: 0}
        Angle: {x: 0, y: 0, z: 0}
        DamScale: 1
        SizeScale: 1
        SpeedBullet: 9
        BulletIcon: {fileID: 0}
      - Offset: {x: -0.5, y: 0, z: 0}
        Angle: {x: 0, y: 0, z: 0}
        DamScale: 1
        SizeScale: 1
        SpeedBullet: 9
        BulletIcon: {fileID: 0}
      - Offset: {x: 0.2, y: 0.2, z: 0}
        Angle: {x: 0, y: 0, z: 0}
        DamScale: 1
        SizeScale: 1
        SpeedBullet: 9
        BulletIcon: {fileID: 0}
      - Offset: {x: -0.2, y: 0.2, z: 0}
        Angle: {x: 0, y: 0, z: 0}
        DamScale: 1
        SizeScale: 1
        SpeedBullet: 9
        BulletIcon: {fileID: 0}
      FireRate: 0.4
    - Infors:
      - Offset: {x: 0.9, y: -0.5, z: 0}
        Angle: {x: 0, y: 0, z: 0}
        DamScale: 1
        SizeScale: 1
        SpeedBullet: 9
        BulletIcon: {fileID: 0}
      - Offset: {x: -0.9, y: -0.5, z: 0}
        Angle: {x: 0, y: 0, z: 0}
        DamScale: 1
        SizeScale: 1
        SpeedBullet: 9
        BulletIcon: {fileID: 0}
      - Offset: {x: 0.5, y: 0, z: 0}
        Angle: {x: 0, y: 0, z: 0}
        DamScale: 1
        SizeScale: 1
        SpeedBullet: 9
        BulletIcon: {fileID: 0}
      - Offset: {x: -0.5, y: 0, z: 0}
        Angle: {x: 0, y: 0, z: 0}
        DamScale: 1
        SizeScale: 1
        SpeedBullet: 9
        BulletIcon: {fileID: 0}
      - Offset: {x: 0.2, y: 0.2, z: 0}
        Angle: {x: 0, y: 0, z: 0}
        DamScale: 1
        SizeScale: 1
        SpeedBullet: 9
        BulletIcon: {fileID: 0}
      - Offset: {x: -0.2, y: 0.2, z: 0}
        Angle: {x: 0, y: 0, z: 0}
        DamScale: 1
        SizeScale: 1
        SpeedBullet: 9
        BulletIcon: {fileID: 0}
      FireRate: 0.35
    - Infors:
      - Offset: {x: -0.9, y: -0.5, z: 0}
        Angle: {x: 0, y: 0, z: 0}
        DamScale: 1
        SizeScale: 1
        SpeedBullet: 9
        BulletIcon: {fileID: 0}
      - Offset: {x: 0.9, y: -0.5, z: 0}
        Angle: {x: 0, y: 0, z: 0}
        DamScale: 1
        SizeScale: 1
        SpeedBullet: 9
        BulletIcon: {fileID: 0}
      - Offset: {x: 0.5, y: 0, z: 0}
        Angle: {x: 0, y: 0, z: 0}
        DamScale: 1
        SizeScale: 1
        SpeedBullet: 9
        BulletIcon: {fileID: 0}
      - Offset: {x: -0.5, y: 0, z: 0}
        Angle: {x: 0, y: 0, z: 0}
        DamScale: 1
        SizeScale: 1
        SpeedBullet: 9
        BulletIcon: {fileID: 0}
      - Offset: {x: 0.2, y: 0.2, z: 0}
        Angle: {x: 0, y: 0, z: 0}
        DamScale: 1
        SizeScale: 1
        SpeedBullet: 9
        BulletIcon: {fileID: 0}
      - Offset: {x: -0.2, y: 0.2, z: 0}
        Angle: {x: 0, y: 0, z: 0}
        DamScale: 1
        SizeScale: 1
        SpeedBullet: 9
        BulletIcon: {fileID: 0}
      FireRate: 0.3
    - Infors:
      - Offset: {x: -0.9, y: -0.5, z: 0}
        Angle: {x: 0, y: 0, z: 0}
        DamScale: 1
        SizeScale: 1
        SpeedBullet: 10
        BulletIcon: {fileID: 0}
      - Offset: {x: 0.9, y: -0.5, z: 0}
        Angle: {x: 0, y: 0, z: 0}
        DamScale: 1
        SizeScale: 1
        SpeedBullet: 10
        BulletIcon: {fileID: 0}
      - Offset: {x: 0.5, y: 0, z: 0}
        Angle: {x: 0, y: 0, z: 0}
        DamScale: 1
        SizeScale: 1
        SpeedBullet: 9
        BulletIcon: {fileID: 0}
      - Offset: {x: -0.5, y: 0, z: 0}
        Angle: {x: 0, y: 0, z: 0}
        DamScale: 1
        SizeScale: 1
        SpeedBullet: 10
        BulletIcon: {fileID: 0}
      - Offset: {x: 0.2, y: 0.2, z: 0}
        Angle: {x: 0, y: 0, z: 0}
        DamScale: 1
        SizeScale: 1
        SpeedBullet: 10
        BulletIcon: {fileID: 0}
      - Offset: {x: -0.2, y: 0.2, z: 0}
        Angle: {x: 0, y: 0, z: 0}
        DamScale: 1
        SizeScale: 1
        SpeedBullet: 10
        BulletIcon: {fileID: 0}
      FireRate: 0.07
    IsChangeSuper: 0
    IsChangeBulletStyle: 0
    SuperTime: 0
  - LvlPosInfors:
    - Infors:
      - Offset: {x: 0, y: 0, z: 0}
        Angle: {x: 0, y: 0, z: 0}
        DamScale: 1
        SizeScale: 1
        SpeedBullet: 9
        BulletIcon: {fileID: 0}
      FireRate: 0.5
    - Infors:
      - Offset: {x: 0.25, y: 0, z: 0}
        Angle: {x: 0, y: 0, z: 0}
        DamScale: 1
        SizeScale: 1
        SpeedBullet: 9
        BulletIcon: {fileID: 0}
      - Offset: {x: -0.25, y: 0, z: 0}
        Angle: {x: 0, y: 0, z: 0}
        DamScale: 1
        SizeScale: 1
        SpeedBullet: 9
        BulletIcon: {fileID: 0}
      FireRate: 0.5
    - Infors:
      - Offset: {x: 0.25, y: 0, z: 0}
        Angle: {x: 0, y: 0, z: 0}
        DamScale: 1
        SizeScale: 1
        SpeedBullet: 9
        BulletIcon: {fileID: 0}
      - Offset: {x: -0.25, y: 0, z: 0}
        Angle: {x: 0, y: 0, z: 0}
        DamScale: 1
        SizeScale: 1
        SpeedBullet: 9
        BulletIcon: {fileID: 0}
      - Offset: {x: 0, y: 0.25, z: 0}
        Angle: {x: 0, y: 0, z: 0}
        DamScale: 1
        SizeScale: 1
        SpeedBullet: 9
        BulletIcon: {fileID: 0}
      FireRate: 0.5
    - Infors:
      - Offset: {x: 0.5, y: 0, z: 0}
        Angle: {x: 0, y: 0, z: 0}
        DamScale: 1
        SizeScale: 1
        SpeedBullet: 9
        BulletIcon: {fileID: 0}
      - Offset: {x: -0.5, y: 0, z: 0}
        Angle: {x: 0, y: 0, z: 0}
        DamScale: 1
        SizeScale: 1
        SpeedBullet: 9
        BulletIcon: {fileID: 0}
      - Offset: {x: 0.25, y: 0.25, z: 0}
        Angle: {x: 0, y: 0, z: 0}
        DamScale: 1
        SizeScale: 1
        SpeedBullet: 9
        BulletIcon: {fileID: 0}
      - Offset: {x: -0.25, y: 0.25, z: 0}
        Angle: {x: 0, y: 0, z: 0}
        DamScale: 1
        SizeScale: 1
        SpeedBullet: 9
        BulletIcon: {fileID: 0}
      FireRate: 0.5
    - Infors:
      - Offset: {x: 0.5, y: 0, z: 0}
        Angle: {x: 0, y: 0, z: 0}
        DamScale: 1
        SizeScale: 1
        SpeedBullet: 9
        BulletIcon: {fileID: 0}
      - Offset: {x: -0.5, y: 0, z: 0}
        Angle: {x: 0, y: 0, z: 0}
        DamScale: 1
        SizeScale: 1
        SpeedBullet: 9
        BulletIcon: {fileID: 0}
      - Offset: {x: 0.25, y: 0.25, z: 0}
        Angle: {x: 0, y: 0, z: 0}
        DamScale: 1
        SizeScale: 1
        SpeedBullet: 9
        BulletIcon: {fileID: 0}
      - Offset: {x: -0.25, y: 0.25, z: 0}
        Angle: {x: 0, y: 0, z: 0}
        DamScale: 1
        SizeScale: 1
        SpeedBullet: 9
        BulletIcon: {fileID: 0}
      FireRate: 0.45
    - Infors:
      - Offset: {x: 0.3, y: 0, z: 0}
        Angle: {x: 0, y: 0, z: 0}
        DamScale: 1
        SizeScale: 1
        SpeedBullet: 9
        BulletIcon: {fileID: 0}
      - Offset: {x: -0.3, y: 0, z: 0}
        Angle: {x: 0, y: 0, z: 0}
        DamScale: 1
        SizeScale: 1
        SpeedBullet: 9
        BulletIcon: {fileID: 0}
      - Offset: {x: 0.6, y: 0, z: 0}
        Angle: {x: 0, y: 0, z: 0}
        DamScale: 1
        SizeScale: 1
        SpeedBullet: 9
        BulletIcon: {fileID: 0}
      - Offset: {x: -0.6, y: 0, z: 0}
        Angle: {x: 0, y: 0, z: 0}
        DamScale: 1
        SizeScale: 1
        SpeedBullet: 9
        BulletIcon: {fileID: 0}
      - Offset: {x: 0, y: 0.25, z: 0}
        Angle: {x: 0, y: 0, z: 0}
        DamScale: 1
        SizeScale: 1
        SpeedBullet: 9
        BulletIcon: {fileID: 0}
      FireRate: 0.45
    - Infors:
      - Offset: {x: 0.3, y: 0.1, z: 0}
        Angle: {x: 0, y: 0, z: 0}
        DamScale: 1
        SizeScale: 1
        SpeedBullet: 9
        BulletIcon: {fileID: 0}
      - Offset: {x: -0.3, y: 0.1, z: 0}
        Angle: {x: 0, y: 0, z: 0}
        DamScale: 1
        SizeScale: 1
        SpeedBullet: 9
        BulletIcon: {fileID: 0}
      - Offset: {x: 0.6, y: 0, z: 0}
        Angle: {x: 0, y: 0, z: 0}
        DamScale: 1
        SizeScale: 1
        SpeedBullet: 9
        BulletIcon: {fileID: 0}
      - Offset: {x: -0.6, y: 0, z: 0}
        Angle: {x: 0, y: 0, z: 0}
        DamScale: 1
        SizeScale: 1
        SpeedBullet: 9
        BulletIcon: {fileID: 0}
      - Offset: {x: 0, y: 0.25, z: 0}
        Angle: {x: 0, y: 0, z: 0}
        DamScale: 1
        SizeScale: 1
        SpeedBullet: 9
        BulletIcon: {fileID: 0}
      FireRate: 0.4
    - Infors:
      - Offset: {x: 0.9, y: -0.5, z: 0}
        Angle: {x: 0, y: 0, z: 0}
        DamScale: 1
        SizeScale: 1
        SpeedBullet: 9
        BulletIcon: {fileID: 0}
      - Offset: {x: -0.9, y: -0.5, z: 0}
        Angle: {x: 0, y: 0, z: 0}
        DamScale: 1
        SizeScale: 1
        SpeedBullet: 9
        BulletIcon: {fileID: 0}
      - Offset: {x: 0.5, y: 0, z: 0}
        Angle: {x: 0, y: 0, z: 0}
        DamScale: 1
        SizeScale: 1
        SpeedBullet: 9
        BulletIcon: {fileID: 0}
      - Offset: {x: -0.5, y: 0, z: 0}
        Angle: {x: 0, y: 0, z: 0}
        DamScale: 1
        SizeScale: 1
        SpeedBullet: 9
        BulletIcon: {fileID: 0}
      - Offset: {x: 0.2, y: 0.2, z: 0}
        Angle: {x: 0, y: 0, z: 0}
        DamScale: 1
        SizeScale: 1
        SpeedBullet: 9
        BulletIcon: {fileID: 0}
      - Offset: {x: -0.2, y: 0.2, z: 0}
        Angle: {x: 0, y: 0, z: 0}
        DamScale: 1
        SizeScale: 1
        SpeedBullet: 9
        BulletIcon: {fileID: 0}
      FireRate: 0.4
    - Infors:
      - Offset: {x: 0.9, y: -0.5, z: 0}
        Angle: {x: 0, y: 0, z: 0}
        DamScale: 1
        SizeScale: 1
        SpeedBullet: 9
        BulletIcon: {fileID: 0}
      - Offset: {x: -0.9, y: -0.5, z: 0}
        Angle: {x: 0, y: 0, z: 0}
        DamScale: 1
        SizeScale: 1
        SpeedBullet: 9
        BulletIcon: {fileID: 0}
      - Offset: {x: 0.5, y: 0, z: 0}
        Angle: {x: 0, y: 0, z: 0}
        DamScale: 1
        SizeScale: 1
        SpeedBullet: 9
        BulletIcon: {fileID: 0}
      - Offset: {x: -0.5, y: 0, z: 0}
        Angle: {x: 0, y: 0, z: 0}
        DamScale: 1
        SizeScale: 1
        SpeedBullet: 9
        BulletIcon: {fileID: 0}
      - Offset: {x: 0.2, y: 0.2, z: 0}
        Angle: {x: 0, y: 0, z: 0}
        DamScale: 1
        SizeScale: 1
        SpeedBullet: 9
        BulletIcon: {fileID: 0}
      - Offset: {x: -0.2, y: 0.2, z: 0}
        Angle: {x: 0, y: 0, z: 0}
        DamScale: 1
        SizeScale: 1
        SpeedBullet: 9
        BulletIcon: {fileID: 0}
      FireRate: 0.35
    - Infors:
      - Offset: {x: -0.9, y: -0.5, z: 0}
        Angle: {x: 0, y: 0, z: 0}
        DamScale: 1
        SizeScale: 1
        SpeedBullet: 9
        BulletIcon: {fileID: 0}
      - Offset: {x: 0.9, y: -0.5, z: 0}
        Angle: {x: 0, y: 0, z: 0}
        DamScale: 1
        SizeScale: 1
        SpeedBullet: 9
        BulletIcon: {fileID: 0}
      - Offset: {x: 0.5, y: 0, z: 0}
        Angle: {x: 0, y: 0, z: 0}
        DamScale: 1
        SizeScale: 1
        SpeedBullet: 9
        BulletIcon: {fileID: 0}
      - Offset: {x: -0.5, y: 0, z: 0}
        Angle: {x: 0, y: 0, z: 0}
        DamScale: 1
        SizeScale: 1
        SpeedBullet: 9
        BulletIcon: {fileID: 0}
      - Offset: {x: 0.2, y: 0.2, z: 0}
        Angle: {x: 0, y: 0, z: 0}
        DamScale: 1
        SizeScale: 1
        SpeedBullet: 9
        BulletIcon: {fileID: 0}
      - Offset: {x: -0.2, y: 0.2, z: 0}
        Angle: {x: 0, y: 0, z: 0}
        DamScale: 1
        SizeScale: 1
        SpeedBullet: 9
        BulletIcon: {fileID: 0}
      FireRate: 0.3
    - Infors:
      - Offset: {x: -0.9, y: -0.5, z: 0}
        Angle: {x: 0, y: 0, z: 0}
        DamScale: 1
        SizeScale: 1
        SpeedBullet: 10
        BulletIcon: {fileID: 0}
      - Offset: {x: 0.9, y: -0.5, z: 0}
        Angle: {x: 0, y: 0, z: 0}
        DamScale: 1
        SizeScale: 1
        SpeedBullet: 10
        BulletIcon: {fileID: 0}
      - Offset: {x: 0.5, y: 0, z: 0}
        Angle: {x: 0, y: 0, z: 0}
        DamScale: 1
        SizeScale: 1
        SpeedBullet: 9
        BulletIcon: {fileID: 0}
      - Offset: {x: -0.5, y: 0, z: 0}
        Angle: {x: 0, y: 0, z: 0}
        DamScale: 1
        SizeScale: 1
        SpeedBullet: 10
        BulletIcon: {fileID: 0}
      - Offset: {x: 0.2, y: 0.2, z: 0}
        Angle: {x: 0, y: 0, z: 0}
        DamScale: 1
        SizeScale: 1
        SpeedBullet: 10
        BulletIcon: {fileID: 0}
      - Offset: {x: -0.2, y: 0.2, z: 0}
        Angle: {x: 0, y: 0, z: 0}
        DamScale: 1
        SizeScale: 1
        SpeedBullet: 10
        BulletIcon: {fileID: 0}
      FireRate: 0.07
    IsChangeSuper: 0
    IsChangeBulletStyle: 0
    SuperTime: 10
  - LvlPosInfors:
    - Infors:
      - Offset: {x: 0, y: 0, z: 0}
        Angle: {x: 0, y: 0, z: 0}
        DamScale: 1
        SizeScale: 1
        SpeedBullet: 9
        BulletIcon: {fileID: 0}
      FireRate: 0.5
    - Infors:
      - Offset: {x: 0.25, y: 0, z: 0}
        Angle: {x: 0, y: 0, z: 0}
        DamScale: 1
        SizeScale: 1
        SpeedBullet: 9
        BulletIcon: {fileID: 0}
      - Offset: {x: -0.25, y: 0, z: 0}
        Angle: {x: 0, y: 0, z: 0}
        DamScale: 1
        SizeScale: 1
        SpeedBullet: 9
        BulletIcon: {fileID: 0}
      FireRate: 0.5
    - Infors:
      - Offset: {x: 0.5, y: -0.3, z: 0}
        Angle: {x: 0, y: 0, z: -5}
        DamScale: 1
        SizeScale: 1
        SpeedBullet: 9
        BulletIcon: {fileID: 0}
      - Offset: {x: -0.5, y: -0.3, z: 0}
        Angle: {x: 0, y: 0, z: 5}
        DamScale: 1
        SizeScale: 1
        SpeedBullet: 9
        BulletIcon: {fileID: 0}
      - Offset: {x: 0, y: 0.25, z: 0}
        Angle: {x: 0, y: 0, z: 0}
        DamScale: 1
        SizeScale: 1
        SpeedBullet: 9
        BulletIcon: {fileID: 0}
      FireRate: 0.5
    - Infors:
      - Offset: {x: 0.5, y: -0.3, z: 0}
        Angle: {x: 0, y: 0, z: -5}
        DamScale: 1
        SizeScale: 1
        SpeedBullet: 9
        BulletIcon: {fileID: 0}
      - Offset: {x: -0.5, y: -0.3, z: 0}
        Angle: {x: 0, y: 0, z: 5}
        DamScale: 1
        SizeScale: 1
        SpeedBullet: 9
        BulletIcon: {fileID: 0}
      - Offset: {x: 0.25, y: 0, z: 0}
        Angle: {x: 0, y: 0, z: 0}
        DamScale: 1
        SizeScale: 1
        SpeedBullet: 9
        BulletIcon: {fileID: 0}
      - Offset: {x: -0.25, y: 0, z: 0}
        Angle: {x: 0, y: 0, z: 0}
        DamScale: 1
        SizeScale: 1
        SpeedBullet: 9
        BulletIcon: {fileID: 0}
      FireRate: 0.5
    - Infors:
      - Offset: {x: 0.5, y: -0.3, z: 0}
        Angle: {x: 0, y: 0, z: -5}
        DamScale: 1
        SizeScale: 1
        SpeedBullet: 10
        BulletIcon: {fileID: 0}
      - Offset: {x: -0.5, y: -0.3, z: 0}
        Angle: {x: 0, y: 0, z: 5}
        DamScale: 1
        SizeScale: 1
        SpeedBullet: 10
        BulletIcon: {fileID: 0}
      - Offset: {x: 0, y: 0.2, z: 0}
        Angle: {x: 0, y: 0, z: 0}
        DamScale: 1
        SizeScale: 1
        SpeedBullet: 10
        BulletIcon: {fileID: 0}
      - Offset: {x: -0.25, y: 0, z: 0}
        Angle: {x: 0, y: 0, z: 0}
        DamScale: 1
        SizeScale: 1
        SpeedBullet: 10
        BulletIcon: {fileID: 0}
      - Offset: {x: -0.25, y: 0, z: 0}
        Angle: {x: 0, y: 0, z: 0}
        DamScale: 1
        SizeScale: 1
        SpeedBullet: 10
        BulletIcon: {fileID: 0}
      FireRate: 0.5
    - Infors:
      - Offset: {x: 0.5, y: -0.3, z: 0}
        Angle: {x: 0, y: 0, z: -5}
        DamScale: 1
        SizeScale: 1
        SpeedBullet: 10
        BulletIcon: {fileID: 0}
      - Offset: {x: -0.5, y: -0.3, z: 0}
        Angle: {x: 0, y: 0, z: 5}
        DamScale: 1
        SizeScale: 1
        SpeedBullet: 10
        BulletIcon: {fileID: 0}
      - Offset: {x: 0, y: 0.2, z: 0}
        Angle: {x: 0, y: 0, z: 0}
        DamScale: 1
        SizeScale: 1
        SpeedBullet: 10
        BulletIcon: {fileID: 0}
      - Offset: {x: 0.25, y: 0, z: 0}
        Angle: {x: 0, y: 0, z: 0}
        DamScale: 1
        SizeScale: 1
        SpeedBullet: 10
        BulletIcon: {fileID: 0}
      - Offset: {x: -0.25, y: 0, z: 0}
        Angle: {x: 0, y: 0, z: 0}
        DamScale: 1
        SizeScale: 1
        SpeedBullet: 10
        BulletIcon: {fileID: 0}
      FireRate: 0.45
    - Infors:
      - Offset: {x: 0.5, y: -0.3, z: 0}
        Angle: {x: 0, y: 0, z: -5}
        DamScale: 1
        SizeScale: 1
        SpeedBullet: 10
        BulletIcon: {fileID: 0}
      - Offset: {x: -0.5, y: -0.3, z: 0}
        Angle: {x: 0, y: 0, z: 5}
        DamScale: 1
        SizeScale: 1
        SpeedBullet: 10
        BulletIcon: {fileID: 0}
      - Offset: {x: 0.25, y: 0, z: 0}
        Angle: {x: 0, y: 0, z: 0}
        DamScale: 1
        SizeScale: 1
        SpeedBullet: 10
        BulletIcon: {fileID: 0}
      - Offset: {x: -0.25, y: 0, z: 0}
        Angle: {x: 0, y: 0, z: 0}
        DamScale: 1
        SizeScale: 1
        SpeedBullet: 10
        BulletIcon: {fileID: 0}
      - Offset: {x: 0.7, y: -0.5, z: 0}
        Angle: {x: 0, y: 0, z: -7}
        DamScale: 1
        SizeScale: 1
        SpeedBullet: 10
        BulletIcon: {fileID: 0}
      - Offset: {x: -0.7, y: -0.5, z: 0}
        Angle: {x: 0, y: 0, z: 7}
        DamScale: 1
        SizeScale: 1
        SpeedBullet: 10
        BulletIcon: {fileID: 0}
      FireRate: 0.45
    - Infors:
      - Offset: {x: 0.5, y: -0.3, z: 0}
        Angle: {x: 0, y: 0, z: -5}
        DamScale: 1
        SizeScale: 1
        SpeedBullet: 10
        BulletIcon: {fileID: 0}
      - Offset: {x: -0.5, y: -0.3, z: 0}
        Angle: {x: 0, y: 0, z: 5}
        DamScale: 1
        SizeScale: 1
        SpeedBullet: 10
        BulletIcon: {fileID: 0}
      - Offset: {x: 0.25, y: 0, z: 0}
        Angle: {x: 0, y: 0, z: 0}
        DamScale: 1
        SizeScale: 1
        SpeedBullet: 10
        BulletIcon: {fileID: 0}
      - Offset: {x: -0.25, y: 0, z: 0}
        Angle: {x: 0, y: 0, z: 0}
        DamScale: 1
        SizeScale: 1
        SpeedBullet: 10
        BulletIcon: {fileID: 0}
      - Offset: {x: 0.7, y: -0.5, z: 0}
        Angle: {x: 0, y: 0, z: -7}
        DamScale: 1
        SizeScale: 1
        SpeedBullet: 10
        BulletIcon: {fileID: 0}
      - Offset: {x: -0.7, y: -0.5, z: 0}
        Angle: {x: 0, y: 0, z: 7}
        DamScale: 1
        SizeScale: 1
        SpeedBullet: 10
        BulletIcon: {fileID: 0}
      FireRate: 0.35
    - Infors:
      - Offset: {x: 0.5, y: -0.3, z: 0}
        Angle: {x: 0, y: 0, z: -5}
        DamScale: 1
        SizeScale: 1
        SpeedBullet: 11
        BulletIcon: {fileID: 0}
      - Offset: {x: -0.5, y: -0.3, z: 0}
        Angle: {x: 0, y: 0, z: 5}
        DamScale: 1
        SizeScale: 1
        SpeedBullet: 11
        BulletIcon: {fileID: 0}
      - Offset: {x: 0.25, y: 0, z: 0}
        Angle: {x: 0, y: 0, z: 0}
        DamScale: 1
        SizeScale: 1
        SpeedBullet: 11
        BulletIcon: {fileID: 0}
      - Offset: {x: -0.25, y: 0, z: 0}
        Angle: {x: 0, y: 0, z: 0}
        DamScale: 1
        SizeScale: 1
        SpeedBullet: 11
        BulletIcon: {fileID: 0}
      - Offset: {x: 0.7, y: -0.5, z: 0}
        Angle: {x: 0, y: 0, z: -7}
        DamScale: 1
        SizeScale: 1
        SpeedBullet: 11
        BulletIcon: {fileID: 0}
      - Offset: {x: -0.7, y: -0.5, z: 0}
        Angle: {x: 0, y: 0, z: 7}
        DamScale: 1
        SizeScale: 1
        SpeedBullet: 11
        BulletIcon: {fileID: 0}
      - Offset: {x: 0, y: 0.2, z: 0}
        Angle: {x: 0, y: 0, z: 0}
        DamScale: 1
        SizeScale: 1
        SpeedBullet: 11
        BulletIcon: {fileID: 0}
      FireRate: 0.35
    - Infors:
      - Offset: {x: 0.5, y: -0.3, z: 0}
        Angle: {x: 0, y: 0, z: -5}
        DamScale: 1
        SizeScale: 1
        SpeedBullet: 11
        BulletIcon: {fileID: 0}
      - Offset: {x: -0.5, y: -0.3, z: 0}
        Angle: {x: 0, y: 0, z: 5}
        DamScale: 1
        SizeScale: 1
        SpeedBullet: 11
        BulletIcon: {fileID: 0}
      - Offset: {x: 0.25, y: 0, z: 0}
        Angle: {x: 0, y: 0, z: 0}
        DamScale: 1
        SizeScale: 1
        SpeedBullet: 11
        BulletIcon: {fileID: 0}
      - Offset: {x: -0.25, y: 0, z: 0}
        Angle: {x: 0, y: 0, z: 0}
        DamScale: 1
        SizeScale: 1
        SpeedBullet: 11
        BulletIcon: {fileID: 0}
      - Offset: {x: 0.7, y: -0.5, z: 0}
        Angle: {x: 0, y: 0, z: -7}
        DamScale: 1
        SizeScale: 1
        SpeedBullet: 11
        BulletIcon: {fileID: 0}
      - Offset: {x: -0.7, y: -0.5, z: 0}
        Angle: {x: 0, y: 0, z: 7}
        DamScale: 1
        SizeScale: 1
        SpeedBullet: 11
        BulletIcon: {fileID: 0}
      - Offset: {x: 0, y: 0.2, z: 0}
        Angle: {x: 0, y: 0, z: 0}
        DamScale: 1
        SizeScale: 1
        SpeedBullet: 11
        BulletIcon: {fileID: 0}
      FireRate: 0.2
    - Infors:
      - Offset: {x: -0.9, y: -0.5, z: 0}
        Angle: {x: 0, y: 0, z: 0}
        DamScale: 1
        SizeScale: 1
        SpeedBullet: 12
        BulletIcon: {fileID: 0}
      - Offset: {x: 0.9, y: -0.5, z: 0}
        Angle: {x: 0, y: 0, z: 0}
        DamScale: 1
        SizeScale: 1
        SpeedBullet: 12
        BulletIcon: {fileID: 0}
      - Offset: {x: 0.5, y: 0, z: 0}
        Angle: {x: 0, y: 0, z: 0}
        DamScale: 1
        SizeScale: 1
        SpeedBullet: 12
        BulletIcon: {fileID: 0}
      - Offset: {x: -0.5, y: 0, z: 0}
        Angle: {x: 0, y: 0, z: 0}
        DamScale: 1
        SizeScale: 1
        SpeedBullet: 12
        BulletIcon: {fileID: 0}
      - Offset: {x: 0.2, y: 0.2, z: 0}
        Angle: {x: 0, y: 0, z: 0}
        DamScale: 1
        SizeScale: 1
        SpeedBullet: 12
        BulletIcon: {fileID: 0}
      - Offset: {x: -0.2, y: 0.2, z: 0}
        Angle: {x: 0, y: 0, z: 0}
        DamScale: 1
        SizeScale: 1
        SpeedBullet: 12
        BulletIcon: {fileID: 0}
      FireRate: 0.07
    IsChangeSuper: 0
    IsChangeBulletStyle: 0
    SuperTime: 10
  - LvlPosInfors:
    - Infors:
      - Offset: {x: 0, y: 0, z: 0}
        Angle: {x: 0, y: 0, z: 0}
        DamScale: 1
        SizeScale: 1
        SpeedBullet: 9
        BulletIcon: {fileID: 0}
      FireRate: 0.5
    - Infors:
      - Offset: {x: 0.25, y: 0, z: 0}
        Angle: {x: 0, y: 0, z: 0}
        DamScale: 1
        SizeScale: 1
        SpeedBullet: 9
        BulletIcon: {fileID: 0}
      - Offset: {x: -0.25, y: 0, z: 0}
        Angle: {x: 0, y: 0, z: 0}
        DamScale: 1
        SizeScale: 1
        SpeedBullet: 9
        BulletIcon: {fileID: 0}
      FireRate: 0.5
    - Infors:
      - Offset: {x: 0.5, y: -0.3, z: 0}
        Angle: {x: 0, y: 0, z: -5}
        DamScale: 1
        SizeScale: 1
        SpeedBullet: 9
        BulletIcon: {fileID: 0}
      - Offset: {x: -0.5, y: -0.3, z: 0}
        Angle: {x: 0, y: 0, z: 5}
        DamScale: 1
        SizeScale: 1
        SpeedBullet: 9
        BulletIcon: {fileID: 0}
      - Offset: {x: 0, y: 0.25, z: 0}
        Angle: {x: 0, y: 0, z: 0}
        DamScale: 1
        SizeScale: 1
        SpeedBullet: 9
        BulletIcon: {fileID: 0}
      FireRate: 0.5
    - Infors:
      - Offset: {x: 0.5, y: -0.3, z: 0}
        Angle: {x: 0, y: 0, z: -5}
        DamScale: 1
        SizeScale: 1
        SpeedBullet: 9
        BulletIcon: {fileID: 0}
      - Offset: {x: -0.5, y: -0.3, z: 0}
        Angle: {x: 0, y: 0, z: 5}
        DamScale: 1
        SizeScale: 1
        SpeedBullet: 9
        BulletIcon: {fileID: 0}
      - Offset: {x: 0.25, y: 0, z: 0}
        Angle: {x: 0, y: 0, z: 0}
        DamScale: 1
        SizeScale: 1
        SpeedBullet: 9
        BulletIcon: {fileID: 0}
      - Offset: {x: -0.25, y: 0, z: 0}
        Angle: {x: 0, y: 0, z: 0}
        DamScale: 1
        SizeScale: 1
        SpeedBullet: 9
        BulletIcon: {fileID: 0}
      FireRate: 0.5
    - Infors:
      - Offset: {x: 0.5, y: -0.3, z: 0}
        Angle: {x: 0, y: 0, z: -5}
        DamScale: 1
        SizeScale: 1
        SpeedBullet: 10
        BulletIcon: {fileID: 0}
      - Offset: {x: -0.5, y: -0.3, z: 0}
        Angle: {x: 0, y: 0, z: 5}
        DamScale: 1
        SizeScale: 1
        SpeedBullet: 10
        BulletIcon: {fileID: 0}
      - Offset: {x: 0, y: 0.2, z: 0}
        Angle: {x: 0, y: 0, z: 0}
        DamScale: 1
        SizeScale: 1
        SpeedBullet: 10
        BulletIcon: {fileID: 0}
      - Offset: {x: -0.25, y: 0, z: 0}
        Angle: {x: 0, y: 0, z: 0}
        DamScale: 1
        SizeScale: 1
        SpeedBullet: 10
        BulletIcon: {fileID: 0}
      - Offset: {x: -0.25, y: 0, z: 0}
        Angle: {x: 0, y: 0, z: 0}
        DamScale: 1
        SizeScale: 1
        SpeedBullet: 10
        BulletIcon: {fileID: 0}
      FireRate: 0.5
    - Infors:
      - Offset: {x: 0.5, y: -0.3, z: 0}
        Angle: {x: 0, y: 0, z: -5}
        DamScale: 1
        SizeScale: 1
        SpeedBullet: 10
        BulletIcon: {fileID: 0}
      - Offset: {x: -0.5, y: -0.3, z: 0}
        Angle: {x: 0, y: 0, z: 5}
        DamScale: 1
        SizeScale: 1
        SpeedBullet: 10
        BulletIcon: {fileID: 0}
      - Offset: {x: 0, y: 0.2, z: 0}
        Angle: {x: 0, y: 0, z: 0}
        DamScale: 1
        SizeScale: 1
        SpeedBullet: 10
        BulletIcon: {fileID: 0}
      - Offset: {x: 0.25, y: 0, z: 0}
        Angle: {x: 0, y: 0, z: 0}
        DamScale: 1
        SizeScale: 1
        SpeedBullet: 10
        BulletIcon: {fileID: 0}
      - Offset: {x: -0.25, y: 0, z: 0}
        Angle: {x: 0, y: 0, z: 0}
        DamScale: 1
        SizeScale: 1
        SpeedBullet: 10
        BulletIcon: {fileID: 0}
      FireRate: 0.45
    - Infors:
      - Offset: {x: 0.5, y: -0.3, z: 0}
        Angle: {x: 0, y: 0, z: -5}
        DamScale: 1
        SizeScale: 1
        SpeedBullet: 10
        BulletIcon: {fileID: 0}
      - Offset: {x: -0.5, y: -0.3, z: 0}
        Angle: {x: 0, y: 0, z: 5}
        DamScale: 1
        SizeScale: 1
        SpeedBullet: 10
        BulletIcon: {fileID: 0}
      - Offset: {x: 0.25, y: 0, z: 0}
        Angle: {x: 0, y: 0, z: 0}
        DamScale: 1
        SizeScale: 1
        SpeedBullet: 10
        BulletIcon: {fileID: 0}
      - Offset: {x: -0.25, y: 0, z: 0}
        Angle: {x: 0, y: 0, z: 0}
        DamScale: 1
        SizeScale: 1
        SpeedBullet: 10
        BulletIcon: {fileID: 0}
      - Offset: {x: 0.7, y: -0.5, z: 0}
        Angle: {x: 0, y: 0, z: -7}
        DamScale: 1
        SizeScale: 1
        SpeedBullet: 10
        BulletIcon: {fileID: 0}
      - Offset: {x: -0.7, y: -0.5, z: 0}
        Angle: {x: 0, y: 0, z: 7}
        DamScale: 1
        SizeScale: 1
        SpeedBullet: 10
        BulletIcon: {fileID: 0}
      FireRate: 0.45
    - Infors:
      - Offset: {x: 0.5, y: -0.3, z: 0}
        Angle: {x: 0, y: 0, z: -5}
        DamScale: 1
        SizeScale: 1
        SpeedBullet: 10
        BulletIcon: {fileID: 0}
      - Offset: {x: -0.5, y: -0.3, z: 0}
        Angle: {x: 0, y: 0, z: 5}
        DamScale: 1
        SizeScale: 1
        SpeedBullet: 10
        BulletIcon: {fileID: 0}
      - Offset: {x: 0.25, y: 0, z: 0}
        Angle: {x: 0, y: 0, z: 0}
        DamScale: 1
        SizeScale: 1
        SpeedBullet: 10
        BulletIcon: {fileID: 0}
      - Offset: {x: -0.25, y: 0, z: 0}
        Angle: {x: 0, y: 0, z: 0}
        DamScale: 1
        SizeScale: 1
        SpeedBullet: 10
        BulletIcon: {fileID: 0}
      - Offset: {x: 0.7, y: -0.5, z: 0}
        Angle: {x: 0, y: 0, z: -7}
        DamScale: 1
        SizeScale: 1
        SpeedBullet: 10
        BulletIcon: {fileID: 0}
      - Offset: {x: -0.7, y: -0.5, z: 0}
        Angle: {x: 0, y: 0, z: 7}
        DamScale: 1
        SizeScale: 1
        SpeedBullet: 10
        BulletIcon: {fileID: 0}
      FireRate: 0.35
    - Infors:
      - Offset: {x: 0.5, y: -0.3, z: 0}
        Angle: {x: 0, y: 0, z: -5}
        DamScale: 1
        SizeScale: 1
        SpeedBullet: 11
        BulletIcon: {fileID: 0}
      - Offset: {x: -0.5, y: -0.3, z: 0}
        Angle: {x: 0, y: 0, z: 5}
        DamScale: 1
        SizeScale: 1
        SpeedBullet: 11
        BulletIcon: {fileID: 0}
      - Offset: {x: 0.25, y: 0, z: 0}
        Angle: {x: 0, y: 0, z: 0}
        DamScale: 1
        SizeScale: 1
        SpeedBullet: 11
        BulletIcon: {fileID: 0}
      - Offset: {x: -0.25, y: 0, z: 0}
        Angle: {x: 0, y: 0, z: 0}
        DamScale: 1
        SizeScale: 1
        SpeedBullet: 11
        BulletIcon: {fileID: 0}
      - Offset: {x: 0.7, y: -0.5, z: 0}
        Angle: {x: 0, y: 0, z: -7}
        DamScale: 1
        SizeScale: 1
        SpeedBullet: 11
        BulletIcon: {fileID: 0}
      - Offset: {x: -0.7, y: -0.5, z: 0}
        Angle: {x: 0, y: 0, z: 7}
        DamScale: 1
        SizeScale: 1
        SpeedBullet: 11
        BulletIcon: {fileID: 0}
      - Offset: {x: 0, y: 0.2, z: 0}
        Angle: {x: 0, y: 0, z: 0}
        DamScale: 1
        SizeScale: 1
        SpeedBullet: 11
        BulletIcon: {fileID: 0}
      FireRate: 0.35
    - Infors:
      - Offset: {x: 0.5, y: -0.3, z: 0}
        Angle: {x: 0, y: 0, z: -5}
        DamScale: 1
        SizeScale: 1
        SpeedBullet: 11
        BulletIcon: {fileID: 0}
      - Offset: {x: -0.5, y: -0.3, z: 0}
        Angle: {x: 0, y: 0, z: 5}
        DamScale: 1
        SizeScale: 1
        SpeedBullet: 11
        BulletIcon: {fileID: 0}
      - Offset: {x: 0.25, y: 0, z: 0}
        Angle: {x: 0, y: 0, z: 0}
        DamScale: 1
        SizeScale: 1
        SpeedBullet: 11
        BulletIcon: {fileID: 0}
      - Offset: {x: -0.25, y: 0, z: 0}
        Angle: {x: 0, y: 0, z: 0}
        DamScale: 1
        SizeScale: 1
        SpeedBullet: 11
        BulletIcon: {fileID: 0}
      - Offset: {x: 0.7, y: -0.5, z: 0}
        Angle: {x: 0, y: 0, z: -7}
        DamScale: 1
        SizeScale: 1
        SpeedBullet: 11
        BulletIcon: {fileID: 0}
      - Offset: {x: -0.7, y: -0.5, z: 0}
        Angle: {x: 0, y: 0, z: 7}
        DamScale: 1
        SizeScale: 1
        SpeedBullet: 11
        BulletIcon: {fileID: 0}
      - Offset: {x: 0, y: 0.2, z: 0}
        Angle: {x: 0, y: 0, z: 0}
        DamScale: 1
        SizeScale: 1
        SpeedBullet: 11
        BulletIcon: {fileID: 0}
      FireRate: 0.2
    - Infors:
      - Offset: {x: 0, y: 0.3, z: 0}
        Angle: {x: 0, y: 0, z: 0}
        DamScale: 1
        SizeScale: 1
        SpeedBullet: 12
        BulletIcon: {fileID: 0}
      - Offset: {x: 0.2, y: 0.2, z: 0}
        Angle: {x: 0, y: 0, z: 0}
        DamScale: 1
        SizeScale: 1
        SpeedBullet: 12
        BulletIcon: {fileID: 0}
      - Offset: {x: -0.2, y: 0.2, z: 0}
        Angle: {x: 0, y: 0, z: 0}
        DamScale: 1
        SizeScale: 1
        SpeedBullet: 12
        BulletIcon: {fileID: 0}
      - Offset: {x: 0.3, y: 0.1, z: 0}
        Angle: {x: 0, y: 0, z: 0}
        DamScale: 1
        SizeScale: 1
        SpeedBullet: 12
        BulletIcon: {fileID: 0}
      - Offset: {x: -0.3, y: 0.1, z: 0}
        Angle: {x: 0, y: 0, z: 0}
        DamScale: 1
        SizeScale: 1
        SpeedBullet: 12
        BulletIcon: {fileID: 0}
      - Offset: {x: 0.5, y: -0.2, z: 0}
        Angle: {x: 0, y: 0, z: -15}
        DamScale: 1
        SizeScale: 1
        SpeedBullet: 12
        BulletIcon: {fileID: 0}
      - Offset: {x: -0.5, y: -0.2, z: 0}
        Angle: {x: 0, y: 0, z: 15}
        DamScale: 1
        SizeScale: 1
        SpeedBullet: 12
        BulletIcon: {fileID: 0}
      - Offset: {x: 0.6, y: 0.3, z: 0}
        Angle: {x: 0, y: 0, z: -30}
        DamScale: 1
        SizeScale: 1
        SpeedBullet: 12
        BulletIcon: {fileID: 0}
      - Offset: {x: -0.6, y: -0.3, z: 0}
        Angle: {x: 0, y: 0, z: 30}
        DamScale: 1
        SizeScale: 1
        SpeedBullet: 12
        BulletIcon: {fileID: 0}
      - Offset: {x: 0.5, y: -0.5, z: 0}
        Angle: {x: 0, y: 0, z: -45}
        DamScale: 1
        SizeScale: 1
        SpeedBullet: 12
        BulletIcon: {fileID: 0}
      - Offset: {x: -0.5, y: -0.5, z: 0}
        Angle: {x: 0, y: 0, z: 45}
        DamScale: 1
        SizeScale: 1
        SpeedBullet: 12
        BulletIcon: {fileID: 0}
      FireRate: 0.07
    IsChangeSuper: 0
    IsChangeBulletStyle: 0
    SuperTime: 10
  - LvlPosInfors:
    - Infors:
      - Offset: {x: 0, y: 0, z: 0}
        Angle: {x: 0, y: 0, z: 0}
        DamScale: 1
        SizeScale: 1
        SpeedBullet: 9
        BulletIcon: {fileID: 0}
      FireRate: 0.5
    - Infors:
      - Offset: {x: 0.25, y: 0, z: 0}
        Angle: {x: 0, y: 0, z: 0}
        DamScale: 1
        SizeScale: 1
        SpeedBullet: 9
        BulletIcon: {fileID: 0}
      - Offset: {x: -0.25, y: 0, z: 0}
        Angle: {x: 0, y: 0, z: 0}
        DamScale: 1
        SizeScale: 1
        SpeedBullet: 9
        BulletIcon: {fileID: 0}
      FireRate: 0.5
    - Infors:
      - Offset: {x: 0.5, y: -0.3, z: 0}
        Angle: {x: 0, y: 0, z: -5}
        DamScale: 1
        SizeScale: 1
        SpeedBullet: 9
        BulletIcon: {fileID: 0}
      - Offset: {x: -0.5, y: -0.3, z: 0}
        Angle: {x: 0, y: 0, z: 5}
        DamScale: 1
        SizeScale: 1
        SpeedBullet: 9
        BulletIcon: {fileID: 0}
      - Offset: {x: 0, y: 0.25, z: 0}
        Angle: {x: 0, y: 0, z: 0}
        DamScale: 1
        SizeScale: 1
        SpeedBullet: 9
        BulletIcon: {fileID: 0}
      FireRate: 0.5
    - Infors:
      - Offset: {x: 0.5, y: -0.3, z: 0}
        Angle: {x: 0, y: 0, z: -5}
        DamScale: 1
        SizeScale: 1
        SpeedBullet: 9
        BulletIcon: {fileID: 0}
      - Offset: {x: -0.5, y: -0.3, z: 0}
        Angle: {x: 0, y: 0, z: 5}
        DamScale: 1
        SizeScale: 1
        SpeedBullet: 9
        BulletIcon: {fileID: 0}
      - Offset: {x: 0.25, y: 0, z: 0}
        Angle: {x: 0, y: 0, z: 0}
        DamScale: 1
        SizeScale: 1
        SpeedBullet: 9
        BulletIcon: {fileID: 0}
      - Offset: {x: -0.25, y: 0, z: 0}
        Angle: {x: 0, y: 0, z: 0}
        DamScale: 1
        SizeScale: 1
        SpeedBullet: 9
        BulletIcon: {fileID: 0}
      FireRate: 0.5
    - Infors:
      - Offset: {x: 0.5, y: -0.3, z: 0}
        Angle: {x: 0, y: 0, z: -5}
        DamScale: 1
        SizeScale: 1
        SpeedBullet: 10
        BulletIcon: {fileID: 0}
      - Offset: {x: -0.5, y: -0.3, z: 0}
        Angle: {x: 0, y: 0, z: 5}
        DamScale: 1
        SizeScale: 1
        SpeedBullet: 10
        BulletIcon: {fileID: 0}
      - Offset: {x: 0, y: 0.2, z: 0}
        Angle: {x: 0, y: 0, z: 0}
        DamScale: 1
        SizeScale: 1
        SpeedBullet: 10
        BulletIcon: {fileID: 0}
      - Offset: {x: -0.25, y: 0, z: 0}
        Angle: {x: 0, y: 0, z: 0}
        DamScale: 1
        SizeScale: 1
        SpeedBullet: 10
        BulletIcon: {fileID: 0}
      - Offset: {x: -0.25, y: 0, z: 0}
        Angle: {x: 0, y: 0, z: 0}
        DamScale: 1
        SizeScale: 1
        SpeedBullet: 10
        BulletIcon: {fileID: 0}
      FireRate: 0.5
    - Infors:
      - Offset: {x: 0.5, y: -0.3, z: 0}
        Angle: {x: 0, y: 0, z: -5}
        DamScale: 1
        SizeScale: 1
        SpeedBullet: 10
        BulletIcon: {fileID: 0}
      - Offset: {x: -0.5, y: -0.3, z: 0}
        Angle: {x: 0, y: 0, z: 5}
        DamScale: 1
        SizeScale: 1
        SpeedBullet: 10
        BulletIcon: {fileID: 0}
      - Offset: {x: 0, y: 0.2, z: 0}
        Angle: {x: 0, y: 0, z: 0}
        DamScale: 1
        SizeScale: 1
        SpeedBullet: 10
        BulletIcon: {fileID: 0}
      - Offset: {x: 0.25, y: 0, z: 0}
        Angle: {x: 0, y: 0, z: 0}
        DamScale: 1
        SizeScale: 1
        SpeedBullet: 10
        BulletIcon: {fileID: 0}
      - Offset: {x: -0.25, y: 0, z: 0}
        Angle: {x: 0, y: 0, z: 0}
        DamScale: 1
        SizeScale: 1
        SpeedBullet: 10
        BulletIcon: {fileID: 0}
      FireRate: 0.45
    - Infors:
      - Offset: {x: 0.5, y: -0.3, z: 0}
        Angle: {x: 0, y: 0, z: -5}
        DamScale: 1
        SizeScale: 1
        SpeedBullet: 10
        BulletIcon: {fileID: 0}
      - Offset: {x: -0.5, y: -0.3, z: 0}
        Angle: {x: 0, y: 0, z: 5}
        DamScale: 1
        SizeScale: 1
        SpeedBullet: 10
        BulletIcon: {fileID: 0}
      - Offset: {x: 0.25, y: 0, z: 0}
        Angle: {x: 0, y: 0, z: 0}
        DamScale: 1
        SizeScale: 1
        SpeedBullet: 10
        BulletIcon: {fileID: 0}
      - Offset: {x: -0.25, y: 0, z: 0}
        Angle: {x: 0, y: 0, z: 0}
        DamScale: 1
        SizeScale: 1
        SpeedBullet: 10
        BulletIcon: {fileID: 0}
      - Offset: {x: 0.7, y: -0.5, z: 0}
        Angle: {x: 0, y: 0, z: -7}
        DamScale: 1
        SizeScale: 1
        SpeedBullet: 10
        BulletIcon: {fileID: 0}
      - Offset: {x: -0.7, y: -0.5, z: 0}
        Angle: {x: 0, y: 0, z: 7}
        DamScale: 1
        SizeScale: 1
        SpeedBullet: 10
        BulletIcon: {fileID: 0}
      FireRate: 0.45
    - Infors:
      - Offset: {x: 0.5, y: -0.3, z: 0}
        Angle: {x: 0, y: 0, z: -5}
        DamScale: 1
        SizeScale: 1
        SpeedBullet: 10
        BulletIcon: {fileID: 0}
      - Offset: {x: -0.5, y: -0.3, z: 0}
        Angle: {x: 0, y: 0, z: 5}
        DamScale: 1
        SizeScale: 1
        SpeedBullet: 10
        BulletIcon: {fileID: 0}
      - Offset: {x: 0.25, y: 0, z: 0}
        Angle: {x: 0, y: 0, z: 0}
        DamScale: 1
        SizeScale: 1
        SpeedBullet: 10
        BulletIcon: {fileID: 0}
      - Offset: {x: -0.25, y: 0, z: 0}
        Angle: {x: 0, y: 0, z: 0}
        DamScale: 1
        SizeScale: 1
        SpeedBullet: 10
        BulletIcon: {fileID: 0}
      - Offset: {x: 0.7, y: -0.5, z: 0}
        Angle: {x: 0, y: 0, z: -7}
        DamScale: 1
        SizeScale: 1
        SpeedBullet: 10
        BulletIcon: {fileID: 0}
      - Offset: {x: -0.7, y: -0.5, z: 0}
        Angle: {x: 0, y: 0, z: 7}
        DamScale: 1
        SizeScale: 1
        SpeedBullet: 10
        BulletIcon: {fileID: 0}
      FireRate: 0.35
    - Infors:
      - Offset: {x: 0.5, y: -0.3, z: 0}
        Angle: {x: 0, y: 0, z: -5}
        DamScale: 1
        SizeScale: 1
        SpeedBullet: 11
        BulletIcon: {fileID: 0}
      - Offset: {x: -0.5, y: -0.3, z: 0}
        Angle: {x: 0, y: 0, z: 5}
        DamScale: 1
        SizeScale: 1
        SpeedBullet: 11
        BulletIcon: {fileID: 0}
      - Offset: {x: 0.25, y: 0, z: 0}
        Angle: {x: 0, y: 0, z: 0}
        DamScale: 1
        SizeScale: 1
        SpeedBullet: 11
        BulletIcon: {fileID: 0}
      - Offset: {x: -0.25, y: 0, z: 0}
        Angle: {x: 0, y: 0, z: 0}
        DamScale: 1
        SizeScale: 1
        SpeedBullet: 11
        BulletIcon: {fileID: 0}
      - Offset: {x: 0.7, y: -0.5, z: 0}
        Angle: {x: 0, y: 0, z: -7}
        DamScale: 1
        SizeScale: 1
        SpeedBullet: 11
        BulletIcon: {fileID: 0}
      - Offset: {x: -0.7, y: -0.5, z: 0}
        Angle: {x: 0, y: 0, z: 7}
        DamScale: 1
        SizeScale: 1
        SpeedBullet: 11
        BulletIcon: {fileID: 0}
      - Offset: {x: 0, y: 0.2, z: 0}
        Angle: {x: 0, y: 0, z: 0}
        DamScale: 1
        SizeScale: 1
        SpeedBullet: 11
        BulletIcon: {fileID: 0}
      FireRate: 0.35
    - Infors:
      - Offset: {x: 0.5, y: -0.3, z: 0}
        Angle: {x: 0, y: 0, z: -5}
        DamScale: 1
        SizeScale: 1
        SpeedBullet: 11
        BulletIcon: {fileID: 0}
      - Offset: {x: -0.5, y: -0.3, z: 0}
        Angle: {x: 0, y: 0, z: 5}
        DamScale: 1
        SizeScale: 1
        SpeedBullet: 11
        BulletIcon: {fileID: 0}
      - Offset: {x: 0.25, y: 0, z: 0}
        Angle: {x: 0, y: 0, z: 0}
        DamScale: 1
        SizeScale: 1
        SpeedBullet: 11
        BulletIcon: {fileID: 0}
      - Offset: {x: -0.25, y: 0, z: 0}
        Angle: {x: 0, y: 0, z: 0}
        DamScale: 1
        SizeScale: 1
        SpeedBullet: 11
        BulletIcon: {fileID: 0}
      - Offset: {x: 0.7, y: -0.5, z: 0}
        Angle: {x: 0, y: 0, z: -7}
        DamScale: 1
        SizeScale: 1
        SpeedBullet: 11
        BulletIcon: {fileID: 0}
      - Offset: {x: -0.7, y: -0.5, z: 0}
        Angle: {x: 0, y: 0, z: 7}
        DamScale: 1
        SizeScale: 1
        SpeedBullet: 11
        BulletIcon: {fileID: 0}
      - Offset: {x: 0, y: 0.2, z: 0}
        Angle: {x: 0, y: 0, z: 0}
        DamScale: 1
        SizeScale: 1
        SpeedBullet: 11
        BulletIcon: {fileID: 0}
      FireRate: 0.2
    - Infors:
      - Offset: {x: 0, y: 0.3, z: 0}
        Angle: {x: 0, y: 0, z: 0}
        DamScale: 1
        SizeScale: 1
        SpeedBullet: 12
        BulletIcon: {fileID: 0}
      - Offset: {x: 0.2, y: 0.2, z: 0}
        Angle: {x: 0, y: 0, z: 0}
        DamScale: 1
        SizeScale: 1
        SpeedBullet: 12
        BulletIcon: {fileID: 0}
      - Offset: {x: -0.2, y: 0.2, z: 0}
        Angle: {x: 0, y: 0, z: 0}
        DamScale: 1
        SizeScale: 1
        SpeedBullet: 12
        BulletIcon: {fileID: 0}
      - Offset: {x: 0.3, y: 0.1, z: 0}
        Angle: {x: 0, y: 0, z: 0}
        DamScale: 1
        SizeScale: 1
        SpeedBullet: 12
        BulletIcon: {fileID: 0}
      - Offset: {x: -0.3, y: 0.1, z: 0}
        Angle: {x: 0, y: 0, z: 0}
        DamScale: 1
        SizeScale: 1
        SpeedBullet: 12
        BulletIcon: {fileID: 0}
      - Offset: {x: 0.5, y: -0.2, z: 0}
        Angle: {x: 0, y: 0, z: -15}
        DamScale: 1
        SizeScale: 1
        SpeedBullet: 12
        BulletIcon: {fileID: 0}
      - Offset: {x: -0.5, y: -0.2, z: 0}
        Angle: {x: 0, y: 0, z: 15}
        DamScale: 1
        SizeScale: 1
        SpeedBullet: 12
        BulletIcon: {fileID: 0}
      - Offset: {x: 0.6, y: 0.3, z: 0}
        Angle: {x: 0, y: 0, z: -30}
        DamScale: 1
        SizeScale: 1
        SpeedBullet: 12
        BulletIcon: {fileID: 0}
      - Offset: {x: -0.6, y: -0.3, z: 0}
        Angle: {x: 0, y: 0, z: 30}
        DamScale: 1
        SizeScale: 1
        SpeedBullet: 12
        BulletIcon: {fileID: 0}
      - Offset: {x: 0.5, y: -0.5, z: 0}
        Angle: {x: 0, y: 0, z: -45}
        DamScale: 1
        SizeScale: 1
        SpeedBullet: 12
        BulletIcon: {fileID: 0}
      - Offset: {x: -0.5, y: -0.5, z: 0}
        Angle: {x: 0, y: 0, z: 45}
        DamScale: 1
        SizeScale: 1
        SpeedBullet: 12
        BulletIcon: {fileID: 0}
      FireRate: 0.07
    IsChangeSuper: 0
    IsChangeBulletStyle: 0
    SuperTime: 13
