{
"skeleton": { "hash": "2qX1HbsaYodkt7XFSMNm9Gz+p+s", "spine": "3.6.53", "width": 624.16, "height": 590.15, "images": "./Img/" },
"bones": [
	{ "name": "root" },
	{ "name": "X", "parent": "root", "length": 58.02, "x": -0.49, "y": -73.64 },
	{ "name": "Y", "parent": "X", "length": 55.14, "rotation": -90, "x": 0.22, "y": 0.54 },
	{ "name": "Hip", "parent": "Y", "length": 45.7, "rotation": 90, "x": -219.44, "y": 0.56 },
	{ "name": "Body_21", "parent": "Hip", "length": 70.77, "rotation": 90.55, "x": -0.67, "y": 1.14 },
	{ "name": "Body_22", "parent": "Body_21", "length": 33.73, "rotation": -0.55, "x": 131.42, "y": -1.24 },
	{ "name": "Body_11", "parent": "Body_22", "length": 39.44, "rotation": 114.44, "x": -41.34, "y": 110.43 },
	{ "name": "Body_12", "parent": "Body_22", "length": 38.52, "rotation": -126.38, "x": -34.27, "y": -106.62 },
	{ "name": "Head", "parent": "Body_21", "length": 63.36, "rotation": 179.45, "x": 130.75, "y": -1.25 },
	{ "name": "Eye", "parent": "Head", "length": 17.46, "rotation": -91.45, "x": 97.21, "y": -0.16 },
	{ "name": "Point", "parent": "root", "x": -0.6, "y": -606.78, "color": "b4108dff" },
	{ "name": "L_Leg_01", "parent": "Body_12", "length": 150, "rotation": -64.52, "x": 161.49, "y": 73.99 },
	{ "name": "L_Leg_11", "parent": "Body_12", "length": 49.51, "rotation": -47.5, "x": 130.5, "y": -59.38 },
	{ "name": "L_Mouth", "parent": "Head", "length": 15.15, "rotation": 15.8, "x": 126.24, "y": 24.81 },
	{ "name": "L_Wing_01", "parent": "Body_12", "length": 58.92, "rotation": 73.39, "x": -64.57, "y": 37.26 },
	{ "name": "L_Wing_11", "parent": "Body_12", "length": 52.69, "rotation": 105.13, "x": -64.57, "y": 37.26 },
	{ "name": "R_Leg_01", "parent": "Body_11", "length": 150, "rotation": 77.61, "x": 172.49, "y": -51.7 },
	{ "name": "R_Leg_11", "parent": "Body_11", "length": 47.54, "rotation": 62.38, "x": 110.56, "y": 80.48 },
	{ "name": "R_Mouth", "parent": "Head", "length": 16.21, "rotation": -14.74, "x": 126.24, "y": -24.69 },
	{ "name": "R_Wing_01", "parent": "Body_11", "length": 57.94, "rotation": -66.58, "x": -61.61, "y": -54.04 },
	{ "name": "R_Wing_11", "parent": "Body_11", "length": 50.03, "rotation": -86.83, "x": -62.52, "y": -54.37 },
	{ "name": "Tail_01", "parent": "Hip", "length": 79.74, "rotation": -89.53, "x": -0.19, "y": 0.32, "color": "8f0303ff" },
	{ "name": "Tail_1", "parent": "Tail_01", "length": 63.26, "rotation": -0.47, "x": 78.42, "y": -0.65, "color": "8f0303ff" },
	{ "name": "Tail_11", "parent": "Tail_1", "length": 38.22, "x": 62.6, "y": -0.66, "color": "8f0303ff" },
	{ "name": "X2", "parent": "X", "x": -0.84, "y": 451.47 },
	{ "name": "X3", "parent": "Body_21", "length": 11.19, "rotation": 179.45, "x": 224.49, "y": -1.01 }
],
"slots": [
	{ "name": "Tail_31", "bone": "Tail_1", "attachment": "Tail_31" },
	{ "name": "Tail_11", "bone": "Tail_11", "attachment": "Tail_11" },
	{ "name": "Tail_01", "bone": "Tail_01", "attachment": "Tail_01" },
	{ "name": "R_Wing_11", "bone": "R_Wing_11", "attachment": "R_Wing_11" },
	{ "name": "R_Wing_01", "bone": "R_Wing_01", "attachment": "R_Wing_01" },
	{ "name": "L_Wing_11", "bone": "L_Wing_11", "attachment": "L_Wing_11" },
	{ "name": "L_Wing_01", "bone": "L_Wing_01", "attachment": "L_Wing_01" },
	{ "name": "Body_21", "bone": "Body_21", "attachment": "Body_21" },
	{ "name": "Body_11", "bone": "Body_12", "attachment": "Body_11" },
	{ "name": "Body_01", "bone": "Body_21", "attachment": "Body_01" },
	{ "name": "L_Mouth", "bone": "L_Mouth", "attachment": "L_Mouth" },
	{ "name": "R_Mouth", "bone": "R_Mouth", "attachment": "R_Mouth" },
	{ "name": "Head", "bone": "Head", "attachment": "Head" },
	{ "name": "Eye", "bone": "Eye", "attachment": "Eye" },
	{ "name": "Anten", "bone": "Head", "attachment": "Anten" },
	{ "name": "Horn", "bone": "Head", "attachment": "Horn" },
	{ "name": "R_Leg_11", "bone": "R_Leg_11", "attachment": "R_Leg_11" },
	{ "name": "L_Leg_11", "bone": "L_Leg_11", "attachment": "L_Leg_11" },
	{ "name": "R_Leg_01", "bone": "R_Leg_01", "attachment": "R_Leg_01" },
	{ "name": "L_Leg_01", "bone": "L_Leg_01", "attachment": "L_Leg_01" }
],
"ik": [
	{
		"name": "Point_L_IK",
		"order": 2,
		"bones": [ "L_Leg_01" ],
		"target": "Point",
		"mix": 0
	},
	{
		"name": "Point_R_IK",
		"order": 1,
		"bones": [ "R_Leg_01" ],
		"target": "Point",
		"mix": 0
	},
	{
		"name": "Pont",
		"order": 0,
		"bones": [ "Tail_01" ],
		"target": "Point"
	}
],
"skins": {
	"default": {
		"Anten": {
			"Anten": { "x": -46.49, "y": -1.4, "rotation": 90, "width": 154, "height": 249 }
		},
		"Body_01": {
			"Body_01": {
				"type": "mesh",
				"uvs": [ 1, 1, 0, 1, 0, 0, 1, 0 ],
				"triangles": [ 1, 2, 3, 1, 3, 0 ],
				"vertices": [ 2, 4, 14.03, -75.74, 0.99895, 24, 76.55, -215.59, 0.00105, 1, 4, 15.49, 77.26, 1, 2, 4, 234.48, 75.17, 0.07214, 24, -76.45, 3.41, 0.92786, 2, 4, 233.02, -77.82, 0.05647, 24, 76.55, 3.41, 0.94353 ],
				"hull": 4,
				"edges": [ 0, 2, 2, 4, 4, 6, 0, 6 ],
				"width": 153,
				"height": 219
			}
		},
		"Body_11": {
			"Body_11": {
				"type": "mesh",
				"uvs": [ 0.18715, 0.11924, 0.3008, 0, 0.49299, 0, 0.72521, 0, 0.83051, 0.11521, 0.93537, 0.22993, 1, 0.38337, 1, 0.77551, 0.88436, 1, 0.78166, 1, 0.63951, 1, 0.61221, 0.94677, 0.59258, 0.9085, 0.49909, 0.91359, 0.40486, 0.91873, 0.38175, 0.95413, 0.35181, 1, 0.24225, 1, 0.14369, 1, 0, 0.8062, 0, 0.39701, 0.07839, 0.23334 ],
				"triangles": [ 21, 15, 16, 17, 20, 16, 17, 18, 19, 15, 0, 14, 20, 21, 16, 15, 21, 0, 1, 14, 0, 19, 20, 17, 8, 9, 7, 7, 9, 6, 6, 9, 10, 5, 6, 10, 11, 5, 10, 11, 12, 4, 3, 4, 12, 5, 11, 4, 2, 13, 14, 1, 2, 14, 13, 2, 12, 3, 12, 2 ],
				"vertices": [ 2, 5, 48.85, 115.96, 0.35817, 6, -32.29, -84.4, 0.64183, 2, 5, 75.32, 73.8, 0.67883, 6, -81.63, -91.05, 0.32117, 1, 5, 75.32, 2.49, 1, 2, 5, 75.32, -83.66, 0.54389, 7, -83.5, 74.61, 0.45611, 2, 5, 49.75, -122.73, 0.24796, 7, -36.88, 77.2, 0.75204, 2, 5, 24.28, -161.63, 0.04423, 7, 9.55, 79.77, 0.95577, 2, 5, -9.78, -185.61, 0.00103, 7, 49.06, 66.57, 0.99897, 1, 7, 100.7, -3.52, 1, 3, 5, -146.67, -142.71, 0.00988, 7, 95.73, -69.09, 0.98723, 6, -186.86, 200.64, 0.00288, 3, 5, -146.68, -104.61, 0.05049, 7, 65.05, -91.69, 0.93238, 6, -152.18, 184.87, 0.01713, 3, 5, -146.67, -51.87, 0.1647, 7, 22.59, -122.97, 0.76314, 6, -104.17, 163.05, 0.07216, 3, 5, -134.86, -41.74, 0.20121, 7, 7.43, -119.47, 0.70143, 6, -99.83, 148.1, 0.09735, 3, 5, -126.36, -34.46, 0.2514, 7, -3.47, -116.95, 0.60763, 6, -96.72, 137.35, 0.14097, 3, 5, -127.49, 0.23, 0.32986, 7, -30.73, -138.43, 0.32602, 6, -64.67, 124.03, 0.34413, 3, 5, -128.63, 35.19, 0.24902, 7, -58.19, -160.09, 0.13271, 6, -32.38, 110.6, 0.61828, 3, 5, -136.49, 43.76, 0.19832, 7, -60.43, -171.5, 0.09107, 6, -21.32, 114.21, 0.7106, 3, 5, -146.67, 54.87, 0.15939, 7, -63.33, -186.29, 0.06614, 6, -7, 118.88, 0.77447, 3, 5, -146.67, 95.52, 0.06488, 7, -96.06, -210.4, 0.02216, 6, 30.01, 102.06, 0.91297, 3, 5, -146.67, 132.08, 0.01452, 7, -125.5, -232.09, 0.00468, 6, 63.3, 86.93, 0.98081, 1, 6, 94.02, 25.7, 1, 2, 5, -12.81, 185.39, 0.00548, 6, 56.43, -56.99, 0.99452, 2, 5, 23.52, 156.31, 0.09274, 6, 14.92, -78.04, 0.90726 ],
				"hull": 22,
				"edges": [ 10, 12, 12, 14, 14, 16, 36, 38, 38, 40, 40, 42, 2, 4, 4, 6, 24, 26, 26, 28, 4, 26, 28, 2, 24, 6, 10, 20, 16, 18, 18, 20, 12, 18, 6, 8, 8, 10, 20, 22, 22, 24, 8, 22, 32, 42, 32, 34, 34, 36, 40, 34, 28, 30, 30, 32, 2, 0, 0, 42, 30, 0 ],
				"width": 371,
				"height": 222
			}
		},
		"Body_21": {
			"Body_21": { "x": 55.69, "y": -7.13, "rotation": -90.55, "width": 214, "height": 242 }
		},
		"Eye": {
			"Eye": { "x": 0.86, "y": -4.71, "rotation": -178.55, "width": 37, "height": 55 }
		},
		"Head": {
			"Head": { "x": 56.01, "y": 0.6, "rotation": 90, "width": 164, "height": 170 }
		},
		"Horn": {
			"Horn": {
				"type": "mesh",
				"uvs": [ 1, 1, 0, 1, 0, 0, 1, 0 ],
				"triangles": [ 1, 2, 3, 1, 3, 0 ],
				"vertices": [ 1, 4, 0.27, -155.61, 1, 1, 4, 3.21, 153.38, 1, 2, 4, 216.2, 151.35, 0.24, 25, 9.74, -152.27, 0.76, 2, 4, 213.26, -157.64, 0.24, 25, 9.74, 156.73, 0.76 ],
				"hull": 4,
				"edges": [ 0, 2, 2, 4, 4, 6, 0, 6 ],
				"width": 309,
				"height": 213
			}
		},
		"L_Leg_11": {
			"L_Leg_11": { "x": 33.23, "y": -1.4, "rotation": 83.88, "width": 36, "height": 116 }
		},
		"L_Mouth": {
			"L_Mouth": { "x": 15.24, "y": -4.02, "rotation": 74.2, "width": 19, "height": 36 }
		},
		"L_Wing_01": {
			"L_Wing_01": { "x": 129.69, "y": 7.82, "rotation": -37, "width": 244, "height": 238 }
		},
		"L_Wing_11": {
			"L_Wing_11": { "x": 114.22, "y": -3.18, "rotation": -68.75, "width": 155, "height": 244 }
		},
		"R_Leg_11": {
			"R_Leg_11": { "x": 32.24, "y": 2.18, "rotation": 93.18, "width": 36, "height": 116 }
		},
		"R_Mouth": {
			"R_Mouth": { "x": 15.3, "y": 3.8, "rotation": 104.74, "width": 19, "height": 36 }
		},
		"R_Wing_01": {
			"R_Wing_01": { "x": 134.65, "y": 7.22, "rotation": -137.86, "width": 244, "height": 238 }
		},
		"R_Wing_11": {
			"R_Wing_11": { "x": 116.65, "y": -4.17, "rotation": -117.61, "width": 156, "height": 244 }
		},
		"Tail_01": {
			"Tail_01": {
				"type": "mesh",
				"uvs": [ 0, 0.25471, 0, 0, 1, 0, 1, 0.24145, 1, 0.50287, 0.88769, 0.66833, 0.7783, 0.82949, 0.66256, 1, 0.32756, 1, 0.21065, 0.82565, 0.10268, 0.66464, 0, 0.51151 ],
				"triangles": [ 7, 8, 6, 8, 9, 6, 6, 9, 5, 9, 10, 5, 5, 10, 11, 4, 5, 11, 11, 0, 4, 0, 3, 4, 0, 1, 3, 1, 2, 3 ],
				"vertices": [ 2, 21, 31.15, -93.14, 0.51196, 22, -46.51, -92.88, 0.48804, 2, 21, -8.33, -92.82, 0.63618, 22, -85.99, -92.88, 0.36382, 2, 21, -6.8, 93.18, 0.84351, 22, -85.99, 93.12, 0.15649, 2, 21, 30.63, 92.87, 0.84048, 22, -48.56, 93.12, 0.15952, 2, 21, 71.15, 92.53, 0.74343, 22, -8.04, 93.12, 0.25657, 2, 21, 96.62, 71.43, 0.5814, 22, 17.6, 72.23, 0.4186, 2, 21, 121.43, 50.88, 0.3518, 22, 42.58, 51.88, 0.6482, 2, 21, 147.68, 29.13, 0.18556, 22, 69.01, 30.35, 0.81444, 2, 21, 147.16, -33.17, 0.03299, 22, 69.01, -31.96, 0.96701, 2, 21, 119.96, -54.7, 0.12281, 22, 41.99, -53.7, 0.87719, 2, 21, 94.84, -74.57, 0.25583, 22, 17.03, -73.78, 0.74417, 2, 21, 70.95, -93.47, 0.38369, 22, -6.7, -92.88, 0.61631 ],
				"hull": 12,
				"edges": [ 2, 4, 14, 16, 22, 8, 2, 0, 0, 22, 4, 6, 6, 8, 0, 6, 20, 22, 8, 10, 20, 10, 16, 18, 18, 20, 10, 12, 12, 14, 18, 12 ],
				"width": 186,
				"height": 155
			}
		},
		"Tail_11": {
			"Tail_11": { "x": 12.41, "y": 0.78, "rotation": 90, "width": 34, "height": 86 }
		},
		"Tail_31": {
			"Tail_31": { "x": 54.01, "y": 0.62, "rotation": 90, "width": 39, "height": 44 }
		}
	},
	"Skin": {},
	"Skin_All": {
		"L_Leg_01": {
			"L_Leg_01": { "x": 52.9, "y": 1.08, "rotation": 93.76, "width": 81, "height": 267 }
		},
		"R_Leg_01": {
			"R_Leg_01": { "x": 58.63, "y": 4.75, "rotation": 84.11, "width": 81, "height": 267 }
		}
	},
	"Skin_L": {
		"L_Leg_01": {
			"L_Leg_01": { "x": 52.9, "y": 1.08, "rotation": 93.76, "width": 81, "height": 267 }
		}
	},
	"Skin_R": {
		"R_Leg_01": {
			"R_Leg_01": { "x": 58.63, "y": 4.75, "rotation": 84.11, "width": 81, "height": 267 }
		}
	}
},
"events": {
	"Attack": {}
},
"animations": {
	"Attack_01": {
		"slots": {
			"Tail_11": {
				"attachment": [
					{ "time": 0.0667, "name": null },
					{ "time": 0.2, "name": "Tail_11" }
				]
			}
		},
		"bones": {
			"R_Wing_01": {
				"rotate": [
					{ "time": 0, "angle": 0 },
					{ "time": 0.0333, "angle": -9.58 },
					{ "time": 0.0667, "angle": -11.04 },
					{ "time": 0.1333, "angle": 0 },
					{ "time": 0.1667, "angle": -10.27 },
					{ "time": 0.2, "angle": 0 }
				],
				"scale": [
					{ "time": 0, "x": 1, "y": 1 },
					{ "time": 0.1333, "x": 1.158, "y": 1.078 },
					{ "time": 0.2, "x": 1, "y": 1 }
				]
			},
			"Tail_11": {
				"translate": [
					{ "time": 0, "x": 0, "y": 0 },
					{ "time": 0.0333, "x": 5.95, "y": -0.06 },
					{ "time": 0.0667, "x": 28.65, "y": 0.05 },
					{ "time": 0.2, "x": 0, "y": 0 }
				]
			},
			"L_Wing_01": {
				"rotate": [
					{ "time": 0, "angle": 0 },
					{ "time": 0.0333, "angle": 10.17 },
					{ "time": 0.0667, "angle": 11.69 },
					{ "time": 0.1333, "angle": 0 },
					{ "time": 0.1667, "angle": 11.07 },
					{ "time": 0.2, "angle": 0 }
				],
				"scale": [
					{ "time": 0, "x": 1, "y": 1 },
					{ "time": 0.1333, "x": 1.158, "y": 1.078 },
					{ "time": 0.2, "x": 1, "y": 1 }
				]
			},
			"X2": {
				"translate": [
					{ "time": 0, "x": 0, "y": 4.61 },
					{ "time": 0.0667, "x": 0, "y": 42.75 },
					{ "time": 0.1, "x": 0, "y": 64.3 },
					{ "time": 0.2, "x": 0, "y": 4.61 }
				],
				"scale": [
					{ "time": 0, "x": 1.492, "y": 1 },
					{ "time": 0.1, "x": 1, "y": 1 },
					{ "time": 0.2, "x": 1.492, "y": 1 }
				]
			},
			"Body_22": {
				"translate": [
					{ "time": 0, "x": 0, "y": 0 },
					{ "time": 0.0667, "x": 13.71, "y": -0.13 },
					{ "time": 0.2, "x": 0, "y": 0 }
				]
			},
			"Tail_01": {
				"translate": [
					{ "time": 0, "x": 0, "y": 19.55 }
				],
				"scale": [
					{ "time": 0, "x": 1, "y": 1.359 },
					{ "time": 0.0667, "x": 1.282, "y": 1.15 },
					{ "time": 0.2, "x": 1, "y": 1.359 }
				]
			},
			"R_Wing_11": {
				"rotate": [
					{ "time": 0, "angle": 16.49 },
					{ "time": 0.0333, "angle": 22.85 },
					{ "time": 0.0667, "angle": 20.51 },
					{ "time": 0.1333, "angle": 11.55 },
					{ "time": 0.1667, "angle": 19.15 },
					{ "time": 0.2, "angle": 16.49 }
				],
				"scale": [
					{ "time": 0, "x": 1, "y": 1 },
					{ "time": 0.1, "x": 1.022, "y": 1.031 },
					{ "time": 0.1333, "x": 1, "y": 1, "curve": "stepped" },
					{ "time": 0.2, "x": 1, "y": 1 }
				]
			},
			"L_Leg_11": {
				"rotate": [
					{ "time": 0, "angle": -25.99 },
					{ "time": 0.0667, "angle": -36.92 },
					{ "time": 0.2, "angle": -25.99 }
				]
			},
			"R_Leg_01": {
				"rotate": [
					{ "time": 0, "angle": 18.99 },
					{ "time": 0.0667, "angle": 28.61 },
					{ "time": 0.2, "angle": 18.99 }
				],
				"translate": [
					{ "time": 0, "x": 77.14, "y": -87.15 },
					{ "time": 0.0667, "x": 87.9, "y": -57.88 },
					{ "time": 0.2, "x": 77.14, "y": -87.15 }
				]
			},
			"Head": {
				"translate": [
					{ "time": 0, "x": -2.07, "y": 0.02 },
					{ "time": 0.0667, "x": 12.38, "y": -0.12 },
					{ "time": 0.2, "x": -2.07, "y": 0.02 }
				],
				"scale": [
					{ "time": 0, "x": 1.08, "y": 1.05 }
				]
			},
			"Body_11": {
				"rotate": [
					{ "time": 0, "angle": -7.22 }
				],
				"translate": [
					{ "time": 0, "x": 31.17, "y": 10.39 }
				]
			},
			"Hip": {
				"translate": [
					{ "time": 0, "x": 14.82, "y": 0 },
					{ "time": 0.0667, "x": 8.22, "y": 0 },
					{ "time": 0.1333, "x": 47.01, "y": 0 },
					{ "time": 0.2, "x": 14.82, "y": 0 }
				]
			},
			"Tail_1": {
				"translate": [
					{ "time": 0, "x": -20.75, "y": 0.14 },
					{ "time": 0.0667, "x": 8.89, "y": -0.06 },
					{ "time": 0.2, "x": -20.75, "y": 0.14 }
				],
				"scale": [
					{ "time": 0, "x": 1, "y": 1 },
					{ "time": 0.0667, "x": 1, "y": 0.822 },
					{ "time": 0.2, "x": 1, "y": 1 }
				]
			},
			"R_Leg_11": {
				"rotate": [
					{ "time": 0, "angle": 21.91 },
					{ "time": 0.0667, "angle": 28.63 },
					{ "time": 0.2, "angle": 21.91 }
				]
			},
			"L_Mouth": {
				"rotate": [
					{ "time": 0, "angle": 0 },
					{ "time": 0.0667, "angle": 22.85 },
					{ "time": 0.1333, "angle": -29.58 },
					{ "time": 0.2, "angle": 0 }
				]
			},
			"L_Wing_11": {
				"rotate": [
					{ "time": 0, "angle": -19.22 },
					{ "time": 0.0333, "angle": -24.04 },
					{ "time": 0.0667, "angle": -19.95 },
					{ "time": 0.1333, "angle": -12.62 },
					{ "time": 0.1667, "angle": -20.94 },
					{ "time": 0.2, "angle": -19.22 }
				],
				"scale": [
					{ "time": 0, "x": 1, "y": 1 },
					{ "time": 0.1, "x": 1.022, "y": 1.031 },
					{ "time": 0.1333, "x": 1, "y": 1, "curve": "stepped" },
					{ "time": 0.2, "x": 1, "y": 1 }
				]
			},
			"X3": {
				"translate": [
					{ "time": 0, "x": -3.68, "y": -1.19 },
					{ "time": 0.0667, "x": 11.53, "y": -1.33 },
					{ "time": 0.2, "x": -3.68, "y": -1.19 }
				],
				"scale": [
					{ "time": 0, "x": 1, "y": 0.841 },
					{ "time": 0.0667, "x": 0.537, "y": 1.301 },
					{ "time": 0.2, "x": 1, "y": 0.841 }
				]
			},
			"L_Leg_01": {
				"rotate": [
					{ "time": 0, "angle": -20.89 },
					{ "time": 0.0667, "angle": -27.06 },
					{ "time": 0.2, "angle": -20.89 }
				],
				"translate": [
					{ "time": 0, "x": 54.98, "y": 95.7 },
					{ "time": 0.0667, "x": 62.33, "y": 82.72 },
					{ "time": 0.2, "x": 54.98, "y": 95.7 }
				]
			},
			"R_Mouth": {
				"rotate": [
					{ "time": 0, "angle": 0 },
					{ "time": 0.0667, "angle": -22.91 },
					{ "time": 0.1333, "angle": 27.5 },
					{ "time": 0.2, "angle": 0 }
				]
			},
			"Body_12": {
				"rotate": [
					{ "time": 0, "angle": 9.44 }
				],
				"translate": [
					{ "time": 0, "x": 20.78, "y": -12.47 }
				]
			}
		},
		"events": [
			{ "time": 0.1, "name": "Attack" }
		]
	},
	"Attack_02": {
		"bones": {
			"R_Wing_01": {
				"rotate": [
					{ "time": 0, "angle": 0 },
					{ "time": 0.0333, "angle": -9.58 },
					{ "time": 0.0667, "angle": 2.82 },
					{ "time": 0.1, "angle": -11.04 },
					{ "time": 0.1333, "angle": 0 },
					{ "time": 0.1667, "angle": -10.27 },
					{ "time": 0.2, "angle": 6.79 },
					{ "time": 0.2333, "angle": -7.43 },
					{ "time": 0.2667, "angle": 2.82 },
					{ "time": 0.3, "angle": -11.04 },
					{ "time": 0.3333, "angle": -10.27 },
					{ "time": 0.3667, "angle": 6.79 },
					{ "time": 0.4, "angle": -7.43 },
					{ "time": 0.4333, "angle": 0 },
					{ "time": 0.4667, "angle": -10.27 },
					{ "time": 0.5, "angle": 6.79 },
					{ "time": 0.5333, "angle": 0, "curve": "stepped" },
					{ "time": 0.8, "angle": 0 }
				],
				"translate": [
					{ "time": 0, "x": 0, "y": 0 }
				],
				"scale": [
					{ "time": 0, "x": 1, "y": 1 },
					{ "time": 0.1333, "x": 1.158, "y": 1.078 },
					{ "time": 0.2667, "x": 1, "y": 1, "curve": "stepped" },
					{ "time": 0.3, "x": 1, "y": 1 },
					{ "time": 0.3333, "x": 1.158, "y": 1.078 },
					{ "time": 0.4, "x": 1, "y": 1 },
					{ "time": 0.4333, "x": 1.158, "y": 1.078 },
					{ "time": 0.5333, "x": 1, "y": 1, "curve": "stepped" },
					{ "time": 0.8, "x": 1, "y": 1 }
				]
			},
			"L_Wing_01": {
				"rotate": [
					{ "time": 0, "angle": 0 },
					{ "time": 0.0333, "angle": 10.17 },
					{ "time": 0.0667, "angle": -2.46 },
					{ "time": 0.1, "angle": 11.69 },
					{ "time": 0.1333, "angle": 0 },
					{ "time": 0.1667, "angle": 11.07 },
					{ "time": 0.2, "angle": -7.1 },
					{ "time": 0.2333, "angle": 6.87 },
					{ "time": 0.2667, "angle": -2.46 },
					{ "time": 0.3, "angle": 11.69 },
					{ "time": 0.3333, "angle": 11.07 },
					{ "time": 0.3667, "angle": -7.1 },
					{ "time": 0.4, "angle": 6.87 },
					{ "time": 0.4333, "angle": 0 },
					{ "time": 0.4667, "angle": 11.07 },
					{ "time": 0.5, "angle": -7.1 },
					{ "time": 0.5333, "angle": 0, "curve": "stepped" },
					{ "time": 0.8, "angle": 0 }
				],
				"translate": [
					{ "time": 0, "x": 0, "y": 0 }
				],
				"scale": [
					{ "time": 0, "x": 1, "y": 1 },
					{ "time": 0.1333, "x": 1.158, "y": 1.078 },
					{ "time": 0.2667, "x": 1, "y": 1, "curve": "stepped" },
					{ "time": 0.3, "x": 1, "y": 1 },
					{ "time": 0.3333, "x": 1.158, "y": 1.078 },
					{ "time": 0.4, "x": 1, "y": 1 },
					{ "time": 0.4333, "x": 1.158, "y": 1.078 },
					{ "time": 0.5333, "x": 1, "y": 1, "curve": "stepped" },
					{ "time": 0.8, "x": 1, "y": 1 }
				]
			},
			"X2": {
				"rotate": [
					{ "time": 0, "angle": 0 }
				],
				"translate": [
					{ "time": 0, "x": 0, "y": -25.04 },
					{ "time": 0.2, "x": 0, "y": 142.95 },
					{ "time": 0.5333, "x": 0, "y": 226.14 },
					{ "time": 0.8, "x": 0, "y": -25.04 }
				],
				"scale": [
					{ "time": 0, "x": 1.492, "y": 1, "curve": "stepped" },
					{ "time": 0.8, "x": 1.492, "y": 1 }
				]
			},
			"Tail_01": {
				"rotate": [
					{ "time": 0, "angle": 0 }
				],
				"translate": [
					{ "time": 0, "x": 0, "y": 43.98 },
					{ "time": 0.2, "x": 0, "y": 50.54 },
					{ "time": 0.3333, "x": 0, "y": 89.67 },
					{ "time": 0.8, "x": 0, "y": 43.98 }
				],
				"scale": [
					{ "time": 0, "x": 1, "y": 1.359, "curve": "stepped" },
					{ "time": 0.8, "x": 1, "y": 1.359 }
				]
			},
			"R_Wing_11": {
				"rotate": [
					{ "time": 0, "angle": 16.49 },
					{ "time": 0.0333, "angle": 22.85 },
					{ "time": 0.0667, "angle": 11.33 },
					{ "time": 0.1, "angle": 20.51 },
					{ "time": 0.1333, "angle": 11.55 },
					{ "time": 0.1667, "angle": 19.15 },
					{ "time": 0.2, "angle": 11.23 },
					{ "time": 0.2333, "angle": 16.7 },
					{ "time": 0.2667, "angle": 11.33 },
					{ "time": 0.3, "angle": 20.51 },
					{ "time": 0.3333, "angle": 19.15 },
					{ "time": 0.3667, "angle": 11.23 },
					{ "time": 0.4, "angle": 16.7 },
					{ "time": 0.4333, "angle": 11.55 },
					{ "time": 0.4667, "angle": 19.15 },
					{ "time": 0.5, "angle": 11.23 },
					{ "time": 0.5333, "angle": 0, "curve": "stepped" },
					{ "time": 0.8, "angle": 0 }
				],
				"translate": [
					{ "time": 0, "x": 0, "y": 0 }
				],
				"scale": [
					{ "time": 0, "x": 1, "y": 1 },
					{ "time": 0.0667, "x": 1.022, "y": 1.031 },
					{ "time": 0.1333, "x": 1, "y": 1 },
					{ "time": 0.2, "x": 1.14, "y": 0.897 },
					{ "time": 0.2667, "x": 1.022, "y": 1.031 },
					{ "time": 0.3333, "x": 1, "y": 1 },
					{ "time": 0.3667, "x": 1.14, "y": 0.897 },
					{ "time": 0.4, "x": 1, "y": 1, "curve": "stepped" },
					{ "time": 0.4333, "x": 1, "y": 1 },
					{ "time": 0.5, "x": 1.14, "y": 0.897 },
					{ "time": 0.5333, "x": 1, "y": 1, "curve": "stepped" },
					{ "time": 0.8, "x": 1, "y": 1 }
				]
			},
			"L_Leg_11": {
				"rotate": [
					{ "time": 0, "angle": -25.99 },
					{ "time": 0.2, "angle": -49.6 },
					{ "time": 0.4333, "angle": -23.42 },
					{ "time": 0.5333, "angle": -6.34 },
					{ "time": 0.8, "angle": -25.99 }
				],
				"translate": [
					{ "time": 0, "x": -50.38, "y": 26.61, "curve": "stepped" },
					{ "time": 0.8, "x": -50.38, "y": 26.61 }
				],
				"scale": [
					{ "time": 0, "x": 1, "y": 1 }
				]
			},
			"R_Leg_01": {
				"rotate": [
					{ "time": 0, "angle": 18.99, "curve": "stepped" },
					{ "time": 0.2, "angle": 18.99 },
					{ "time": 0.2667, "angle": 20.76 },
					{ "time": 0.3333, "angle": 79.9 },
					{ "time": 0.3667, "angle": 90.81, "curve": "stepped" },
					{ "time": 0.5333, "angle": 90.81 },
					{ "time": 0.8, "angle": 18.99 }
				],
				"translate": [
					{ "time": 0, "x": 126.88, "y": -255.44 },
					{ "time": 0.2, "x": 159.75, "y": -334.43 },
					{ "time": 0.2667, "x": 211.71, "y": 220.86 },
					{ "time": 0.3333, "x": 115.45, "y": 334.95 },
					{ "time": 0.3667, "x": -86.95, "y": 476.3, "curve": "stepped" },
					{ "time": 0.5333, "x": -86.95, "y": 476.3 },
					{ "time": 0.6667, "x": 211.4, "y": 104.98 },
					{ "time": 0.8, "x": 126.88, "y": -255.44 }
				],
				"scale": [
					{ "time": 0, "x": 1, "y": 1 }
				]
			},
			"Head": {
				"rotate": [
					{ "time": 0, "angle": 0 }
				],
				"translate": [
					{ "time": 0, "x": -23.93, "y": 0.23 },
					{ "time": 0.2, "x": 18.23, "y": -0.17 },
					{ "time": 0.5333, "x": 30.01, "y": -0.29 },
					{ "time": 0.8, "x": -23.93, "y": 0.23 }
				],
				"scale": [
					{ "time": 0, "x": 1.236, "y": 1.05, "curve": "stepped" },
					{ "time": 0.8, "x": 1.236, "y": 1.05 }
				]
			},
			"Body_11": {
				"rotate": [
					{ "time": 0, "angle": -22.81, "curve": "stepped" },
					{ "time": 0.8, "angle": -22.81 }
				],
				"translate": [
					{ "time": 0, "x": 31.17, "y": 10.39, "curve": "stepped" },
					{ "time": 0.8, "x": 31.17, "y": 10.39 }
				],
				"scale": [
					{ "time": 0, "x": 1, "y": 1 }
				]
			},
			"Hip": {
				"rotate": [
					{ "time": 0, "angle": 0 }
				],
				"translate": [
					{ "time": 0, "x": -53.15, "y": 0, "curve": "stepped" },
					{ "time": 0.8, "x": -53.15, "y": 0 }
				],
				"scale": [
					{ "time": 0, "x": 1, "y": 1 }
				]
			},
			"Tail_1": {
				"rotate": [
					{ "time": 0, "angle": 0 }
				],
				"translate": [
					{ "time": 0, "x": -20.75, "y": 0.14 },
					{ "time": 0.2, "x": 23.48, "y": -0.13 },
					{ "time": 0.3333, "x": -212.98, "y": 1.31 },
					{ "time": 0.5333, "x": -208.95, "y": 1.29 },
					{ "time": 0.8, "x": -20.75, "y": 0.14 }
				],
				"scale": [
					{ "time": 0, "x": 1, "y": 1 }
				]
			},
			"R_Leg_11": {
				"rotate": [
					{ "time": 0, "angle": 21.91 },
					{ "time": 0.2, "angle": 45.02 },
					{ "time": 0.5333, "angle": 7.52 },
					{ "time": 0.8, "angle": 21.91 }
				],
				"translate": [
					{ "time": 0, "x": -37.32, "y": -37.16, "curve": "stepped" },
					{ "time": 0.8, "x": -37.32, "y": -37.16 }
				],
				"scale": [
					{ "time": 0, "x": 1, "y": 1 }
				]
			},
			"L_Wing_11": {
				"rotate": [
					{ "time": 0, "angle": -19.22 },
					{ "time": 0.0333, "angle": -24.04 },
					{ "time": 0.0667, "angle": -11.97 },
					{ "time": 0.1, "angle": -19.95 },
					{ "time": 0.1333, "angle": -12.62 },
					{ "time": 0.1667, "angle": -20.94 },
					{ "time": 0.2, "angle": -12.56 },
					{ "time": 0.2333, "angle": -18.83 },
					{ "time": 0.2667, "angle": -11.97 },
					{ "time": 0.3, "angle": -19.95 },
					{ "time": 0.3333, "angle": -20.94 },
					{ "time": 0.3667, "angle": -12.56 },
					{ "time": 0.4, "angle": -18.83 },
					{ "time": 0.4333, "angle": -12.62 },
					{ "time": 0.4667, "angle": -20.94 },
					{ "time": 0.5, "angle": -12.56 },
					{ "time": 0.5333, "angle": 0, "curve": "stepped" },
					{ "time": 0.8, "angle": 0 }
				],
				"translate": [
					{ "time": 0, "x": 0, "y": 0 }
				],
				"scale": [
					{ "time": 0, "x": 1, "y": 1 },
					{ "time": 0.0667, "x": 1.022, "y": 1.031 },
					{ "time": 0.1333, "x": 1, "y": 1 },
					{ "time": 0.2, "x": 1.14, "y": 0.897 },
					{ "time": 0.2667, "x": 1.022, "y": 1.031 },
					{ "time": 0.3333, "x": 1, "y": 1 },
					{ "time": 0.3667, "x": 1.14, "y": 0.897 },
					{ "time": 0.4, "x": 1, "y": 1, "curve": "stepped" },
					{ "time": 0.4333, "x": 1, "y": 1 },
					{ "time": 0.5, "x": 1.14, "y": 0.897 },
					{ "time": 0.5333, "x": 1, "y": 1, "curve": "stepped" },
					{ "time": 0.8, "x": 1, "y": 1 }
				]
			},
			"X3": {
				"rotate": [
					{ "time": 0, "angle": 0 }
				],
				"translate": [
					{ "time": 0, "x": -3.68, "y": -1.19 },
					{ "time": 0.3333, "x": -0.25, "y": -1.22 },
					{ "time": 0.8, "x": -3.68, "y": -1.19 }
				],
				"scale": [
					{ "time": 0, "x": 1, "y": 0.841, "curve": "stepped" },
					{ "time": 0.8, "x": 1, "y": 0.841 }
				]
			},
			"L_Leg_01": {
				"rotate": [
					{ "time": 0, "angle": -20.89, "curve": "stepped" },
					{ "time": 0.2, "angle": -20.89 },
					{ "time": 0.2667, "angle": -25.87 },
					{ "time": 0.3333, "angle": -80.36 },
					{ "time": 0.3667, "angle": -93.58, "curve": "stepped" },
					{ "time": 0.5333, "angle": -93.58 },
					{ "time": 0.8, "angle": -20.89 }
				],
				"translate": [
					{ "time": 0, "x": 59.07, "y": 302.52 },
					{ "time": 0.2, "x": 121.85, "y": 373.05 },
					{ "time": 0.2667, "x": 254.2, "y": -172.22 },
					{ "time": 0.3333, "x": 151.35, "y": -304.16 },
					{ "time": 0.3667, "x": -20.22, "y": -472.05, "curve": "stepped" },
					{ "time": 0.5333, "x": -20.22, "y": -472.05 },
					{ "time": 0.6667, "x": 181.07, "y": -56.16 },
					{ "time": 0.8, "x": 59.07, "y": 302.52 }
				],
				"scale": [
					{ "time": 0, "x": 1, "y": 1 }
				]
			},
			"Body_12": {
				"rotate": [
					{ "time": 0, "angle": 26.35, "curve": "stepped" },
					{ "time": 0.8, "angle": 26.35 }
				],
				"translate": [
					{ "time": 0, "x": 20.78, "y": -12.47, "curve": "stepped" },
					{ "time": 0.8, "x": 20.78, "y": -12.47 }
				],
				"scale": [
					{ "time": 0, "x": 1, "y": 1 }
				]
			},
			"Body_22": {
				"rotate": [
					{ "time": 0, "angle": 0 }
				],
				"translate": [
					{ "time": 0, "x": 0, "y": 0 },
					{ "time": 0.5333, "x": -21.92, "y": 0.21 }
				],
				"scale": [
					{ "time": 0, "x": 1, "y": 1 }
				]
			},
			"Y": {
				"rotate": [
					{ "time": 0, "angle": 0 }
				],
				"translate": [
					{ "time": 0, "x": 0, "y": 0 }
				],
				"scale": [
					{ "time": 0, "x": 1, "y": 1 }
				]
			},
			"Eye": {
				"rotate": [
					{ "time": 0, "angle": 0 }
				],
				"translate": [
					{ "time": 0, "x": 0, "y": 0 }
				],
				"scale": [
					{ "time": 0, "x": 1, "y": 1 }
				]
			},
			"Body_21": {
				"rotate": [
					{ "time": 0, "angle": 0 }
				],
				"translate": [
					{ "time": 0, "x": 0, "y": 0 }
				],
				"scale": [
					{ "time": 0, "x": 1, "y": 1 }
				]
			},
			"X": {
				"rotate": [
					{ "time": 0, "angle": 0 }
				],
				"translate": [
					{ "time": 0, "x": 0, "y": 0 }
				],
				"scale": [
					{ "time": 0, "x": 1, "y": 1 }
				]
			},
			"R_Mouth": {
				"rotate": [
					{ "time": 0, "angle": 0 }
				],
				"translate": [
					{ "time": 0, "x": 0, "y": 0 }
				],
				"scale": [
					{ "time": 0, "x": 1, "y": 1 }
				]
			},
			"Tail_11": {
				"rotate": [
					{ "time": 0, "angle": 0 }
				],
				"translate": [
					{ "time": 0, "x": 0, "y": 0 }
				],
				"scale": [
					{ "time": 0, "x": 1, "y": 1 }
				]
			},
			"L_Mouth": {
				"rotate": [
					{ "time": 0, "angle": 0 }
				],
				"translate": [
					{ "time": 0, "x": 0, "y": 0 }
				],
				"scale": [
					{ "time": 0, "x": 1, "y": 1 }
				]
			}
		},
		"ik": {
			"Pont": [
				{ "time": 0, "mix": 0, "curve": "stepped" },
				{ "time": 0.8, "mix": 0 }
			]
		},
		"events": [
			{ "time": 0.2, "name": "Attack" }
		]
	},
	"Attack_01_Open": {
		"bones": {
			"R_Wing_01": {
				"rotate": [
					{ "time": 0, "angle": 0 },
					{ "time": 0.0667, "angle": -9.58 },
					{ "time": 0.1333, "angle": 2.82 },
					{ "time": 0.2, "angle": -11.04 },
					{ "time": 0.2667, "angle": 0 },
					{ "time": 0.3333, "angle": -10.27 },
					{ "time": 0.4, "angle": 6.79 },
					{ "time": 0.4667, "angle": -7.43 },
					{ "time": 0.5333, "angle": 0 }
				],
				"scale": [
					{ "time": 0, "x": 1, "y": 1 },
					{ "time": 0.2667, "x": 1.158, "y": 1.078 },
					{ "time": 0.5333, "x": 1, "y": 1 }
				]
			},
			"Tail_11": {
				"scale": [
					{ "time": 0, "x": 1, "y": 1 },
					{ "time": 0.2, "x": 1.262, "y": 1 },
					{ "time": 0.5333, "x": 1, "y": 1 }
				]
			},
			"L_Wing_01": {
				"rotate": [
					{ "time": 0, "angle": 0 },
					{ "time": 0.0667, "angle": 10.17 },
					{ "time": 0.1333, "angle": -2.46 },
					{ "time": 0.2, "angle": 11.69 },
					{ "time": 0.2667, "angle": 0 },
					{ "time": 0.3333, "angle": 11.07 },
					{ "time": 0.4, "angle": -7.1 },
					{ "time": 0.4667, "angle": 6.87 },
					{ "time": 0.5333, "angle": 0 }
				],
				"scale": [
					{ "time": 0, "x": 1, "y": 1 },
					{ "time": 0.2667, "x": 1.158, "y": 1.078 },
					{ "time": 0.5333, "x": 1, "y": 1 }
				]
			},
			"X2": {
				"translate": [
					{ "time": 0, "x": 0, "y": 0 },
					{ "time": 0.2, "x": 0, "y": -19.31 },
					{ "time": 0.5333, "x": 0, "y": 4.61 }
				],
				"scale": [
					{ "time": 0, "x": 1, "y": 1 },
					{ "time": 0.5333, "x": 1.492, "y": 1 }
				]
			},
			"Tail_01": {
				"translate": [
					{ "time": 0, "x": 0, "y": 0 },
					{ "time": 0.2, "x": 0, "y": -2.74 },
					{ "time": 0.5333, "x": 0, "y": 19.55 }
				],
				"scale": [
					{ "time": 0, "x": 1, "y": 1 },
					{ "time": 0.2, "x": 1, "y": 1.077 },
					{ "time": 0.5333, "x": 1, "y": 1.359 }
				]
			},
			"R_Wing_11": {
				"rotate": [
					{ "time": 0, "angle": 0 },
					{ "time": 0.0667, "angle": 22.85 },
					{ "time": 0.1333, "angle": 20.23 },
					{ "time": 0.2, "angle": 20.51 },
					{ "time": 0.2667, "angle": 16.96 },
					{ "time": 0.3333, "angle": 19.15 },
					{ "time": 0.4, "angle": 24.26 },
					{ "time": 0.4667, "angle": 16.7 },
					{ "time": 0.5333, "angle": 16.49 }
				],
				"scale": [
					{ "time": 0, "x": 1, "y": 1 },
					{ "time": 0.1333, "x": 1.022, "y": 1.031 },
					{ "time": 0.2667, "x": 1, "y": 1 },
					{ "time": 0.4, "x": 1.14, "y": 0.897 },
					{ "time": 0.5333, "x": 1, "y": 1 }
				]
			},
			"L_Leg_11": {
				"rotate": [
					{ "time": 0, "angle": -8.42 },
					{ "time": 0.2, "angle": -23.87 },
					{ "time": 0.5333, "angle": -25.99 }
				]
			},
			"R_Leg_01": {
				"rotate": [
					{ "time": 0, "angle": 0 },
					{ "time": 0.5333, "angle": 18.99 }
				],
				"translate": [
					{ "time": 0, "x": 0, "y": 0 },
					{ "time": 0.5333, "x": 77.14, "y": -87.15 }
				]
			},
			"Head": {
				"translate": [
					{
						"time": 0,
						"x": 2.91,
						"y": -0.03,
						"curve": [ 0.25, 0, 0.75, 1 ]
					},
					{ "time": 0.5333, "x": -2.07, "y": 0.02 }
				],
				"scale": [
					{ "time": 0, "x": 1, "y": 1 },
					{ "time": 0.5333, "x": 1.08, "y": 1.05 }
				]
			},
			"Body_11": {
				"rotate": [
					{ "time": 0, "angle": 0 },
					{ "time": 0.5333, "angle": -7.22 }
				],
				"translate": [
					{ "time": 0, "x": 0, "y": 0 },
					{ "time": 0.5333, "x": 31.17, "y": 10.39 }
				]
			},
			"Hip": {
				"translate": [
					{
						"time": 0,
						"x": 0,
						"y": 0,
						"curve": [ 0.25, 0, 0.75, 1 ]
					},
					{ "time": 0.5333, "x": 14.82, "y": 0 }
				]
			},
			"Tail_1": {
				"translate": [
					{ "time": 0, "x": 0, "y": 0 },
					{ "time": 0.2, "x": 6.32, "y": -0.05 },
					{ "time": 0.5333, "x": -20.75, "y": 0.14 }
				]
			},
			"R_Leg_11": {
				"rotate": [
					{ "time": 0, "angle": 9.38 },
					{ "time": 0.2, "angle": 22.91 },
					{ "time": 0.5333, "angle": 21.91 }
				]
			},
			"L_Mouth": {
				"rotate": [
					{ "time": 0, "angle": 0 },
					{ "time": 0.1333, "angle": -28.59 },
					{ "time": 0.2667, "angle": 21.35 },
					{ "time": 0.4, "angle": -22.88 },
					{ "time": 0.5333, "angle": 0 }
				]
			},
			"L_Wing_11": {
				"rotate": [
					{ "time": 0, "angle": 0 },
					{ "time": 0.0667, "angle": -24.04 },
					{ "time": 0.1333, "angle": -19.65 },
					{ "time": 0.2, "angle": -19.95 },
					{ "time": 0.2667, "angle": -18.21 },
					{ "time": 0.3333, "angle": -20.94 },
					{ "time": 0.4, "angle": -28.63 },
					{ "time": 0.4667, "angle": -18.83 },
					{ "time": 0.5333, "angle": -19.22 }
				],
				"scale": [
					{ "time": 0, "x": 1, "y": 1 },
					{ "time": 0.1333, "x": 1.022, "y": 1.031 },
					{ "time": 0.2667, "x": 1, "y": 1 },
					{ "time": 0.4, "x": 1.14, "y": 0.897 },
					{ "time": 0.5333, "x": 1, "y": 1 }
				]
			},
			"X3": {
				"translate": [
					{ "time": 0, "x": 0, "y": 0 },
					{ "time": 0.2, "x": -2.26, "y": -0.44 },
					{ "time": 0.5333, "x": -3.68, "y": -1.19 }
				],
				"scale": [
					{ "time": 0, "x": 1, "y": 1 },
					{ "time": 0.2, "x": 1, "y": 1.056 },
					{ "time": 0.5333, "x": 1, "y": 0.841 }
				]
			},
			"L_Leg_01": {
				"rotate": [
					{ "time": 0, "angle": 0 },
					{ "time": 0.5333, "angle": -20.89 }
				],
				"translate": [
					{ "time": 0, "x": 0, "y": 0 },
					{ "time": 0.5333, "x": 54.98, "y": 95.7 }
				]
			},
			"R_Mouth": {
				"rotate": [
					{ "time": 0, "angle": 0 },
					{ "time": 0.1333, "angle": 25.51 },
					{ "time": 0.2667, "angle": -29.12 },
					{ "time": 0.4, "angle": 26.59 },
					{ "time": 0.5333, "angle": 0 }
				]
			},
			"Body_12": {
				"rotate": [
					{ "time": 0, "angle": 0 },
					{ "time": 0.5333, "angle": 9.44 }
				],
				"translate": [
					{ "time": 0, "x": 0, "y": 0 },
					{ "time": 0.5333, "x": 20.78, "y": -12.47 }
				]
			}
		}
	},
	"Attack_02_Open": {
		"bones": {
			"R_Wing_01": {
				"rotate": [
					{ "time": 0, "angle": 0 },
					{ "time": 0.0667, "angle": -9.58 },
					{ "time": 0.1333, "angle": 2.82 },
					{ "time": 0.2, "angle": -11.04 },
					{ "time": 0.2667, "angle": 0 },
					{ "time": 0.3333, "angle": -10.27 },
					{ "time": 0.4, "angle": 6.79 },
					{ "time": 0.4667, "angle": -7.43 },
					{ "time": 0.5333, "angle": 0 }
				],
				"translate": [
					{ "time": 0.5333, "x": 0, "y": 0 }
				],
				"scale": [
					{ "time": 0, "x": 1, "y": 1 },
					{ "time": 0.2667, "x": 1.158, "y": 1.078 },
					{ "time": 0.5333, "x": 1, "y": 1 }
				]
			},
			"Tail_11": {
				"rotate": [
					{ "time": 0.5333, "angle": 0 }
				],
				"translate": [
					{ "time": 0.5333, "x": 0, "y": 0 }
				],
				"scale": [
					{ "time": 0, "x": 1, "y": 1 },
					{ "time": 0.2, "x": 1.262, "y": 1 },
					{ "time": 0.5333, "x": 1, "y": 1 }
				]
			},
			"L_Wing_01": {
				"rotate": [
					{ "time": 0, "angle": 0 },
					{ "time": 0.0667, "angle": 10.17 },
					{ "time": 0.1333, "angle": -2.46 },
					{ "time": 0.2, "angle": 11.69 },
					{ "time": 0.2667, "angle": 0 },
					{ "time": 0.3333, "angle": 11.07 },
					{ "time": 0.4, "angle": -7.1 },
					{ "time": 0.4667, "angle": 6.87 },
					{ "time": 0.5333, "angle": 0 }
				],
				"translate": [
					{ "time": 0.5333, "x": 0, "y": 0 }
				],
				"scale": [
					{ "time": 0, "x": 1, "y": 1 },
					{ "time": 0.2667, "x": 1.158, "y": 1.078 },
					{ "time": 0.5333, "x": 1, "y": 1 }
				]
			},
			"X2": {
				"rotate": [
					{ "time": 0.5333, "angle": 0 }
				],
				"translate": [
					{ "time": 0, "x": 0, "y": 0 },
					{ "time": 0.2, "x": 0, "y": -19.31 },
					{ "time": 0.5333, "x": 0, "y": -25.04 }
				],
				"scale": [
					{ "time": 0, "x": 1, "y": 1 },
					{ "time": 0.5333, "x": 1.492, "y": 1 }
				]
			},
			"Tail_01": {
				"rotate": [
					{ "time": 0.5333, "angle": 0 }
				],
				"translate": [
					{ "time": 0, "x": 0, "y": 0 },
					{ "time": 0.2, "x": 0, "y": -2.74 },
					{ "time": 0.5333, "x": 0, "y": 43.98 }
				],
				"scale": [
					{ "time": 0, "x": 1, "y": 1 },
					{ "time": 0.2, "x": 1, "y": 1.077 },
					{ "time": 0.5333, "x": 1, "y": 1.359 }
				]
			},
			"R_Wing_11": {
				"rotate": [
					{ "time": 0, "angle": 0 },
					{ "time": 0.0667, "angle": 22.85 },
					{ "time": 0.1333, "angle": 20.23 },
					{ "time": 0.2, "angle": 20.51 },
					{ "time": 0.2667, "angle": 16.96 },
					{ "time": 0.3333, "angle": 19.15 },
					{ "time": 0.4, "angle": 24.26 },
					{ "time": 0.4667, "angle": 16.7 },
					{ "time": 0.5333, "angle": 16.49 }
				],
				"translate": [
					{ "time": 0.5333, "x": 0, "y": 0 }
				],
				"scale": [
					{ "time": 0, "x": 1, "y": 1 },
					{ "time": 0.1333, "x": 1.022, "y": 1.031 },
					{ "time": 0.2667, "x": 1, "y": 1 },
					{ "time": 0.4, "x": 1.14, "y": 0.897 },
					{ "time": 0.5333, "x": 1, "y": 1 }
				]
			},
			"L_Leg_11": {
				"rotate": [
					{ "time": 0, "angle": -8.42 },
					{ "time": 0.2, "angle": -23.87 },
					{ "time": 0.5333, "angle": -25.99 }
				],
				"translate": [
					{ "time": 0, "x": 0, "y": 0 },
					{ "time": 0.5333, "x": -50.38, "y": 26.61 }
				],
				"scale": [
					{ "time": 0.5333, "x": 1, "y": 1 }
				]
			},
			"R_Leg_01": {
				"rotate": [
					{ "time": 0, "angle": 0 },
					{ "time": 0.2, "angle": 14.24 },
					{ "time": 0.5333, "angle": 18.99 }
				],
				"translate": [
					{ "time": 0, "x": 0, "y": 0 },
					{ "time": 0.2, "x": 38.02, "y": -175.32 },
					{ "time": 0.5333, "x": 126.88, "y": -255.44 }
				],
				"scale": [
					{ "time": 0.5333, "x": 1, "y": 1 }
				]
			},
			"Head": {
				"rotate": [
					{ "time": 0.5333, "angle": 0 }
				],
				"translate": [
					{
						"time": 0,
						"x": 2.91,
						"y": -0.03,
						"curve": [ 0.25, 0, 0.75, 1 ]
					},
					{ "time": 0.5333, "x": -23.93, "y": 0.23 }
				],
				"scale": [
					{ "time": 0, "x": 1, "y": 1 },
					{ "time": 0.5333, "x": 1.236, "y": 1.05 }
				]
			},
			"Body_11": {
				"rotate": [
					{ "time": 0, "angle": 0 },
					{ "time": 0.5333, "angle": -22.81 }
				],
				"translate": [
					{ "time": 0, "x": 0, "y": 0 },
					{ "time": 0.2, "x": -1.23, "y": 14.97 },
					{ "time": 0.5333, "x": 31.17, "y": 10.39 }
				],
				"scale": [
					{ "time": 0.5333, "x": 1, "y": 1 }
				]
			},
			"Hip": {
				"rotate": [
					{ "time": 0.5333, "angle": 0 }
				],
				"translate": [
					{
						"time": 0,
						"x": 0,
						"y": 0,
						"curve": [ 0.25, 0, 0.75, 1 ]
					},
					{ "time": 0.5333, "x": -53.15, "y": 0 }
				],
				"scale": [
					{ "time": 0.5333, "x": 1, "y": 1 }
				]
			},
			"Tail_1": {
				"rotate": [
					{ "time": 0.5333, "angle": 0 }
				],
				"translate": [
					{ "time": 0, "x": 0, "y": 0 },
					{ "time": 0.2, "x": 6.32, "y": -0.05 },
					{ "time": 0.5333, "x": -20.75, "y": 0.14 }
				],
				"scale": [
					{ "time": 0.5333, "x": 1, "y": 1 }
				]
			},
			"R_Leg_11": {
				"rotate": [
					{ "time": 0, "angle": 9.38 },
					{ "time": 0.2, "angle": 22.91 },
					{ "time": 0.5333, "angle": 21.91 }
				],
				"translate": [
					{ "time": 0, "x": 0, "y": 0 },
					{ "time": 0.5333, "x": -37.32, "y": -37.16 }
				],
				"scale": [
					{ "time": 0.5333, "x": 1, "y": 1 }
				]
			},
			"L_Mouth": {
				"rotate": [
					{ "time": 0, "angle": 0 },
					{ "time": 0.1333, "angle": -28.59 },
					{ "time": 0.2667, "angle": 21.35 },
					{ "time": 0.4, "angle": -22.88 },
					{ "time": 0.5333, "angle": 0 }
				],
				"translate": [
					{ "time": 0.5333, "x": 0, "y": 0 }
				],
				"scale": [
					{ "time": 0.5333, "x": 1, "y": 1 }
				]
			},
			"L_Wing_11": {
				"rotate": [
					{ "time": 0, "angle": 0 },
					{ "time": 0.0667, "angle": -24.04 },
					{ "time": 0.1333, "angle": -19.65 },
					{ "time": 0.2, "angle": -19.95 },
					{ "time": 0.2667, "angle": -18.21 },
					{ "time": 0.3333, "angle": -20.94 },
					{ "time": 0.4, "angle": -28.63 },
					{ "time": 0.4667, "angle": -18.83 },
					{ "time": 0.5333, "angle": -19.22 }
				],
				"translate": [
					{ "time": 0.5333, "x": 0, "y": 0 }
				],
				"scale": [
					{ "time": 0, "x": 1, "y": 1 },
					{ "time": 0.1333, "x": 1.022, "y": 1.031 },
					{ "time": 0.2667, "x": 1, "y": 1 },
					{ "time": 0.4, "x": 1.14, "y": 0.897 },
					{ "time": 0.5333, "x": 1, "y": 1 }
				]
			},
			"X3": {
				"rotate": [
					{ "time": 0.5333, "angle": 0 }
				],
				"translate": [
					{ "time": 0, "x": 0, "y": 0 },
					{ "time": 0.2, "x": -2.26, "y": -0.44 },
					{ "time": 0.5333, "x": -3.68, "y": -1.19 }
				],
				"scale": [
					{ "time": 0, "x": 1, "y": 1 },
					{ "time": 0.2, "x": 1, "y": 1.056 },
					{ "time": 0.5333, "x": 1, "y": 0.841 }
				]
			},
			"L_Leg_01": {
				"rotate": [
					{ "time": 0, "angle": 0 },
					{ "time": 0.2, "angle": -15.67 },
					{ "time": 0.5333, "angle": -20.89 }
				],
				"translate": [
					{ "time": 0, "x": 0, "y": 0 },
					{ "time": 0.2, "x": -3.55, "y": 203.03 },
					{ "time": 0.5333, "x": 59.07, "y": 302.52 }
				],
				"scale": [
					{ "time": 0.5333, "x": 1, "y": 1 }
				]
			},
			"R_Mouth": {
				"rotate": [
					{ "time": 0, "angle": 0 },
					{ "time": 0.1333, "angle": 25.51 },
					{ "time": 0.2667, "angle": -29.12 },
					{ "time": 0.4, "angle": 26.59 },
					{ "time": 0.5333, "angle": 0 }
				],
				"translate": [
					{ "time": 0.5333, "x": 0, "y": 0 }
				],
				"scale": [
					{ "time": 0.5333, "x": 1, "y": 1 }
				]
			},
			"Body_12": {
				"rotate": [
					{ "time": 0, "angle": 0 },
					{ "time": 0.5333, "angle": 26.35 }
				],
				"translate": [
					{ "time": 0, "x": 0, "y": 0 },
					{ "time": 0.2, "x": -1.43, "y": -15.75 },
					{ "time": 0.5333, "x": 20.78, "y": -12.47 }
				],
				"scale": [
					{ "time": 0.5333, "x": 1, "y": 1 }
				]
			},
			"X": {
				"rotate": [
					{ "time": 0.5333, "angle": 0 }
				],
				"translate": [
					{ "time": 0.5333, "x": 0, "y": 0 }
				],
				"scale": [
					{ "time": 0.5333, "x": 1, "y": 1 }
				]
			},
			"Y": {
				"rotate": [
					{ "time": 0.5333, "angle": 0 }
				],
				"translate": [
					{ "time": 0.5333, "x": 0, "y": 0 }
				],
				"scale": [
					{ "time": 0.5333, "x": 1, "y": 1 }
				]
			},
			"Body_21": {
				"rotate": [
					{ "time": 0.5333, "angle": 0 }
				],
				"translate": [
					{ "time": 0.5333, "x": 0, "y": 0 }
				],
				"scale": [
					{ "time": 0.5333, "x": 1, "y": 1 }
				]
			},
			"Body_22": {
				"rotate": [
					{ "time": 0.5333, "angle": 0 }
				],
				"translate": [
					{ "time": 0.5333, "x": 0, "y": 0 }
				],
				"scale": [
					{ "time": 0.5333, "x": 1, "y": 1 }
				]
			},
			"Eye": {
				"rotate": [
					{ "time": 0.5333, "angle": 0 }
				],
				"translate": [
					{ "time": 0.5333, "x": 0, "y": 0 }
				],
				"scale": [
					{ "time": 0.5333, "x": 1, "y": 1 }
				]
			}
		},
		"ik": {
			"Pont": [
				{ "time": 0, "mix": 0 }
			]
		}
	},
	"Attack_03_Open": {
		"bones": {
			"X": {
				"translate": [
					{ "time": 0, "x": 0, "y": 0 },
					{ "time": 0.4, "x": -4.63, "y": 0 }
				]
			},
			"Head": {
				"rotate": [
					{ "time": 0, "angle": 0 },
					{ "time": 0.8, "angle": -7.65 },
					{ "time": 2, "angle": -1.85 }
				],
				"translate": [
					{ "time": 0, "x": 0, "y": 0 },
					{ "time": 2, "x": 1.49, "y": -1.57 }
				]
			},
			"Tail_01": {
				"rotate": [
					{ "time": 0, "angle": -0.53 },
					{ "time": 0.2, "angle": 7.65 },
					{ "time": 0.8, "angle": -25.2 },
					{ "time": 1.3333, "angle": 9.12 },
					{ "time": 2, "angle": -2.23 }
				],
				"translate": [
					{ "time": 0, "x": 0, "y": 0 },
					{ "time": 2, "x": -3.25, "y": -3.62 }
				],
				"scale": [
					{ "time": 0, "x": 1, "y": 1 },
					{ "time": 2, "x": 1.315, "y": 1 }
				]
			},
			"Tail_1": {
				"rotate": [
					{ "time": 0, "angle": 0 },
					{ "time": 0.2, "angle": 22.1 },
					{ "time": 0.4, "angle": 12.5 },
					{ "time": 0.8, "angle": 0.4 },
					{ "time": 1.3333, "angle": 13.96 },
					{ "time": 2, "angle": -14.01 }
				]
			},
			"Tail_11": {
				"rotate": [
					{ "time": 0, "angle": 0 },
					{ "time": 0.2, "angle": 0.43 },
					{ "time": 0.8, "angle": -3.23 },
					{ "time": 2, "angle": -7.2 }
				]
			},
			"R_Mouth": {
				"rotate": [
					{ "time": 0, "angle": 0 },
					{ "time": 0.1333, "angle": 25.51 },
					{ "time": 0.2667, "angle": -29.12 },
					{ "time": 0.4, "angle": 26.59 },
					{ "time": 0.5333, "angle": 0 },
					{ "time": 0.6667, "angle": 25.51 },
					{ "time": 0.8, "angle": -29.12 },
					{ "time": 0.9333, "angle": 26.59 },
					{ "time": 1.0667, "angle": 0 },
					{ "time": 1.2, "angle": 25.51 },
					{ "time": 1.3333, "angle": -29.12 },
					{ "time": 1.4667, "angle": 26.59 },
					{ "time": 1.6, "angle": 0 },
					{ "time": 1.7333, "angle": 25.51 },
					{ "time": 1.8667, "angle": -29.12 },
					{ "time": 2, "angle": 0 }
				]
			},
			"L_Mouth": {
				"rotate": [
					{ "time": 0, "angle": 0 },
					{ "time": 0.1333, "angle": -28.59 },
					{ "time": 0.2667, "angle": 21.35 },
					{ "time": 0.4, "angle": -22.88 },
					{ "time": 0.5333, "angle": 0 },
					{ "time": 0.6667, "angle": -28.59 },
					{ "time": 0.8, "angle": 21.35 },
					{ "time": 0.9333, "angle": -22.88 },
					{ "time": 1.0667, "angle": 0 },
					{ "time": 1.2, "angle": -28.59 },
					{ "time": 1.3333, "angle": 21.35 },
					{ "time": 1.4667, "angle": -22.88 },
					{ "time": 1.6, "angle": 0 },
					{ "time": 1.7333, "angle": -28.59 },
					{ "time": 1.8667, "angle": 21.35 },
					{ "time": 2, "angle": 0 }
				]
			},
			"Body_22": {
				"rotate": [
					{ "time": 0, "angle": 0 },
					{ "time": 0.8, "angle": -6.49 },
					{ "time": 1.3333, "angle": 7.51 },
					{ "time": 2, "angle": 9.26 }
				],
				"translate": [
					{ "time": 0, "x": 0, "y": 0 },
					{ "time": 2, "x": -11.03, "y": -11.73 }
				]
			},
			"Body_11": {
				"rotate": [
					{ "time": 0, "angle": 0 },
					{ "time": 0.8, "angle": -2.2 },
					{ "time": 2, "angle": -11.38 }
				],
				"translate": [
					{ "time": 0, "x": 0, "y": 0 },
					{ "time": 0.8, "x": 23.56, "y": 7.56 },
					{ "time": 2, "x": 65.35, "y": -1.35 }
				]
			},
			"Body_12": {
				"rotate": [
					{ "time": 0, "angle": 0 },
					{ "time": 0.8, "angle": -0.75 },
					{ "time": 2, "angle": -7.21 }
				],
				"translate": [
					{ "time": 0, "x": 0, "y": 0 },
					{ "time": 0.8, "x": -15.78, "y": -11.56 },
					{ "time": 2, "x": -19.16, "y": -18.73 }
				]
			},
			"X2": {
				"rotate": [
					{ "time": 0, "angle": 0 },
					{ "time": 0.8, "angle": -4.21 },
					{ "time": 2, "angle": -0.14 }
				],
				"translate": [
					{ "time": 0, "x": 0, "y": 0 },
					{ "time": 0.4, "x": 7.35, "y": -22.3 },
					{ "time": 0.8, "x": 13.4, "y": -25.58 },
					{ "time": 2, "x": 12.44, "y": 50.84 }
				]
			},
			"R_Wing_11": {
				"rotate": [
					{ "time": 0, "angle": 0 },
					{ "time": 0.0333, "angle": 22.85 },
					{ "time": 0.0667, "angle": 11.33 },
					{ "time": 0.1, "angle": 20.51 },
					{ "time": 0.1333, "angle": 11.55 },
					{ "time": 0.1667, "angle": 19.15 },
					{ "time": 0.2, "angle": 11.23 },
					{ "time": 0.2333, "angle": 16.7 },
					{ "time": 0.2667, "angle": 0 },
					{ "time": 0.3667, "angle": 22.85 },
					{ "time": 0.4667, "angle": 11.33 },
					{ "time": 0.5667, "angle": 20.51 },
					{ "time": 0.6667, "angle": 11.55 },
					{ "time": 0.7667, "angle": 19.15 },
					{ "time": 0.8667, "angle": 11.23 },
					{ "time": 0.9667, "angle": 16.7 },
					{ "time": 1.0667, "angle": 0 },
					{ "time": 1.1667, "angle": 22.85 },
					{ "time": 1.2667, "angle": 11.33 },
					{ "time": 1.3667, "angle": 20.51 },
					{ "time": 1.4667, "angle": 11.55 },
					{ "time": 1.5667, "angle": 19.15 },
					{ "time": 1.6667, "angle": 11.23 },
					{ "time": 1.7667, "angle": 16.7 },
					{ "time": 1.8667, "angle": 0 }
				],
				"scale": [
					{ "time": 0, "x": 1, "y": 1 },
					{ "time": 0.0667, "x": 1.022, "y": 1.031 },
					{ "time": 0.1333, "x": 1, "y": 1 },
					{ "time": 0.2, "x": 1.14, "y": 0.897 },
					{ "time": 0.2667, "x": 1, "y": 1 },
					{ "time": 0.4667, "x": 1.022, "y": 1.031 },
					{ "time": 0.6667, "x": 1, "y": 1 },
					{ "time": 0.8667, "x": 1.14, "y": 0.897 },
					{ "time": 1.0667, "x": 1, "y": 1 },
					{ "time": 1.2667, "x": 1.022, "y": 1.031 },
					{ "time": 1.4667, "x": 1, "y": 1 },
					{ "time": 1.6667, "x": 1.14, "y": 0.897 },
					{ "time": 1.8667, "x": 1, "y": 1 }
				]
			},
			"R_Wing_01": {
				"rotate": [
					{ "time": 0, "angle": 0 },
					{ "time": 0.0333, "angle": -9.58 },
					{ "time": 0.0667, "angle": 2.82 },
					{ "time": 0.1, "angle": -11.04 },
					{ "time": 0.1333, "angle": 0 },
					{ "time": 0.1667, "angle": -10.27 },
					{ "time": 0.2, "angle": 6.79 },
					{ "time": 0.2333, "angle": -7.43 },
					{ "time": 0.2667, "angle": 0 },
					{ "time": 0.3667, "angle": -9.58 },
					{ "time": 0.4667, "angle": 2.82 },
					{ "time": 0.5667, "angle": -11.04 },
					{ "time": 0.6667, "angle": 0 },
					{ "time": 0.7667, "angle": -10.27 },
					{ "time": 0.8667, "angle": 6.79 },
					{ "time": 0.9667, "angle": -7.43 },
					{ "time": 1.0667, "angle": 0 },
					{ "time": 1.1667, "angle": -9.58 },
					{ "time": 1.2667, "angle": 2.82 },
					{ "time": 1.3667, "angle": -11.04 },
					{ "time": 1.4667, "angle": 0 },
					{ "time": 1.5667, "angle": -10.27 },
					{ "time": 1.6667, "angle": 6.79 },
					{ "time": 1.7667, "angle": -7.43 },
					{ "time": 1.8667, "angle": 0 }
				],
				"scale": [
					{ "time": 0, "x": 1, "y": 1 },
					{ "time": 0.1333, "x": 1.158, "y": 1.078 },
					{ "time": 0.2667, "x": 1, "y": 1 },
					{ "time": 0.6667, "x": 1.158, "y": 1.078 },
					{ "time": 1.0667, "x": 1, "y": 1 },
					{ "time": 1.4667, "x": 1.158, "y": 1.078 },
					{ "time": 1.8667, "x": 1, "y": 1 }
				]
			},
			"L_Wing_11": {
				"rotate": [
					{ "time": 0, "angle": 0 },
					{ "time": 0.0333, "angle": -24.04 },
					{ "time": 0.0667, "angle": -11.97 },
					{ "time": 0.1, "angle": -19.95 },
					{ "time": 0.1333, "angle": -12.62 },
					{ "time": 0.1667, "angle": -20.94 },
					{ "time": 0.2, "angle": -12.56 },
					{ "time": 0.2333, "angle": -18.83 },
					{ "time": 0.2667, "angle": 0 },
					{ "time": 0.3667, "angle": -24.04 },
					{ "time": 0.4667, "angle": -11.97 },
					{ "time": 0.5667, "angle": -19.95 },
					{ "time": 0.6667, "angle": -12.62 },
					{ "time": 0.7667, "angle": -20.94 },
					{ "time": 0.8667, "angle": -12.56 },
					{ "time": 0.9667, "angle": -18.83 },
					{ "time": 1.0667, "angle": 0 },
					{ "time": 1.1667, "angle": -24.04 },
					{ "time": 1.2667, "angle": -11.97 },
					{ "time": 1.3667, "angle": -19.95 },
					{ "time": 1.4667, "angle": -12.62 },
					{ "time": 1.5667, "angle": -20.94 },
					{ "time": 1.6667, "angle": -12.56 },
					{ "time": 1.7667, "angle": -18.83 },
					{ "time": 1.8667, "angle": 0 }
				],
				"scale": [
					{ "time": 0, "x": 1, "y": 1 },
					{ "time": 0.0667, "x": 1.022, "y": 1.031 },
					{ "time": 0.1333, "x": 1, "y": 1 },
					{ "time": 0.2, "x": 1.14, "y": 0.897 },
					{ "time": 0.2667, "x": 1, "y": 1 },
					{ "time": 0.4667, "x": 1.022, "y": 1.031 },
					{ "time": 0.6667, "x": 1, "y": 1 },
					{ "time": 0.8667, "x": 1.14, "y": 0.897 },
					{ "time": 1.0667, "x": 1, "y": 1 },
					{ "time": 1.2667, "x": 1.022, "y": 1.031 },
					{ "time": 1.4667, "x": 1, "y": 1 },
					{ "time": 1.6667, "x": 1.14, "y": 0.897 },
					{ "time": 1.8667, "x": 1, "y": 1 }
				]
			},
			"L_Wing_01": {
				"rotate": [
					{ "time": 0, "angle": 0 },
					{ "time": 0.0333, "angle": 10.17 },
					{ "time": 0.0667, "angle": -2.46 },
					{ "time": 0.1, "angle": 11.69 },
					{ "time": 0.1333, "angle": 0 },
					{ "time": 0.1667, "angle": 11.07 },
					{ "time": 0.2, "angle": -7.1 },
					{ "time": 0.2333, "angle": 6.87 },
					{ "time": 0.2667, "angle": 0 },
					{ "time": 0.3667, "angle": 10.17 },
					{ "time": 0.4667, "angle": -2.46 },
					{ "time": 0.5667, "angle": 11.69 },
					{ "time": 0.6667, "angle": 0 },
					{ "time": 0.7667, "angle": 11.07 },
					{ "time": 0.8667, "angle": -7.1 },
					{ "time": 0.9667, "angle": 6.87 },
					{ "time": 1.0667, "angle": 0 },
					{ "time": 1.1667, "angle": 10.17 },
					{ "time": 1.2667, "angle": -2.46 },
					{ "time": 1.3667, "angle": 11.69 },
					{ "time": 1.4667, "angle": 0 },
					{ "time": 1.5667, "angle": 11.07 },
					{ "time": 1.6667, "angle": -7.1 },
					{ "time": 1.7667, "angle": 6.87 },
					{ "time": 1.8667, "angle": 0 }
				],
				"scale": [
					{ "time": 0, "x": 1, "y": 1 },
					{ "time": 0.1333, "x": 1.158, "y": 1.078 },
					{ "time": 0.2667, "x": 1, "y": 1 },
					{ "time": 0.6667, "x": 1.158, "y": 1.078 },
					{ "time": 1.0667, "x": 1, "y": 1 },
					{ "time": 1.4667, "x": 1.158, "y": 1.078 },
					{ "time": 1.8667, "x": 1, "y": 1 }
				]
			},
			"R_Leg_01": {
				"rotate": [
					{ "time": 0, "angle": 7.34 }
				]
			},
			"R_Leg_11": {
				"rotate": [
					{ "time": 0, "angle": 0 },
					{ "time": 0.8, "angle": -10.29 },
					{ "time": 2, "angle": 41.71 }
				]
			},
			"L_Leg_01": {
				"rotate": [
					{ "time": 0, "angle": -8.1 }
				]
			},
			"L_Leg_11": {
				"rotate": [
					{ "time": 0, "angle": 0 },
					{ "time": 0.8, "angle": -15.5 }
				]
			},
			"X3": {
				"translate": [
					{ "time": 0, "x": 0, "y": 0 },
					{ "time": 0.4, "x": -27.44, "y": -4.12 }
				],
				"scale": [
					{ "time": 0, "x": 1, "y": 1 },
					{ "time": 0.4, "x": 1, "y": 1.351 }
				]
			},
			"Point": {
				"translate": [
					{ "time": 0, "x": 0, "y": 0 },
					{ "time": 0.2, "x": 101.98, "y": -59.14 },
					{ "time": 0.4, "x": -2.23, "y": -159.1 },
					{ "time": 0.8, "x": -188.07, "y": -9.9 },
					{ "time": 1.3333, "x": 345.83, "y": 44.48 },
					{ "time": 2, "x": 5.34, "y": 16.09 }
				]
			}
		},
		"ik": {
			"Pont": [
				{ "time": 0, "mix": 0.003 }
			]
		}
	},
	"Idle_01": {
		"bones": {
			"L_Wing_01": {
				"rotate": [
					{ "time": 0, "angle": 0 },
					{ "time": 0.0333, "angle": 10.17 },
					{ "time": 0.0667, "angle": -2.46 },
					{ "time": 0.1, "angle": 11.69 },
					{ "time": 0.1333, "angle": 0 },
					{ "time": 0.1667, "angle": 11.07 },
					{ "time": 0.2, "angle": -7.1 },
					{ "time": 0.2333, "angle": 6.87 },
					{ "time": 0.2667, "angle": 0 },
					{ "time": 0.3, "angle": 10.17 },
					{ "time": 0.3333, "angle": -2.46 },
					{ "time": 0.3667, "angle": 11.69 },
					{ "time": 0.4, "angle": 0 },
					{ "time": 0.4333, "angle": 11.07 },
					{ "time": 0.4667, "angle": -7.1 },
					{ "time": 0.5, "angle": 6.87 },
					{ "time": 0.5333, "angle": 0 },
					{ "time": 0.5667, "angle": 10.17 },
					{ "time": 0.6, "angle": -2.46 },
					{ "time": 0.6333, "angle": 11.69 },
					{ "time": 0.6667, "angle": 0 },
					{ "time": 0.7, "angle": 11.07 },
					{ "time": 0.7333, "angle": -7.1 },
					{ "time": 0.7667, "angle": 6.87 },
					{ "time": 0.8, "angle": 0 },
					{ "time": 0.8333, "angle": 10.17 },
					{ "time": 0.8667, "angle": -2.46 },
					{ "time": 0.9, "angle": 11.69 },
					{ "time": 0.9333, "angle": 0 },
					{ "time": 0.9667, "angle": 11.07 },
					{ "time": 1, "angle": -7.1 },
					{ "time": 1.0333, "angle": 6.87 },
					{ "time": 1.0667, "angle": 0 },
					{ "time": 1.1, "angle": 10.17 },
					{ "time": 1.1333, "angle": -2.46 },
					{ "time": 1.1667, "angle": 11.69 },
					{ "time": 1.2, "angle": 0 },
					{ "time": 1.2333, "angle": 11.07 },
					{ "time": 1.2667, "angle": -7.1 },
					{ "time": 1.3, "angle": 6.87 },
					{ "time": 1.3333, "angle": 0 },
					{ "time": 1.3667, "angle": 10.17 },
					{ "time": 1.4, "angle": -2.46 },
					{ "time": 1.4333, "angle": 11.69 },
					{ "time": 1.4667, "angle": 0 },
					{ "time": 1.5, "angle": 11.07 },
					{ "time": 1.5333, "angle": -7.1 },
					{ "time": 1.5667, "angle": 6.87 },
					{ "time": 1.6, "angle": 0 },
					{ "time": 1.6333, "angle": 10.17 },
					{ "time": 1.6667, "angle": -2.46 },
					{ "time": 1.7, "angle": 11.69 },
					{ "time": 1.7333, "angle": 0 },
					{ "time": 1.7667, "angle": 11.07 },
					{ "time": 1.8, "angle": -7.1 },
					{ "time": 1.8333, "angle": 6.87 },
					{ "time": 1.8667, "angle": 0 },
					{ "time": 1.9, "angle": 10.17 },
					{ "time": 1.9333, "angle": -2.46 },
					{ "time": 1.9667, "angle": 11.69 },
					{ "time": 2, "angle": 0 },
					{ "time": 2.0333, "angle": 11.07 },
					{ "time": 2.0667, "angle": -7.1 },
					{ "time": 2.1, "angle": 6.87 },
					{ "time": 2.1333, "angle": 0 },
					{ "time": 2.1667, "angle": 10.17 },
					{ "time": 2.2, "angle": -2.46 },
					{ "time": 2.2333, "angle": 11.69 },
					{ "time": 2.2667, "angle": 0 },
					{ "time": 2.3, "angle": 11.07 },
					{ "time": 2.3333, "angle": -7.1 },
					{ "time": 2.3667, "angle": 6.87 },
					{ "time": 2.4, "angle": 0 },
					{ "time": 2.4333, "angle": 10.17 },
					{ "time": 2.4667, "angle": -2.46 },
					{ "time": 2.5, "angle": 11.69 },
					{ "time": 2.5333, "angle": 0 },
					{ "time": 2.5667, "angle": 11.07 },
					{ "time": 2.6, "angle": -7.1 },
					{ "time": 2.6333, "angle": 6.87 },
					{ "time": 2.6667, "angle": 0 }
				],
				"scale": [
					{ "time": 0, "x": 1, "y": 1 },
					{ "time": 0.1333, "x": 1.158, "y": 1.078 },
					{ "time": 0.2667, "x": 1, "y": 1 },
					{ "time": 0.4, "x": 1.158, "y": 1.078 },
					{ "time": 0.5333, "x": 1, "y": 1 },
					{ "time": 0.6667, "x": 1.158, "y": 1.078 },
					{ "time": 0.8, "x": 1, "y": 1 },
					{ "time": 0.9333, "x": 1.158, "y": 1.078 },
					{ "time": 1.0667, "x": 1, "y": 1 },
					{ "time": 1.2, "x": 1.158, "y": 1.078 },
					{ "time": 1.3333, "x": 1, "y": 1 },
					{ "time": 1.4667, "x": 1.158, "y": 1.078 },
					{ "time": 1.6, "x": 1, "y": 1 },
					{ "time": 1.7333, "x": 1.158, "y": 1.078 },
					{ "time": 1.8667, "x": 1, "y": 1 },
					{ "time": 2, "x": 1.158, "y": 1.078 },
					{ "time": 2.1333, "x": 1, "y": 1 },
					{ "time": 2.2667, "x": 1.158, "y": 1.078 },
					{ "time": 2.4, "x": 1, "y": 1 },
					{ "time": 2.5333, "x": 1.158, "y": 1.078 },
					{ "time": 2.6667, "x": 1, "y": 1 }
				]
			},
			"L_Wing_11": {
				"rotate": [
					{ "time": 0, "angle": 0 },
					{ "time": 0.0333, "angle": -24.04 },
					{ "time": 0.0667, "angle": -11.97 },
					{ "time": 0.1, "angle": -19.95 },
					{ "time": 0.1333, "angle": -12.62 },
					{ "time": 0.1667, "angle": -20.94 },
					{ "time": 0.2, "angle": -12.56 },
					{ "time": 0.2333, "angle": -18.83 },
					{ "time": 0.2667, "angle": 0 },
					{ "time": 0.3, "angle": -24.04 },
					{ "time": 0.3333, "angle": -11.97 },
					{ "time": 0.3667, "angle": -19.95 },
					{ "time": 0.4, "angle": -12.62 },
					{ "time": 0.4333, "angle": -20.94 },
					{ "time": 0.4667, "angle": -12.56 },
					{ "time": 0.5, "angle": -18.83 },
					{ "time": 0.5333, "angle": 0 },
					{ "time": 0.5667, "angle": -24.04 },
					{ "time": 0.6, "angle": -11.97 },
					{ "time": 0.6333, "angle": -19.95 },
					{ "time": 0.6667, "angle": -12.62 },
					{ "time": 0.7, "angle": -20.94 },
					{ "time": 0.7333, "angle": -12.56 },
					{ "time": 0.7667, "angle": -18.83 },
					{ "time": 0.8, "angle": 0 },
					{ "time": 0.8333, "angle": -24.04 },
					{ "time": 0.8667, "angle": -11.97 },
					{ "time": 0.9, "angle": -19.95 },
					{ "time": 0.9333, "angle": -12.62 },
					{ "time": 0.9667, "angle": -20.94 },
					{ "time": 1, "angle": -12.56 },
					{ "time": 1.0333, "angle": -18.83 },
					{ "time": 1.0667, "angle": 0 },
					{ "time": 1.1, "angle": -24.04 },
					{ "time": 1.1333, "angle": -11.97 },
					{ "time": 1.1667, "angle": -19.95 },
					{ "time": 1.2, "angle": -12.62 },
					{ "time": 1.2333, "angle": -20.94 },
					{ "time": 1.2667, "angle": -12.56 },
					{ "time": 1.3, "angle": -18.83 },
					{ "time": 1.3333, "angle": 0 },
					{ "time": 1.3667, "angle": -24.04 },
					{ "time": 1.4, "angle": -11.97 },
					{ "time": 1.4333, "angle": -19.95 },
					{ "time": 1.4667, "angle": -12.62 },
					{ "time": 1.5, "angle": -20.94 },
					{ "time": 1.5333, "angle": -12.56 },
					{ "time": 1.5667, "angle": -18.83 },
					{ "time": 1.6, "angle": 0 },
					{ "time": 1.6333, "angle": -24.04 },
					{ "time": 1.6667, "angle": -11.97 },
					{ "time": 1.7, "angle": -19.95 },
					{ "time": 1.7333, "angle": -12.62 },
					{ "time": 1.7667, "angle": -20.94 },
					{ "time": 1.8, "angle": -12.56 },
					{ "time": 1.8333, "angle": -18.83 },
					{ "time": 1.8667, "angle": 0 },
					{ "time": 1.9, "angle": -24.04 },
					{ "time": 1.9333, "angle": -11.97 },
					{ "time": 1.9667, "angle": -19.95 },
					{ "time": 2, "angle": -12.62 },
					{ "time": 2.0333, "angle": -20.94 },
					{ "time": 2.0667, "angle": -12.56 },
					{ "time": 2.1, "angle": -18.83 },
					{ "time": 2.1333, "angle": 0 },
					{ "time": 2.1667, "angle": -24.04 },
					{ "time": 2.2, "angle": -11.97 },
					{ "time": 2.2333, "angle": -19.95 },
					{ "time": 2.2667, "angle": -12.62 },
					{ "time": 2.3, "angle": -20.94 },
					{ "time": 2.3333, "angle": -12.56 },
					{ "time": 2.3667, "angle": -18.83 },
					{ "time": 2.4, "angle": 0 },
					{ "time": 2.4333, "angle": -24.04 },
					{ "time": 2.4667, "angle": -11.97 },
					{ "time": 2.5, "angle": -19.95 },
					{ "time": 2.5333, "angle": -12.62 },
					{ "time": 2.5667, "angle": -20.94 },
					{ "time": 2.6, "angle": -12.56 },
					{ "time": 2.6333, "angle": -18.83 },
					{ "time": 2.6667, "angle": 0 }
				],
				"scale": [
					{ "time": 0, "x": 1, "y": 1 },
					{ "time": 0.0667, "x": 1.022, "y": 1.031 },
					{ "time": 0.1333, "x": 1, "y": 1 },
					{ "time": 0.2, "x": 1.14, "y": 0.897 },
					{ "time": 0.2667, "x": 1, "y": 1 },
					{ "time": 0.3333, "x": 1.022, "y": 1.031 },
					{ "time": 0.4, "x": 1, "y": 1 },
					{ "time": 0.4667, "x": 1.14, "y": 0.897 },
					{ "time": 0.5333, "x": 1, "y": 1 },
					{ "time": 0.6, "x": 1.022, "y": 1.031 },
					{ "time": 0.6667, "x": 1, "y": 1 },
					{ "time": 0.7333, "x": 1.14, "y": 0.897 },
					{ "time": 0.8, "x": 1, "y": 1 },
					{ "time": 0.8667, "x": 1.022, "y": 1.031 },
					{ "time": 0.9333, "x": 1, "y": 1 },
					{ "time": 1, "x": 1.14, "y": 0.897 },
					{ "time": 1.0667, "x": 1, "y": 1 },
					{ "time": 1.1333, "x": 1.022, "y": 1.031 },
					{ "time": 1.2, "x": 1, "y": 1 },
					{ "time": 1.2667, "x": 1.14, "y": 0.897 },
					{ "time": 1.3333, "x": 1, "y": 1 },
					{ "time": 1.4, "x": 1.022, "y": 1.031 },
					{ "time": 1.4667, "x": 1, "y": 1 },
					{ "time": 1.5333, "x": 1.14, "y": 0.897 },
					{ "time": 1.6, "x": 1, "y": 1 },
					{ "time": 1.6667, "x": 1.022, "y": 1.031 },
					{ "time": 1.7333, "x": 1, "y": 1 },
					{ "time": 1.8, "x": 1.14, "y": 0.897 },
					{ "time": 1.8667, "x": 1, "y": 1 },
					{ "time": 1.9333, "x": 1.022, "y": 1.031 },
					{ "time": 2, "x": 1, "y": 1 },
					{ "time": 2.0667, "x": 1.14, "y": 0.897 },
					{ "time": 2.1333, "x": 1, "y": 1 },
					{ "time": 2.2, "x": 1.022, "y": 1.031 },
					{ "time": 2.2667, "x": 1, "y": 1 },
					{ "time": 2.3333, "x": 1.14, "y": 0.897 },
					{ "time": 2.4, "x": 1, "y": 1 },
					{ "time": 2.4667, "x": 1.022, "y": 1.031 },
					{ "time": 2.5333, "x": 1, "y": 1 },
					{ "time": 2.6, "x": 1.14, "y": 0.897 },
					{ "time": 2.6667, "x": 1, "y": 1 }
				]
			},
			"R_Wing_01": {
				"rotate": [
					{ "time": 0, "angle": 0 },
					{ "time": 0.0333, "angle": -9.58 },
					{ "time": 0.0667, "angle": 2.82 },
					{ "time": 0.1, "angle": -11.04 },
					{ "time": 0.1333, "angle": 0 },
					{ "time": 0.1667, "angle": -10.27 },
					{ "time": 0.2, "angle": 6.79 },
					{ "time": 0.2333, "angle": -7.43 },
					{ "time": 0.2667, "angle": 0 },
					{ "time": 0.3, "angle": -9.58 },
					{ "time": 0.3333, "angle": 2.82 },
					{ "time": 0.3667, "angle": -11.04 },
					{ "time": 0.4, "angle": 0 },
					{ "time": 0.4333, "angle": -10.27 },
					{ "time": 0.4667, "angle": 6.79 },
					{ "time": 0.5, "angle": -7.43 },
					{ "time": 0.5333, "angle": 0 },
					{ "time": 0.5667, "angle": -9.58 },
					{ "time": 0.6, "angle": 2.82 },
					{ "time": 0.6333, "angle": -11.04 },
					{ "time": 0.6667, "angle": 0 },
					{ "time": 0.7, "angle": -10.27 },
					{ "time": 0.7333, "angle": 6.79 },
					{ "time": 0.7667, "angle": -7.43 },
					{ "time": 0.8, "angle": 0 },
					{ "time": 0.8333, "angle": -9.58 },
					{ "time": 0.8667, "angle": 2.82 },
					{ "time": 0.9, "angle": -11.04 },
					{ "time": 0.9333, "angle": 0 },
					{ "time": 0.9667, "angle": -10.27 },
					{ "time": 1, "angle": 6.79 },
					{ "time": 1.0333, "angle": -7.43 },
					{ "time": 1.0667, "angle": 0 },
					{ "time": 1.1, "angle": -9.58 },
					{ "time": 1.1333, "angle": 2.82 },
					{ "time": 1.1667, "angle": -11.04 },
					{ "time": 1.2, "angle": 0 },
					{ "time": 1.2333, "angle": -10.27 },
					{ "time": 1.2667, "angle": 6.79 },
					{ "time": 1.3, "angle": -7.43 },
					{ "time": 1.3333, "angle": 0 },
					{ "time": 1.3667, "angle": -9.58 },
					{ "time": 1.4, "angle": 2.82 },
					{ "time": 1.4333, "angle": -11.04 },
					{ "time": 1.4667, "angle": 0 },
					{ "time": 1.5, "angle": -10.27 },
					{ "time": 1.5333, "angle": 6.79 },
					{ "time": 1.5667, "angle": -7.43 },
					{ "time": 1.6, "angle": 0 },
					{ "time": 1.6333, "angle": -9.58 },
					{ "time": 1.6667, "angle": 2.82 },
					{ "time": 1.7, "angle": -11.04 },
					{ "time": 1.7333, "angle": 0 },
					{ "time": 1.7667, "angle": -10.27 },
					{ "time": 1.8, "angle": 6.79 },
					{ "time": 1.8333, "angle": -7.43 },
					{ "time": 1.8667, "angle": 0 },
					{ "time": 1.9, "angle": -9.58 },
					{ "time": 1.9333, "angle": 2.82 },
					{ "time": 1.9667, "angle": -11.04 },
					{ "time": 2, "angle": 0 },
					{ "time": 2.0333, "angle": -10.27 },
					{ "time": 2.0667, "angle": 6.79 },
					{ "time": 2.1, "angle": -7.43 },
					{ "time": 2.1333, "angle": 0 },
					{ "time": 2.1667, "angle": -9.58 },
					{ "time": 2.2, "angle": 2.82 },
					{ "time": 2.2333, "angle": -11.04 },
					{ "time": 2.2667, "angle": 0 },
					{ "time": 2.3, "angle": -10.27 },
					{ "time": 2.3333, "angle": 6.79 },
					{ "time": 2.3667, "angle": -7.43 },
					{ "time": 2.4, "angle": 0 },
					{ "time": 2.4333, "angle": -9.58 },
					{ "time": 2.4667, "angle": 2.82 },
					{ "time": 2.5, "angle": -11.04 },
					{ "time": 2.5333, "angle": 0 },
					{ "time": 2.5667, "angle": -10.27 },
					{ "time": 2.6, "angle": 6.79 },
					{ "time": 2.6333, "angle": -7.43 },
					{ "time": 2.6667, "angle": 0 }
				],
				"scale": [
					{ "time": 0, "x": 1, "y": 1 },
					{ "time": 0.1333, "x": 1.158, "y": 1.078 },
					{ "time": 0.2667, "x": 1, "y": 1 },
					{ "time": 0.4, "x": 1.158, "y": 1.078 },
					{ "time": 0.5333, "x": 1, "y": 1 },
					{ "time": 0.6667, "x": 1.158, "y": 1.078 },
					{ "time": 0.8, "x": 1, "y": 1 },
					{ "time": 0.9333, "x": 1.158, "y": 1.078 },
					{ "time": 1.0667, "x": 1, "y": 1 },
					{ "time": 1.2, "x": 1.158, "y": 1.078 },
					{ "time": 1.3333, "x": 1, "y": 1 },
					{ "time": 1.4667, "x": 1.158, "y": 1.078 },
					{ "time": 1.6, "x": 1, "y": 1 },
					{ "time": 1.7333, "x": 1.158, "y": 1.078 },
					{ "time": 1.8667, "x": 1, "y": 1 },
					{ "time": 2, "x": 1.158, "y": 1.078 },
					{ "time": 2.1333, "x": 1, "y": 1 },
					{ "time": 2.2667, "x": 1.158, "y": 1.078 },
					{ "time": 2.4, "x": 1, "y": 1 },
					{ "time": 2.5333, "x": 1.158, "y": 1.078 },
					{ "time": 2.6667, "x": 1, "y": 1 }
				]
			},
			"R_Wing_11": {
				"rotate": [
					{ "time": 0, "angle": 0 },
					{ "time": 0.0333, "angle": 22.85 },
					{ "time": 0.0667, "angle": 11.33 },
					{ "time": 0.1, "angle": 20.51 },
					{ "time": 0.1333, "angle": 11.55 },
					{ "time": 0.1667, "angle": 19.15 },
					{ "time": 0.2, "angle": 11.23 },
					{ "time": 0.2333, "angle": 16.7 },
					{ "time": 0.2667, "angle": 0 },
					{ "time": 0.3, "angle": 22.85 },
					{ "time": 0.3333, "angle": 11.33 },
					{ "time": 0.3667, "angle": 20.51 },
					{ "time": 0.4, "angle": 11.55 },
					{ "time": 0.4333, "angle": 19.15 },
					{ "time": 0.4667, "angle": 11.23 },
					{ "time": 0.5, "angle": 16.7 },
					{ "time": 0.5333, "angle": 0 },
					{ "time": 0.5667, "angle": 22.85 },
					{ "time": 0.6, "angle": 11.33 },
					{ "time": 0.6333, "angle": 20.51 },
					{ "time": 0.6667, "angle": 11.55 },
					{ "time": 0.7, "angle": 19.15 },
					{ "time": 0.7333, "angle": 11.23 },
					{ "time": 0.7667, "angle": 16.7 },
					{ "time": 0.8, "angle": 0 },
					{ "time": 0.8333, "angle": 22.85 },
					{ "time": 0.8667, "angle": 11.33 },
					{ "time": 0.9, "angle": 20.51 },
					{ "time": 0.9333, "angle": 11.55 },
					{ "time": 0.9667, "angle": 19.15 },
					{ "time": 1, "angle": 11.23 },
					{ "time": 1.0333, "angle": 16.7 },
					{ "time": 1.0667, "angle": 0 },
					{ "time": 1.1, "angle": 22.85 },
					{ "time": 1.1333, "angle": 11.33 },
					{ "time": 1.1667, "angle": 20.51 },
					{ "time": 1.2, "angle": 11.55 },
					{ "time": 1.2333, "angle": 19.15 },
					{ "time": 1.2667, "angle": 11.23 },
					{ "time": 1.3, "angle": 16.7 },
					{ "time": 1.3333, "angle": 0 },
					{ "time": 1.3667, "angle": 22.85 },
					{ "time": 1.4, "angle": 11.33 },
					{ "time": 1.4333, "angle": 20.51 },
					{ "time": 1.4667, "angle": 11.55 },
					{ "time": 1.5, "angle": 19.15 },
					{ "time": 1.5333, "angle": 11.23 },
					{ "time": 1.5667, "angle": 16.7 },
					{ "time": 1.6, "angle": 0 },
					{ "time": 1.6333, "angle": 22.85 },
					{ "time": 1.6667, "angle": 11.33 },
					{ "time": 1.7, "angle": 20.51 },
					{ "time": 1.7333, "angle": 11.55 },
					{ "time": 1.7667, "angle": 19.15 },
					{ "time": 1.8, "angle": 11.23 },
					{ "time": 1.8333, "angle": 16.7 },
					{ "time": 1.8667, "angle": 0 },
					{ "time": 1.9, "angle": 22.85 },
					{ "time": 1.9333, "angle": 11.33 },
					{ "time": 1.9667, "angle": 20.51 },
					{ "time": 2, "angle": 11.55 },
					{ "time": 2.0333, "angle": 19.15 },
					{ "time": 2.0667, "angle": 11.23 },
					{ "time": 2.1, "angle": 16.7 },
					{ "time": 2.1333, "angle": 0 },
					{ "time": 2.1667, "angle": 22.85 },
					{ "time": 2.2, "angle": 11.33 },
					{ "time": 2.2333, "angle": 20.51 },
					{ "time": 2.2667, "angle": 11.55 },
					{ "time": 2.3, "angle": 19.15 },
					{ "time": 2.3333, "angle": 11.23 },
					{ "time": 2.3667, "angle": 16.7 },
					{ "time": 2.4, "angle": 0 },
					{ "time": 2.4333, "angle": 22.85 },
					{ "time": 2.4667, "angle": 11.33 },
					{ "time": 2.5, "angle": 20.51 },
					{ "time": 2.5333, "angle": 11.55 },
					{ "time": 2.5667, "angle": 19.15 },
					{ "time": 2.6, "angle": 11.23 },
					{ "time": 2.6333, "angle": 16.7 },
					{ "time": 2.6667, "angle": 0 }
				],
				"scale": [
					{ "time": 0, "x": 1, "y": 1 },
					{ "time": 0.0667, "x": 1.022, "y": 1.031 },
					{ "time": 0.1333, "x": 1, "y": 1 },
					{ "time": 0.2, "x": 1.14, "y": 0.897 },
					{ "time": 0.2667, "x": 1, "y": 1 },
					{ "time": 0.3333, "x": 1.022, "y": 1.031 },
					{ "time": 0.4, "x": 1, "y": 1 },
					{ "time": 0.4667, "x": 1.14, "y": 0.897 },
					{ "time": 0.5333, "x": 1, "y": 1 },
					{ "time": 0.6, "x": 1.022, "y": 1.031 },
					{ "time": 0.6667, "x": 1, "y": 1 },
					{ "time": 0.7333, "x": 1.14, "y": 0.897 },
					{ "time": 0.8, "x": 1, "y": 1 },
					{ "time": 0.8667, "x": 1.022, "y": 1.031 },
					{ "time": 0.9333, "x": 1, "y": 1 },
					{ "time": 1, "x": 1.14, "y": 0.897 },
					{ "time": 1.0667, "x": 1, "y": 1 },
					{ "time": 1.1333, "x": 1.022, "y": 1.031 },
					{ "time": 1.2, "x": 1, "y": 1 },
					{ "time": 1.2667, "x": 1.14, "y": 0.897 },
					{ "time": 1.3333, "x": 1, "y": 1 },
					{ "time": 1.4, "x": 1.022, "y": 1.031 },
					{ "time": 1.4667, "x": 1, "y": 1 },
					{ "time": 1.5333, "x": 1.14, "y": 0.897 },
					{ "time": 1.6, "x": 1, "y": 1 },
					{ "time": 1.6667, "x": 1.022, "y": 1.031 },
					{ "time": 1.7333, "x": 1, "y": 1 },
					{ "time": 1.8, "x": 1.14, "y": 0.897 },
					{ "time": 1.8667, "x": 1, "y": 1 },
					{ "time": 1.9333, "x": 1.022, "y": 1.031 },
					{ "time": 2, "x": 1, "y": 1 },
					{ "time": 2.0667, "x": 1.14, "y": 0.897 },
					{ "time": 2.1333, "x": 1, "y": 1 },
					{ "time": 2.2, "x": 1.022, "y": 1.031 },
					{ "time": 2.2667, "x": 1, "y": 1 },
					{ "time": 2.3333, "x": 1.14, "y": 0.897 },
					{ "time": 2.4, "x": 1, "y": 1 },
					{ "time": 2.4667, "x": 1.022, "y": 1.031 },
					{ "time": 2.5333, "x": 1, "y": 1 },
					{ "time": 2.6, "x": 1.14, "y": 0.897 },
					{ "time": 2.6667, "x": 1, "y": 1 }
				]
			},
			"Y": {
				"translate": [
					{
						"time": 0,
						"x": 0,
						"y": 0,
						"curve": [ 0.338, 0.46, 0.627, 0.97 ]
					},
					{
						"time": 0.6667,
						"x": 0,
						"y": -18.4,
						"curve": [ 0.25, 0, 0.75, 1 ]
					},
					{
						"time": 2,
						"x": 0,
						"y": 15.72,
						"curve": [ 0.25, 0, 0.666, 0.54 ]
					},
					{ "time": 2.6667, "x": 0, "y": 0 }
				]
			},
			"Tail_01": {
				"rotate": [
					{ "time": 0, "angle": 0 },
					{ "time": 0.6667, "angle": -0.75 },
					{ "time": 2, "angle": 2.36 },
					{ "time": 2.6667, "angle": 0 }
				],
				"translate": [
					{ "time": 0, "x": 0, "y": 0 },
					{ "time": 0.6667, "x": 0, "y": 6.94 },
					{ "time": 2.6667, "x": 0, "y": 0 }
				],
				"scale": [
					{ "time": 0, "x": 1, "y": 1 },
					{ "time": 0.6667, "x": 0.948, "y": 1 },
					{ "time": 2.6667, "x": 1, "y": 1 }
				]
			},
			"Tail_11": {
				"rotate": [
					{ "time": 0, "angle": 0 },
					{ "time": 1.3333, "angle": -1.7 },
					{ "time": 2.6667, "angle": -1.33 }
				],
				"translate": [
					{ "time": 0, "x": 0, "y": 0 },
					{ "time": 0.6667, "x": -5.49, "y": 1.05 },
					{ "time": 2, "x": -1.83, "y": 0.35 },
					{ "time": 2.6667, "x": 0, "y": 0 }
				],
				"scale": [
					{ "time": 0, "x": 1, "y": 1 },
					{ "time": 0.6667, "x": 1.344, "y": 1.088 },
					{ "time": 2, "x": 0.87, "y": 1.029 },
					{ "time": 2.6667, "x": 1, "y": 1 }
				]
			},
			"Head": {
				"translate": [
					{
						"time": 0,
						"x": 2.91,
						"y": -0.03,
						"curve": [ 0.25, 0, 0.75, 1 ]
					},
					{
						"time": 1.3333,
						"x": -13.11,
						"y": 0.12,
						"curve": [ 0.25, 0, 0.75, 1 ]
					},
					{ "time": 2.6667, "x": 2.91, "y": -0.03 }
				],
				"scale": [
					{ "time": 0, "x": 1, "y": 1 },
					{ "time": 1.3333, "x": 1, "y": 1.044 },
					{ "time": 2.6667, "x": 1, "y": 1 }
				]
			},
			"Tail_1": {
				"translate": [
					{ "time": 0, "x": 0, "y": 0 },
					{ "time": 1.3333, "x": -20.44, "y": 0.44 },
					{ "time": 2.6667, "x": 0, "y": 0 }
				]
			},
			"R_Leg_01": {
				"rotate": [
					{ "time": 0, "angle": 0 },
					{ "time": 1.3333, "angle": 7.38 },
					{ "time": 2.6667, "angle": 0 }
				],
				"scale": [
					{ "time": 0, "x": 1, "y": 1 },
					{ "time": 1.3333, "x": 0.982, "y": 1 },
					{ "time": 2.6667, "x": 1, "y": 1 }
				]
			},
			"R_Leg_11": {
				"rotate": [
					{ "time": 0, "angle": 9.38 },
					{ "time": 1.3333, "angle": -16.08 },
					{ "time": 2.6667, "angle": 9.38 }
				]
			},
			"L_Leg_01": {
				"rotate": [
					{ "time": 0, "angle": 0 },
					{ "time": 1.3333, "angle": -9.4 },
					{ "time": 2.6667, "angle": 0 }
				],
				"scale": [
					{ "time": 0, "x": 1, "y": 1 },
					{ "time": 1.3333, "x": 0.982, "y": 1 },
					{ "time": 2.6667, "x": 1, "y": 1 }
				]
			},
			"L_Leg_11": {
				"rotate": [
					{ "time": 0, "angle": -8.42 },
					{ "time": 1.3333, "angle": 13.23 },
					{ "time": 2.6667, "angle": -8.42 }
				]
			},
			"X2": {
				"translate": [
					{ "time": 0, "x": 0, "y": 0 },
					{ "time": 1.3333, "x": 0, "y": -15.59 },
					{ "time": 2.6667, "x": 0, "y": 0 }
				]
			},
			"X3": {
				"translate": [
					{ "time": 0, "x": 0, "y": 0 },
					{ "time": 1.3333, "x": -1.91, "y": 0.02 },
					{ "time": 2.6667, "x": 0, "y": 0 }
				],
				"scale": [
					{ "time": 0, "x": 1, "y": 1 },
					{ "time": 1.3333, "x": 1, "y": 0.866 },
					{ "time": 2.6667, "x": 1, "y": 1 }
				]
			}
		}
	},
	"Idle_02": {
		"bones": {
			"L_Wing_01": {
				"rotate": [
					{ "time": 0, "angle": 0 },
					{ "time": 0.0333, "angle": 10.17 },
					{ "time": 0.0667, "angle": -2.46 },
					{ "time": 0.1, "angle": 11.69 },
					{ "time": 0.1333, "angle": 0 },
					{ "time": 0.1667, "angle": 11.07 },
					{ "time": 0.2, "angle": -7.1 },
					{ "time": 0.2333, "angle": 6.87 },
					{ "time": 0.2667, "angle": 0 },
					{ "time": 0.3, "angle": 10.17 },
					{ "time": 0.3333, "angle": -2.46 },
					{ "time": 0.3667, "angle": 11.69 },
					{ "time": 0.4, "angle": 0 },
					{ "time": 0.4333, "angle": 11.07 },
					{ "time": 0.4667, "angle": -7.1 },
					{ "time": 0.5, "angle": 6.87 },
					{ "time": 0.5333, "angle": 0 },
					{ "time": 0.5667, "angle": 10.17 },
					{ "time": 0.6, "angle": -2.46 },
					{ "time": 0.6333, "angle": 11.69 },
					{ "time": 0.6667, "angle": 0 },
					{ "time": 0.7, "angle": 11.07 },
					{ "time": 0.7333, "angle": -7.1 },
					{ "time": 0.7667, "angle": 6.87 },
					{ "time": 0.8, "angle": 0 },
					{ "time": 0.8333, "angle": 10.17 },
					{ "time": 0.8667, "angle": -2.46 },
					{ "time": 0.9, "angle": 11.69 },
					{ "time": 0.9333, "angle": 0 },
					{ "time": 0.9667, "angle": 11.07 },
					{ "time": 1, "angle": -7.1 },
					{ "time": 1.0333, "angle": 6.87 },
					{ "time": 1.0667, "angle": 0 },
					{ "time": 1.1, "angle": 10.17 },
					{ "time": 1.1333, "angle": -2.46 },
					{ "time": 1.1667, "angle": 11.69 },
					{ "time": 1.2, "angle": 0 },
					{ "time": 1.2333, "angle": 11.07 },
					{ "time": 1.2667, "angle": -7.1 },
					{ "time": 1.3, "angle": 6.87 },
					{ "time": 1.3333, "angle": 0 }
				],
				"scale": [
					{ "time": 0, "x": 1, "y": 1 },
					{ "time": 0.1333, "x": 1.158, "y": 1.078 },
					{ "time": 0.2667, "x": 1, "y": 1 },
					{ "time": 0.4, "x": 1.158, "y": 1.078 },
					{ "time": 0.5333, "x": 1, "y": 1 },
					{ "time": 0.6667, "x": 1.158, "y": 1.078 },
					{ "time": 0.8, "x": 1, "y": 1 },
					{ "time": 0.9333, "x": 1.158, "y": 1.078 },
					{ "time": 1.0667, "x": 1, "y": 1 },
					{ "time": 1.2, "x": 1.158, "y": 1.078 },
					{ "time": 1.3333, "x": 1, "y": 1 }
				]
			},
			"L_Wing_11": {
				"rotate": [
					{ "time": 0, "angle": 0 },
					{ "time": 0.0333, "angle": -24.04 },
					{ "time": 0.0667, "angle": -11.97 },
					{ "time": 0.1, "angle": -19.95 },
					{ "time": 0.1333, "angle": -12.62 },
					{ "time": 0.1667, "angle": -20.94 },
					{ "time": 0.2, "angle": -12.56 },
					{ "time": 0.2333, "angle": -18.83 },
					{ "time": 0.2667, "angle": 0 },
					{ "time": 0.3, "angle": -24.04 },
					{ "time": 0.3333, "angle": -11.97 },
					{ "time": 0.3667, "angle": -19.95 },
					{ "time": 0.4, "angle": -12.62 },
					{ "time": 0.4333, "angle": -20.94 },
					{ "time": 0.4667, "angle": -12.56 },
					{ "time": 0.5, "angle": -18.83 },
					{ "time": 0.5333, "angle": 0 },
					{ "time": 0.5667, "angle": -24.04 },
					{ "time": 0.6, "angle": -11.97 },
					{ "time": 0.6333, "angle": -19.95 },
					{ "time": 0.6667, "angle": -12.62 },
					{ "time": 0.7, "angle": -20.94 },
					{ "time": 0.7333, "angle": -12.56 },
					{ "time": 0.7667, "angle": -18.83 },
					{ "time": 0.8, "angle": 0 },
					{ "time": 0.8333, "angle": -24.04 },
					{ "time": 0.8667, "angle": -11.97 },
					{ "time": 0.9, "angle": -19.95 },
					{ "time": 0.9333, "angle": -12.62 },
					{ "time": 0.9667, "angle": -20.94 },
					{ "time": 1, "angle": -12.56 },
					{ "time": 1.0333, "angle": -18.83 },
					{ "time": 1.0667, "angle": 0 },
					{ "time": 1.1, "angle": -24.04 },
					{ "time": 1.1333, "angle": -11.97 },
					{ "time": 1.1667, "angle": -19.95 },
					{ "time": 1.2, "angle": -12.62 },
					{ "time": 1.2333, "angle": -20.94 },
					{ "time": 1.2667, "angle": -12.56 },
					{ "time": 1.3, "angle": -18.83 },
					{ "time": 1.3333, "angle": 0 }
				],
				"scale": [
					{ "time": 0, "x": 1, "y": 1 },
					{ "time": 0.0667, "x": 1.022, "y": 1.031 },
					{ "time": 0.1333, "x": 1, "y": 1 },
					{ "time": 0.2, "x": 1.14, "y": 0.897 },
					{ "time": 0.2667, "x": 1, "y": 1 },
					{ "time": 0.3333, "x": 1.022, "y": 1.031 },
					{ "time": 0.4, "x": 1, "y": 1 },
					{ "time": 0.4667, "x": 1.14, "y": 0.897 },
					{ "time": 0.5333, "x": 1, "y": 1 },
					{ "time": 0.6, "x": 1.022, "y": 1.031 },
					{ "time": 0.6667, "x": 1, "y": 1 },
					{ "time": 0.7333, "x": 1.14, "y": 0.897 },
					{ "time": 0.8, "x": 1, "y": 1 },
					{ "time": 0.8667, "x": 1.022, "y": 1.031 },
					{ "time": 0.9333, "x": 1, "y": 1 },
					{ "time": 1, "x": 1.14, "y": 0.897 },
					{ "time": 1.0667, "x": 1, "y": 1 },
					{ "time": 1.1333, "x": 1.022, "y": 1.031 },
					{ "time": 1.2, "x": 1, "y": 1 },
					{ "time": 1.2667, "x": 1.14, "y": 0.897 },
					{ "time": 1.3333, "x": 1, "y": 1 }
				]
			},
			"R_Wing_01": {
				"rotate": [
					{ "time": 0, "angle": 0 },
					{ "time": 0.0333, "angle": -9.58 },
					{ "time": 0.0667, "angle": 2.82 },
					{ "time": 0.1, "angle": -11.04 },
					{ "time": 0.1333, "angle": 0 },
					{ "time": 0.1667, "angle": -10.27 },
					{ "time": 0.2, "angle": 6.79 },
					{ "time": 0.2333, "angle": -7.43 },
					{ "time": 0.2667, "angle": 0 },
					{ "time": 0.3, "angle": -9.58 },
					{ "time": 0.3333, "angle": 2.82 },
					{ "time": 0.3667, "angle": -11.04 },
					{ "time": 0.4, "angle": 0 },
					{ "time": 0.4333, "angle": -10.27 },
					{ "time": 0.4667, "angle": 6.79 },
					{ "time": 0.5, "angle": -7.43 },
					{ "time": 0.5333, "angle": 0 },
					{ "time": 0.5667, "angle": -9.58 },
					{ "time": 0.6, "angle": 2.82 },
					{ "time": 0.6333, "angle": -11.04 },
					{ "time": 0.6667, "angle": 0 },
					{ "time": 0.7, "angle": -10.27 },
					{ "time": 0.7333, "angle": 6.79 },
					{ "time": 0.7667, "angle": -7.43 },
					{ "time": 0.8, "angle": 0 },
					{ "time": 0.8333, "angle": -9.58 },
					{ "time": 0.8667, "angle": 2.82 },
					{ "time": 0.9, "angle": -11.04 },
					{ "time": 0.9333, "angle": 0 },
					{ "time": 0.9667, "angle": -10.27 },
					{ "time": 1, "angle": 6.79 },
					{ "time": 1.0333, "angle": -7.43 },
					{ "time": 1.0667, "angle": 0 },
					{ "time": 1.1, "angle": -9.58 },
					{ "time": 1.1333, "angle": 2.82 },
					{ "time": 1.1667, "angle": -11.04 },
					{ "time": 1.2, "angle": 0 },
					{ "time": 1.2333, "angle": -10.27 },
					{ "time": 1.2667, "angle": 6.79 },
					{ "time": 1.3, "angle": -7.43 },
					{ "time": 1.3333, "angle": 0 }
				],
				"scale": [
					{ "time": 0, "x": 1, "y": 1 },
					{ "time": 0.1333, "x": 1.158, "y": 1.078 },
					{ "time": 0.2667, "x": 1, "y": 1 },
					{ "time": 0.4, "x": 1.158, "y": 1.078 },
					{ "time": 0.5333, "x": 1, "y": 1 },
					{ "time": 0.6667, "x": 1.158, "y": 1.078 },
					{ "time": 0.8, "x": 1, "y": 1 },
					{ "time": 0.9333, "x": 1.158, "y": 1.078 },
					{ "time": 1.0667, "x": 1, "y": 1 },
					{ "time": 1.2, "x": 1.158, "y": 1.078 },
					{ "time": 1.3333, "x": 1, "y": 1 }
				]
			},
			"R_Wing_11": {
				"rotate": [
					{ "time": 0, "angle": 0 },
					{ "time": 0.0333, "angle": 22.85 },
					{ "time": 0.0667, "angle": 11.33 },
					{ "time": 0.1, "angle": 20.51 },
					{ "time": 0.1333, "angle": 11.55 },
					{ "time": 0.1667, "angle": 19.15 },
					{ "time": 0.2, "angle": 11.23 },
					{ "time": 0.2333, "angle": 16.7 },
					{ "time": 0.2667, "angle": 0 },
					{ "time": 0.3, "angle": 22.85 },
					{ "time": 0.3333, "angle": 11.33 },
					{ "time": 0.3667, "angle": 20.51 },
					{ "time": 0.4, "angle": 11.55 },
					{ "time": 0.4333, "angle": 19.15 },
					{ "time": 0.4667, "angle": 11.23 },
					{ "time": 0.5, "angle": 16.7 },
					{ "time": 0.5333, "angle": 0 },
					{ "time": 0.5667, "angle": 22.85 },
					{ "time": 0.6, "angle": 11.33 },
					{ "time": 0.6333, "angle": 20.51 },
					{ "time": 0.6667, "angle": 11.55 },
					{ "time": 0.7, "angle": 19.15 },
					{ "time": 0.7333, "angle": 11.23 },
					{ "time": 0.7667, "angle": 16.7 },
					{ "time": 0.8, "angle": 0 },
					{ "time": 0.8333, "angle": 22.85 },
					{ "time": 0.8667, "angle": 11.33 },
					{ "time": 0.9, "angle": 20.51 },
					{ "time": 0.9333, "angle": 11.55 },
					{ "time": 0.9667, "angle": 19.15 },
					{ "time": 1, "angle": 11.23 },
					{ "time": 1.0333, "angle": 16.7 },
					{ "time": 1.0667, "angle": 0 },
					{ "time": 1.1, "angle": 22.85 },
					{ "time": 1.1333, "angle": 11.33 },
					{ "time": 1.1667, "angle": 20.51 },
					{ "time": 1.2, "angle": 11.55 },
					{ "time": 1.2333, "angle": 19.15 },
					{ "time": 1.2667, "angle": 11.23 },
					{ "time": 1.3, "angle": 16.7 },
					{ "time": 1.3333, "angle": 0 }
				],
				"scale": [
					{ "time": 0, "x": 1, "y": 1 },
					{ "time": 0.0667, "x": 1.022, "y": 1.031 },
					{ "time": 0.1333, "x": 1, "y": 1 },
					{ "time": 0.2, "x": 1.14, "y": 0.897 },
					{ "time": 0.2667, "x": 1, "y": 1 },
					{ "time": 0.3333, "x": 1.022, "y": 1.031 },
					{ "time": 0.4, "x": 1, "y": 1 },
					{ "time": 0.4667, "x": 1.14, "y": 0.897 },
					{ "time": 0.5333, "x": 1, "y": 1 },
					{ "time": 0.6, "x": 1.022, "y": 1.031 },
					{ "time": 0.6667, "x": 1, "y": 1 },
					{ "time": 0.7333, "x": 1.14, "y": 0.897 },
					{ "time": 0.8, "x": 1, "y": 1 },
					{ "time": 0.8667, "x": 1.022, "y": 1.031 },
					{ "time": 0.9333, "x": 1, "y": 1 },
					{ "time": 1, "x": 1.14, "y": 0.897 },
					{ "time": 1.0667, "x": 1, "y": 1 },
					{ "time": 1.1333, "x": 1.022, "y": 1.031 },
					{ "time": 1.2, "x": 1, "y": 1 },
					{ "time": 1.2667, "x": 1.14, "y": 0.897 },
					{ "time": 1.3333, "x": 1, "y": 1 }
				]
			},
			"Y": {
				"translate": [
					{ "time": 0, "x": 0, "y": 0 },
					{ "time": 0.3333, "x": 0, "y": -18.4 },
					{ "time": 1, "x": 0, "y": 15.72 },
					{ "time": 1.3333, "x": 0, "y": 0 }
				]
			},
			"Tail_01": {
				"rotate": [
					{ "time": 0, "angle": 0 },
					{ "time": 0.3333, "angle": -0.75 },
					{ "time": 1, "angle": 2.36 },
					{ "time": 1.3333, "angle": 0 }
				],
				"translate": [
					{ "time": 0, "x": 0, "y": 0 },
					{ "time": 0.3333, "x": 0, "y": 6.94 },
					{ "time": 1.3333, "x": 0, "y": 0 }
				],
				"scale": [
					{ "time": 0, "x": 1, "y": 1 },
					{ "time": 0.3333, "x": 0.948, "y": 1 },
					{ "time": 1.3333, "x": 1, "y": 1 }
				]
			},
			"Tail_11": {
				"rotate": [
					{ "time": 0, "angle": 0 },
					{ "time": 0.6667, "angle": -1.7 },
					{ "time": 1.3333, "angle": -1.33 }
				],
				"translate": [
					{ "time": 0, "x": 0, "y": 0 },
					{ "time": 0.3333, "x": -5.49, "y": 1.05 },
					{ "time": 1, "x": -1.83, "y": 0.35 },
					{ "time": 1.3333, "x": 0, "y": 0 }
				],
				"scale": [
					{ "time": 0, "x": 1, "y": 1 },
					{ "time": 0.3333, "x": 1.344, "y": 1.088 },
					{ "time": 1, "x": 0.87, "y": 1.029 },
					{ "time": 1.3333, "x": 1, "y": 1 }
				]
			},
			"Tail_1": {
				"translate": [
					{ "time": 0, "x": 0, "y": 0 },
					{ "time": 0.6667, "x": -20.44, "y": 0.44 },
					{ "time": 1.3333, "x": 0, "y": 0 }
				]
			},
			"R_Leg_01": {
				"rotate": [
					{ "time": 0, "angle": 0 },
					{ "time": 0.6667, "angle": 7.38 },
					{ "time": 1.3333, "angle": 0 }
				],
				"scale": [
					{ "time": 0, "x": 1, "y": 1 },
					{ "time": 0.6667, "x": 0.982, "y": 1 },
					{ "time": 1.3333, "x": 1, "y": 1 }
				]
			},
			"R_Leg_11": {
				"rotate": [
					{ "time": 0, "angle": 9.38 },
					{ "time": 0.6667, "angle": -16.08 },
					{ "time": 1.3333, "angle": 9.38 }
				]
			},
			"L_Leg_01": {
				"rotate": [
					{ "time": 0, "angle": 0 },
					{ "time": 0.6667, "angle": -9.4 },
					{ "time": 1.3333, "angle": 0 }
				],
				"scale": [
					{ "time": 0, "x": 1, "y": 1 },
					{ "time": 0.6667, "x": 0.982, "y": 1 },
					{ "time": 1.3333, "x": 1, "y": 1 }
				]
			},
			"L_Leg_11": {
				"rotate": [
					{ "time": 0, "angle": -8.42 },
					{ "time": 0.6667, "angle": 13.23 },
					{ "time": 1.3333, "angle": -8.42 }
				]
			},
			"X2": {
				"translate": [
					{ "time": 0, "x": 0, "y": 0 },
					{ "time": 0.6667, "x": 0, "y": -15.59 },
					{ "time": 1.3333, "x": 0, "y": 0 }
				]
			},
			"X3": {
				"translate": [
					{ "time": 0, "x": 0, "y": 0 },
					{ "time": 0.6667, "x": -1.91, "y": 0.02 },
					{ "time": 1.3333, "x": 0, "y": 0 }
				],
				"scale": [
					{ "time": 0, "x": 1, "y": 1 },
					{ "time": 0.6667, "x": 1, "y": 0.866 },
					{ "time": 1.3333, "x": 1, "y": 1 }
				]
			}
		}
	},
	"Temp_Attack_02_All2": {
		"bones": {
			"R_Wing_01": {
				"rotate": [
					{ "time": 0, "angle": 0 },
					{ "time": 0.0333, "angle": -9.58 },
					{ "time": 0.0667, "angle": 2.82 },
					{ "time": 0.1, "angle": -11.04 },
					{ "time": 0.1333, "angle": 0 },
					{ "time": 0.1667, "angle": -10.27 },
					{ "time": 0.2, "angle": 6.79 },
					{ "time": 0.2333, "angle": -7.43 },
					{ "time": 0.2667, "angle": 0 },
					{ "time": 0.3, "angle": -9.58 },
					{ "time": 0.3333, "angle": 2.82 },
					{ "time": 0.3667, "angle": -11.04 },
					{ "time": 0.4, "angle": 0 },
					{ "time": 0.4333, "angle": -10.27 },
					{ "time": 0.4667, "angle": 6.79 },
					{ "time": 0.5, "angle": -7.43 },
					{ "time": 0.5333, "angle": 0 },
					{ "time": 0.5667, "angle": -10.27 },
					{ "time": 0.6, "angle": 6.79 },
					{ "time": 0.6333, "angle": -7.43 },
					{ "time": 0.6667, "angle": 0 }
				],
				"scale": [
					{ "time": 0, "x": 1, "y": 1 },
					{ "time": 0.1333, "x": 1.158, "y": 1.078 },
					{ "time": 0.2667, "x": 1, "y": 1, "curve": "stepped" },
					{ "time": 0.3, "x": 1, "y": 1 },
					{ "time": 0.4, "x": 1.158, "y": 1.078 },
					{ "time": 0.5, "x": 1, "y": 1 },
					{ "time": 0.5333, "x": 1.158, "y": 1.078 },
					{ "time": 0.6667, "x": 1, "y": 1 }
				]
			},
			"L_Wing_01": {
				"rotate": [
					{ "time": 0, "angle": 0 },
					{ "time": 0.0333, "angle": 10.17 },
					{ "time": 0.0667, "angle": -2.46 },
					{ "time": 0.1, "angle": 11.69 },
					{ "time": 0.1333, "angle": 0 },
					{ "time": 0.1667, "angle": 11.07 },
					{ "time": 0.2, "angle": -7.1 },
					{ "time": 0.2333, "angle": 6.87 },
					{ "time": 0.2667, "angle": 0 },
					{ "time": 0.3, "angle": 10.17 },
					{ "time": 0.3333, "angle": -2.46 },
					{ "time": 0.3667, "angle": 11.69 },
					{ "time": 0.4, "angle": 0 },
					{ "time": 0.4333, "angle": 11.07 },
					{ "time": 0.4667, "angle": -7.1 },
					{ "time": 0.5, "angle": 6.87 },
					{ "time": 0.5333, "angle": 0 },
					{ "time": 0.5667, "angle": 11.07 },
					{ "time": 0.6, "angle": -7.1 },
					{ "time": 0.6333, "angle": 6.87 },
					{ "time": 0.6667, "angle": 0 }
				],
				"scale": [
					{ "time": 0, "x": 1, "y": 1 },
					{ "time": 0.1333, "x": 1.158, "y": 1.078 },
					{ "time": 0.2667, "x": 1, "y": 1, "curve": "stepped" },
					{ "time": 0.3, "x": 1, "y": 1 },
					{ "time": 0.4, "x": 1.158, "y": 1.078 },
					{ "time": 0.5, "x": 1, "y": 1 },
					{ "time": 0.5333, "x": 1.158, "y": 1.078 },
					{ "time": 0.6667, "x": 1, "y": 1 }
				]
			},
			"X2": {
				"translate": [
					{ "time": 0, "x": 0, "y": -25.04 },
					{ "time": 0.2, "x": 0, "y": 142.95 },
					{ "time": 0.6667, "x": 0, "y": 226.14 }
				],
				"scale": [
					{ "time": 0, "x": 1.492, "y": 1 }
				]
			},
			"Tail_01": {
				"translate": [
					{ "time": 0, "x": 0, "y": 43.98 },
					{ "time": 0.2, "x": 0, "y": 50.54 },
					{ "time": 0.4, "x": 0, "y": 89.67 }
				],
				"scale": [
					{ "time": 0, "x": 1, "y": 1.359 }
				]
			},
			"R_Wing_11": {
				"rotate": [
					{ "time": 0, "angle": 0 },
					{ "time": 0.0333, "angle": 22.85 },
					{ "time": 0.0667, "angle": 11.33 },
					{ "time": 0.1, "angle": 20.51 },
					{ "time": 0.1333, "angle": 11.55 },
					{ "time": 0.1667, "angle": 19.15 },
					{ "time": 0.2, "angle": 11.23 },
					{ "time": 0.2333, "angle": 16.7 },
					{ "time": 0.2667, "angle": 0 },
					{ "time": 0.3, "angle": 22.85 },
					{ "time": 0.3333, "angle": 11.33 },
					{ "time": 0.3667, "angle": 20.51 },
					{ "time": 0.4, "angle": 11.55 },
					{ "time": 0.4333, "angle": 19.15 },
					{ "time": 0.4667, "angle": 11.23 },
					{ "time": 0.5, "angle": 16.7 },
					{ "time": 0.5333, "angle": 11.55 },
					{ "time": 0.5667, "angle": 19.15 },
					{ "time": 0.6, "angle": 11.23 },
					{ "time": 0.6333, "angle": 16.7 },
					{ "time": 0.6667, "angle": 0 }
				],
				"scale": [
					{ "time": 0, "x": 1, "y": 1 },
					{ "time": 0.0667, "x": 1.022, "y": 1.031 },
					{ "time": 0.1333, "x": 1, "y": 1 },
					{ "time": 0.2, "x": 1.14, "y": 0.897 },
					{ "time": 0.2667, "x": 1, "y": 1, "curve": "stepped" },
					{ "time": 0.3, "x": 1, "y": 1 },
					{ "time": 0.3333, "x": 1.022, "y": 1.031 },
					{ "time": 0.4, "x": 1, "y": 1 },
					{ "time": 0.4667, "x": 1.14, "y": 0.897 },
					{ "time": 0.5, "x": 1, "y": 1, "curve": "stepped" },
					{ "time": 0.5333, "x": 1, "y": 1 },
					{ "time": 0.6, "x": 1.14, "y": 0.897 },
					{ "time": 0.6667, "x": 1, "y": 1 }
				]
			},
			"L_Leg_11": {
				"rotate": [
					{ "time": 0, "angle": -25.99 },
					{ "time": 0.2, "angle": -49.6 },
					{ "time": 0.5333, "angle": -23.42 },
					{ "time": 0.6667, "angle": -6.34 }
				],
				"translate": [
					{ "time": 0, "x": -50.38, "y": 26.61 }
				]
			},
			"R_Leg_01": {
				"rotate": [
					{ "time": 0, "angle": 18.99, "curve": "stepped" },
					{ "time": 0.2, "angle": 18.99 },
					{ "time": 0.4, "angle": 21.64 },
					{ "time": 0.4333, "angle": 79.9 },
					{ "time": 0.4667, "angle": 79.95 },
					{ "time": 0.5333, "angle": 90.81, "curve": "stepped" },
					{ "time": 0.6667, "angle": 90.81 }
				],
				"translate": [
					{ "time": 0, "x": 126.88, "y": -255.44 },
					{ "time": 0.2, "x": 159.75, "y": -334.43 },
					{ "time": 0.4, "x": 115.45, "y": 334.95 },
					{ "time": 0.5333, "x": -86.95, "y": 476.3, "curve": "stepped" },
					{ "time": 0.6667, "x": -86.95, "y": 476.3 }
				]
			},
			"Head": {
				"translate": [
					{ "time": 0, "x": -23.93, "y": 0.23 },
					{ "time": 0.2, "x": 18.23, "y": -0.17 },
					{ "time": 0.6667, "x": 30.01, "y": -0.29 }
				],
				"scale": [
					{ "time": 0, "x": 1.236, "y": 1.05 }
				]
			},
			"Body_11": {
				"rotate": [
					{ "time": 0, "angle": -22.81 }
				],
				"translate": [
					{ "time": 0, "x": 31.17, "y": 10.39 }
				]
			},
			"Hip": {
				"translate": [
					{ "time": 0, "x": -53.15, "y": 0 }
				]
			},
			"Tail_1": {
				"translate": [
					{ "time": 0, "x": -20.75, "y": 0.14 },
					{ "time": 0.2, "x": 23.48, "y": -0.13 },
					{ "time": 0.4, "x": -212.98, "y": 1.31 },
					{ "time": 0.6667, "x": -208.95, "y": 1.29 }
				]
			},
			"R_Leg_11": {
				"rotate": [
					{ "time": 0, "angle": 21.91 },
					{ "time": 0.2, "angle": 45.02 },
					{ "time": 0.6667, "angle": 7.52 }
				],
				"translate": [
					{ "time": 0, "x": -37.32, "y": -37.16 }
				]
			},
			"L_Wing_11": {
				"rotate": [
					{ "time": 0, "angle": 0 },
					{ "time": 0.0333, "angle": -24.04 },
					{ "time": 0.0667, "angle": -11.97 },
					{ "time": 0.1, "angle": -19.95 },
					{ "time": 0.1333, "angle": -12.62 },
					{ "time": 0.1667, "angle": -20.94 },
					{ "time": 0.2, "angle": -12.56 },
					{ "time": 0.2333, "angle": -18.83 },
					{ "time": 0.2667, "angle": 0 },
					{ "time": 0.3, "angle": -24.04 },
					{ "time": 0.3333, "angle": -11.97 },
					{ "time": 0.3667, "angle": -19.95 },
					{ "time": 0.4, "angle": -12.62 },
					{ "time": 0.4333, "angle": -20.94 },
					{ "time": 0.4667, "angle": -12.56 },
					{ "time": 0.5, "angle": -18.83 },
					{ "time": 0.5333, "angle": -12.62 },
					{ "time": 0.5667, "angle": -20.94 },
					{ "time": 0.6, "angle": -12.56 },
					{ "time": 0.6333, "angle": -18.83 },
					{ "time": 0.6667, "angle": 0 }
				],
				"scale": [
					{ "time": 0, "x": 1, "y": 1 },
					{ "time": 0.0667, "x": 1.022, "y": 1.031 },
					{ "time": 0.1333, "x": 1, "y": 1 },
					{ "time": 0.2, "x": 1.14, "y": 0.897 },
					{ "time": 0.2667, "x": 1, "y": 1, "curve": "stepped" },
					{ "time": 0.3, "x": 1, "y": 1 },
					{ "time": 0.3333, "x": 1.022, "y": 1.031 },
					{ "time": 0.4, "x": 1, "y": 1 },
					{ "time": 0.4667, "x": 1.14, "y": 0.897 },
					{ "time": 0.5, "x": 1, "y": 1, "curve": "stepped" },
					{ "time": 0.5333, "x": 1, "y": 1 },
					{ "time": 0.6, "x": 1.14, "y": 0.897 },
					{ "time": 0.6667, "x": 1, "y": 1 }
				]
			},
			"X3": {
				"translate": [
					{ "time": 0, "x": -3.68, "y": -1.19 },
					{ "time": 0.4, "x": -0.25, "y": -1.22 }
				],
				"scale": [
					{ "time": 0, "x": 1, "y": 0.841 }
				]
			},
			"L_Leg_01": {
				"rotate": [
					{ "time": 0, "angle": -20.89, "curve": "stepped" },
					{ "time": 0.2, "angle": -20.89 },
					{ "time": 0.4, "angle": -28.35 },
					{ "time": 0.4333, "angle": -80.36 },
					{ "time": 0.4667, "angle": -83.94 },
					{ "time": 0.5333, "angle": -93.58, "curve": "stepped" },
					{ "time": 0.6667, "angle": -93.58 }
				],
				"translate": [
					{ "time": 0, "x": 59.07, "y": 302.52 },
					{ "time": 0.2, "x": 121.85, "y": 373.05 },
					{ "time": 0.4, "x": 151.35, "y": -304.16 },
					{ "time": 0.5333, "x": -20.22, "y": -472.05, "curve": "stepped" },
					{ "time": 0.6667, "x": -20.22, "y": -472.05 }
				]
			},
			"Body_12": {
				"rotate": [
					{ "time": 0, "angle": 26.35 }
				],
				"translate": [
					{ "time": 0, "x": 20.78, "y": -12.47 }
				]
			},
			"Body_22": {
				"translate": [
					{ "time": 0.6667, "x": -21.92, "y": 0.21 }
				]
			},
			"X": {
				"translate": [
					{
						"time": 0,
						"x": 0,
						"y": 0,
						"curve": [ 0.394, 0.5, 0.75, 1 ]
					},
					{
						"time": 0.2,
						"x": 0,
						"y": 89.61,
						"curve": [ 0.25, 0, 0.64, 1.01 ]
					},
					{ "time": 0.4, "x": 0, "y": -1701.21 },
					{ "time": 0.6667, "x": 0, "y": -1908.21 }
				]
			}
		},
		"ik": {
			"Pont": [
				{ "time": 0, "mix": 0 }
			]
		},
		"events": [
			{ "time": 0.2, "name": "Attack" }
		]
	}
}
}