%YAML 1.1
%TAG !u! tag:unity3d.com,2011:
--- !u!114 &11400000
MonoBehaviour:
  m_ObjectHideFlags: 0
  m_CorrespondingSourceObject: {fileID: 0}
  m_PrefabInstance: {fileID: 0}
  m_PrefabAsset: {fileID: 0}
  m_GameObject: {fileID: 0}
  m_Enabled: 1
  m_EditorHideFlags: 0
  m_Script: {fileID: 11500000, guid: 9a10ba4d4626e774f8c4f03a20e931ad, type: 3}
  m_Name: RankAttack__Ship07
  m_EditorClassIdentifier: 
  ranks:
  - rank: 0
    timeSuper: 5
    levels:
    - level: 0
      attacks:
      - rateAttack: 0.15
        scaleDamage: 1
        withBulletLaser: 0.1
        typeAttack: 0
        dataAttack:
        - idBullet: 12
          timeDelay: 0
          offset: {x: 0, y: 0.4, z: 0}
          eulerAngle: {x: 0, y: 0, z: 0}
    - level: 1
      attacks:
      - rateAttack: 0.15
        scaleDamage: 1
        withBulletLaser: 0.1
        typeAttack: 0
        dataAttack:
        - idBullet: 12
          timeDelay: 0
          offset: {x: -0.1, y: 0.4, z: 0}
          eulerAngle: {x: 0, y: 0, z: 0}
        - idBullet: 12
          timeDelay: 0
          offset: {x: 0.1, y: 0.4, z: 0}
          eulerAngle: {x: 0, y: 0, z: 0}
    - level: 2
      attacks:
      - rateAttack: 0.15
        scaleDamage: 1
        withBulletLaser: 0.1
        typeAttack: 0
        dataAttack:
        - idBullet: 12
          timeDelay: 0
          offset: {x: 0, y: 0.4, z: 0}
          eulerAngle: {x: 0, y: 0, z: 0}
        - idBullet: 12
          timeDelay: 0
          offset: {x: 0, y: 0.4, z: 0}
          eulerAngle: {x: 0, y: 0, z: 7}
        - idBullet: 12
          timeDelay: 0
          offset: {x: 0, y: 0.4, z: 0}
          eulerAngle: {x: 0, y: 0, z: -7}
    - level: 3
      attacks:
      - rateAttack: 0.15
        scaleDamage: 1
        withBulletLaser: 0.1
        typeAttack: 0
        dataAttack:
        - idBullet: 12
          timeDelay: 0
          offset: {x: -0.1, y: 0.4, z: 0}
          eulerAngle: {x: 0, y: 0, z: 0}
        - idBullet: 12
          timeDelay: 0
          offset: {x: 0.1, y: 0.4, z: 0}
          eulerAngle: {x: 0, y: 0, z: 0}
        - idBullet: 12
          timeDelay: 0
          offset: {x: -0.1, y: 0.4, z: 0}
          eulerAngle: {x: 0, y: 0, z: 7}
        - idBullet: 12
          timeDelay: 0
          offset: {x: 0.1, y: 0.4, z: 0}
          eulerAngle: {x: 0, y: 0, z: -7}
    - level: 4
      attacks:
      - rateAttack: 0.15
        scaleDamage: 1
        withBulletLaser: 0.1
        typeAttack: 0
        dataAttack:
        - idBullet: 12
          timeDelay: 0
          offset: {x: 0, y: 0.4, z: 0}
          eulerAngle: {x: 0, y: 0, z: 0}
        - idBullet: 12
          timeDelay: 0
          offset: {x: 0.15, y: 0.4, z: 0}
          eulerAngle: {x: 0, y: 0, z: -3}
        - idBullet: 12
          timeDelay: 0
          offset: {x: -0.15, y: 0.4, z: 0}
          eulerAngle: {x: 0, y: 0, z: 3}
        - idBullet: 12
          timeDelay: 0
          offset: {x: -0.1, y: 0.4, z: 0}
          eulerAngle: {x: 0, y: 0, z: 7}
        - idBullet: 12
          timeDelay: 0
          offset: {x: 0.1, y: 0.4, z: 0}
          eulerAngle: {x: 0, y: 0, z: -7}
    - level: 5
      attacks:
      - rateAttack: 0.15
        scaleDamage: 1
        withBulletLaser: 0.1
        typeAttack: 0
        dataAttack:
        - idBullet: 12
          timeDelay: 0
          offset: {x: 0.1, y: 0.4, z: 0}
          eulerAngle: {x: 0, y: 0, z: 0}
        - idBullet: 12
          timeDelay: 0
          offset: {x: -0.1, y: 0.4, z: 0}
          eulerAngle: {x: 0, y: 0, z: 0}
        - idBullet: 12
          timeDelay: 0
          offset: {x: 0.2, y: 0.4, z: 0}
          eulerAngle: {x: 0, y: 0, z: -3}
        - idBullet: 12
          timeDelay: 0
          offset: {x: 0.2, y: 0.4, z: 0}
          eulerAngle: {x: 0, y: 0, z: -7}
        - idBullet: 12
          timeDelay: 0
          offset: {x: -0.2, y: 0.4, z: 0}
          eulerAngle: {x: 0, y: 0, z: 3}
        - idBullet: 12
          timeDelay: 0
          offset: {x: -0.2, y: 0.4, z: 0}
          eulerAngle: {x: 0, y: 0, z: 7}
    - level: 6
      attacks:
      - rateAttack: 0.15
        scaleDamage: 1
        withBulletLaser: 0.1
        typeAttack: 0
        dataAttack:
        - idBullet: 12
          timeDelay: 0
          offset: {x: 0.15, y: 0.4, z: 0}
          eulerAngle: {x: 0, y: 0, z: 0}
        - idBullet: 12
          timeDelay: 0
          offset: {x: 0, y: 0.4, z: 0}
          eulerAngle: {x: 0, y: 0, z: 0}
        - idBullet: 12
          timeDelay: 0
          offset: {x: -0.15, y: 0.4, z: 0}
          eulerAngle: {x: 0, y: 0, z: 0}
        - idBullet: 12
          timeDelay: 0
          offset: {x: 0.2, y: 0.4, z: 0}
          eulerAngle: {x: 0, y: 0, z: -3}
        - idBullet: 12
          timeDelay: 0
          offset: {x: 0.2, y: 0.4, z: 0}
          eulerAngle: {x: 0, y: 0, z: -7}
        - idBullet: 12
          timeDelay: 0
          offset: {x: -0.2, y: 0.4, z: 0}
          eulerAngle: {x: 0, y: 0, z: 3}
        - idBullet: 12
          timeDelay: 0
          offset: {x: -0.2, y: 0.4, z: 0}
          eulerAngle: {x: 0, y: 0, z: 7}
    - level: 7
      attacks:
      - rateAttack: 0.15
        scaleDamage: 1
        withBulletLaser: 0.1
        typeAttack: 0
        dataAttack:
        - idBullet: 12
          timeDelay: 0
          offset: {x: 0.1, y: 0.4, z: 0}
          eulerAngle: {x: 0, y: 0, z: 0}
        - idBullet: 12
          timeDelay: 0
          offset: {x: -0.1, y: 0.4, z: 0}
          eulerAngle: {x: 0, y: 0, z: 0}
        - idBullet: 12
          timeDelay: 0
          offset: {x: -0.2, y: 0.4, z: 0}
          eulerAngle: {x: 0, y: 0, z: 3}
        - idBullet: 12
          timeDelay: 0
          offset: {x: -0.2, y: 0.4, z: 0}
          eulerAngle: {x: 0, y: 0, z: 7}
        - idBullet: 12
          timeDelay: 0
          offset: {x: -0.2, y: 0.4, z: 0}
          eulerAngle: {x: 0, y: 0, z: 11}
        - idBullet: 12
          timeDelay: 0
          offset: {x: 0.2, y: 0.4, z: 0}
          eulerAngle: {x: 0, y: 0, z: -3}
        - idBullet: 12
          timeDelay: 0
          offset: {x: 0.2, y: 0.4, z: 0}
          eulerAngle: {x: 0, y: 0, z: -7}
        - idBullet: 12
          timeDelay: 0
          offset: {x: 0.2, y: 0.4, z: 0}
          eulerAngle: {x: 0, y: 0, z: -11}
    - level: 8
      attacks:
      - rateAttack: 0.15
        scaleDamage: 1
        withBulletLaser: 0.1
        typeAttack: 0
        dataAttack:
        - idBullet: 12
          timeDelay: 0
          offset: {x: 0.2, y: 0.4, z: 0}
          eulerAngle: {x: 0, y: 0, z: 0}
        - idBullet: 12
          timeDelay: 0
          offset: {x: 0, y: 0.4, z: 0}
          eulerAngle: {x: 0, y: 0, z: 0}
        - idBullet: 12
          timeDelay: 0
          offset: {x: -0.2, y: 0.4, z: 0}
          eulerAngle: {x: 0, y: 0, z: 0}
        - idBullet: 12
          timeDelay: 0
          offset: {x: 0.2, y: 0.4, z: 0}
          eulerAngle: {x: 0, y: 0, z: -3}
        - idBullet: 12
          timeDelay: 0
          offset: {x: 0.2, y: 0.4, z: 0}
          eulerAngle: {x: 0, y: 0, z: -7}
        - idBullet: 12
          timeDelay: 0
          offset: {x: 0.2, y: 0.4, z: 0}
          eulerAngle: {x: 0, y: 0, z: -11}
        - idBullet: 12
          timeDelay: 0
          offset: {x: -0.2, y: 0.4, z: 0}
          eulerAngle: {x: 0, y: 0, z: 3}
        - idBullet: 12
          timeDelay: 0
          offset: {x: -0.2, y: 0.4, z: 0}
          eulerAngle: {x: 0, y: 0, z: 7}
        - idBullet: 12
          timeDelay: 0
          offset: {x: -0.2, y: 0.4, z: 0}
          eulerAngle: {x: 0, y: 0, z: 11}
    - level: 9
      attacks:
      - rateAttack: 0.15
        scaleDamage: 1
        withBulletLaser: 0.1
        typeAttack: 0
        dataAttack:
        - idBullet: 12
          timeDelay: 0
          offset: {x: 0.15, y: 0.4, z: 0}
          eulerAngle: {x: 0, y: 0, z: 0}
        - idBullet: 12
          timeDelay: 0
          offset: {x: -0.15, y: 0.4, z: 0}
          eulerAngle: {x: 0, y: 0, z: 0}
        - idBullet: 12
          timeDelay: 0
          offset: {x: -0.2, y: 0.4, z: 0}
          eulerAngle: {x: 0, y: 0, z: 3}
        - idBullet: 12
          timeDelay: 0
          offset: {x: -0.2, y: 0.4, z: 0}
          eulerAngle: {x: 0, y: 0, z: 7}
        - idBullet: 12
          timeDelay: 0
          offset: {x: -0.2, y: 0.4, z: 0}
          eulerAngle: {x: 0, y: 0, z: 11}
        - idBullet: 12
          timeDelay: 0
          offset: {x: -0.2, y: 0.4, z: 0}
          eulerAngle: {x: 0, y: 0, z: 15}
        - idBullet: 12
          timeDelay: 0
          offset: {x: 0.2, y: 0.4, z: 0}
          eulerAngle: {x: 0, y: 0, z: -3}
        - idBullet: 12
          timeDelay: 0
          offset: {x: 0.2, y: 0.4, z: 0}
          eulerAngle: {x: 0, y: 0, z: -7}
        - idBullet: 12
          timeDelay: 0
          offset: {x: 0.2, y: 0.4, z: 0}
          eulerAngle: {x: 0, y: 0, z: -11}
        - idBullet: 12
          timeDelay: 0
          offset: {x: 0.2, y: 0.4, z: 0}
          eulerAngle: {x: 0, y: 0, z: -15}
    - level: 10
      attacks:
      - rateAttack: 0.15
        scaleDamage: 1
        withBulletLaser: 0.1
        typeAttack: 0
        dataAttack:
        - idBullet: 12
          timeDelay: 0
          offset: {x: 0.2, y: 0.4, z: 0}
          eulerAngle: {x: 0, y: 0, z: 0}
        - idBullet: 12
          timeDelay: 0
          offset: {x: 0, y: 0.4, z: 0}
          eulerAngle: {x: 0, y: 0, z: 0}
        - idBullet: 12
          timeDelay: 0
          offset: {x: -0.2, y: 0.4, z: 0}
          eulerAngle: {x: 0, y: 0, z: 0}
        - idBullet: 12
          timeDelay: 0
          offset: {x: 0.3, y: 0.4, z: 0}
          eulerAngle: {x: 0, y: 0, z: -3}
        - idBullet: 12
          timeDelay: 0
          offset: {x: 0.3, y: 0.4, z: 0}
          eulerAngle: {x: 0, y: 0, z: -7}
        - idBullet: 12
          timeDelay: 0
          offset: {x: 0.3, y: 0.4, z: 0}
          eulerAngle: {x: 0, y: 0, z: -11}
        - idBullet: 12
          timeDelay: 0
          offset: {x: -0.3, y: 0.4, z: 0}
          eulerAngle: {x: 0, y: 0, z: 3}
        - idBullet: 12
          timeDelay: 0
          offset: {x: -0.3, y: 0.4, z: 0}
          eulerAngle: {x: 0, y: 0, z: 7}
        - idBullet: 12
          timeDelay: 0
          offset: {x: -0.3, y: 0.4, z: 0}
          eulerAngle: {x: 0, y: 0, z: 11}
        - idBullet: 12
          timeDelay: 0
          offset: {x: 0.4, y: 0.4, z: 0}
          eulerAngle: {x: 0, y: 0, z: -15}
        - idBullet: 12
          timeDelay: 0
          offset: {x: 0.4, y: 0.4, z: 0}
          eulerAngle: {x: 0, y: 0, z: -19}
        - idBullet: 12
          timeDelay: 0
          offset: {x: 0.4, y: 0.4, z: 0}
          eulerAngle: {x: 0, y: 0, z: -23}
        - idBullet: 12
          timeDelay: 0
          offset: {x: -0.4, y: 0.4, z: 0}
          eulerAngle: {x: 0, y: 0, z: 15}
        - idBullet: 12
          timeDelay: 0
          offset: {x: -0.4, y: 0.4, z: 0}
          eulerAngle: {x: 0, y: 0, z: 19}
        - idBullet: 12
          timeDelay: 0
          offset: {x: -0.4, y: 0.4, z: 0}
          eulerAngle: {x: 0, y: 0, z: 23}
  - rank: 1
    timeSuper: 5
    levels:
    - level: 0
      attacks:
      - rateAttack: 0.15
        scaleDamage: 1
        withBulletLaser: 0.1
        typeAttack: 0
        dataAttack:
        - idBullet: 12
          timeDelay: 0
          offset: {x: 0, y: 0.4, z: 0}
          eulerAngle: {x: 0, y: 0, z: 0}
    - level: 1
      attacks:
      - rateAttack: 0.15
        scaleDamage: 1
        withBulletLaser: 0.1
        typeAttack: 0
        dataAttack:
        - idBullet: 12
          timeDelay: 0
          offset: {x: -0.1, y: 0.4, z: 0}
          eulerAngle: {x: 0, y: 0, z: 0}
        - idBullet: 12
          timeDelay: 0
          offset: {x: 0.1, y: 0.4, z: 0}
          eulerAngle: {x: 0, y: 0, z: 0}
    - level: 2
      attacks:
      - rateAttack: 0.15
        scaleDamage: 1
        withBulletLaser: 0.1
        typeAttack: 0
        dataAttack:
        - idBullet: 12
          timeDelay: 0
          offset: {x: 0, y: 0.4, z: 0}
          eulerAngle: {x: 0, y: 0, z: 0}
        - idBullet: 12
          timeDelay: 0
          offset: {x: 0, y: 0.4, z: 0}
          eulerAngle: {x: 0, y: 0, z: 7}
        - idBullet: 12
          timeDelay: 0
          offset: {x: 0, y: 0.4, z: 0}
          eulerAngle: {x: 0, y: 0, z: -7}
    - level: 3
      attacks:
      - rateAttack: 0.15
        scaleDamage: 1
        withBulletLaser: 0.1
        typeAttack: 0
        dataAttack:
        - idBullet: 12
          timeDelay: 0
          offset: {x: -0.1, y: 0.4, z: 0}
          eulerAngle: {x: 0, y: 0, z: 0}
        - idBullet: 12
          timeDelay: 0
          offset: {x: 0.1, y: 0.4, z: 0}
          eulerAngle: {x: 0, y: 0, z: 0}
        - idBullet: 12
          timeDelay: 0
          offset: {x: -0.1, y: 0.4, z: 0}
          eulerAngle: {x: 0, y: 0, z: 7}
        - idBullet: 12
          timeDelay: 0
          offset: {x: 0.1, y: 0.4, z: 0}
          eulerAngle: {x: 0, y: 0, z: -7}
    - level: 4
      attacks:
      - rateAttack: 0.15
        scaleDamage: 1
        withBulletLaser: 0.1
        typeAttack: 0
        dataAttack:
        - idBullet: 12
          timeDelay: 0
          offset: {x: 0, y: 0.4, z: 0}
          eulerAngle: {x: 0, y: 0, z: 0}
        - idBullet: 12
          timeDelay: 0
          offset: {x: 0.15, y: 0.4, z: 0}
          eulerAngle: {x: 0, y: 0, z: -3}
        - idBullet: 12
          timeDelay: 0
          offset: {x: -0.15, y: 0.4, z: 0}
          eulerAngle: {x: 0, y: 0, z: 3}
        - idBullet: 12
          timeDelay: 0
          offset: {x: -0.1, y: 0.4, z: 0}
          eulerAngle: {x: 0, y: 0, z: 7}
        - idBullet: 12
          timeDelay: 0
          offset: {x: 0.1, y: 0.4, z: 0}
          eulerAngle: {x: 0, y: 0, z: -7}
    - level: 5
      attacks:
      - rateAttack: 0.15
        scaleDamage: 1
        withBulletLaser: 0.1
        typeAttack: 0
        dataAttack:
        - idBullet: 12
          timeDelay: 0
          offset: {x: 0.1, y: 0.4, z: 0}
          eulerAngle: {x: 0, y: 0, z: 0}
        - idBullet: 12
          timeDelay: 0
          offset: {x: -0.1, y: 0.4, z: 0}
          eulerAngle: {x: 0, y: 0, z: 0}
        - idBullet: 12
          timeDelay: 0
          offset: {x: 0.2, y: 0.4, z: 0}
          eulerAngle: {x: 0, y: 0, z: -3}
        - idBullet: 12
          timeDelay: 0
          offset: {x: 0.2, y: 0.4, z: 0}
          eulerAngle: {x: 0, y: 0, z: -7}
        - idBullet: 12
          timeDelay: 0
          offset: {x: -0.2, y: 0.4, z: 0}
          eulerAngle: {x: 0, y: 0, z: 3}
        - idBullet: 12
          timeDelay: 0
          offset: {x: -0.2, y: 0.4, z: 0}
          eulerAngle: {x: 0, y: 0, z: 7}
    - level: 6
      attacks:
      - rateAttack: 0.15
        scaleDamage: 1
        withBulletLaser: 0.1
        typeAttack: 0
        dataAttack:
        - idBullet: 12
          timeDelay: 0
          offset: {x: 0.15, y: 0.4, z: 0}
          eulerAngle: {x: 0, y: 0, z: 0}
        - idBullet: 12
          timeDelay: 0
          offset: {x: 0, y: 0.4, z: 0}
          eulerAngle: {x: 0, y: 0, z: 0}
        - idBullet: 12
          timeDelay: 0
          offset: {x: -0.15, y: 0.4, z: 0}
          eulerAngle: {x: 0, y: 0, z: 0}
        - idBullet: 12
          timeDelay: 0
          offset: {x: 0.2, y: 0.4, z: 0}
          eulerAngle: {x: 0, y: 0, z: -3}
        - idBullet: 12
          timeDelay: 0
          offset: {x: 0.2, y: 0.4, z: 0}
          eulerAngle: {x: 0, y: 0, z: -7}
        - idBullet: 12
          timeDelay: 0
          offset: {x: -0.2, y: 0.4, z: 0}
          eulerAngle: {x: 0, y: 0, z: 3}
        - idBullet: 12
          timeDelay: 0
          offset: {x: -0.2, y: 0.4, z: 0}
          eulerAngle: {x: 0, y: 0, z: 7}
    - level: 7
      attacks:
      - rateAttack: 0.15
        scaleDamage: 1
        withBulletLaser: 0.1
        typeAttack: 0
        dataAttack:
        - idBullet: 12
          timeDelay: 0
          offset: {x: 0.1, y: 0.4, z: 0}
          eulerAngle: {x: 0, y: 0, z: 0}
        - idBullet: 12
          timeDelay: 0
          offset: {x: -0.1, y: 0.4, z: 0}
          eulerAngle: {x: 0, y: 0, z: 0}
        - idBullet: 12
          timeDelay: 0
          offset: {x: -0.2, y: 0.4, z: 0}
          eulerAngle: {x: 0, y: 0, z: 3}
        - idBullet: 12
          timeDelay: 0
          offset: {x: -0.2, y: 0.4, z: 0}
          eulerAngle: {x: 0, y: 0, z: 7}
        - idBullet: 12
          timeDelay: 0
          offset: {x: -0.2, y: 0.4, z: 0}
          eulerAngle: {x: 0, y: 0, z: 11}
        - idBullet: 12
          timeDelay: 0
          offset: {x: 0.2, y: 0.4, z: 0}
          eulerAngle: {x: 0, y: 0, z: -3}
        - idBullet: 12
          timeDelay: 0
          offset: {x: 0.2, y: 0.4, z: 0}
          eulerAngle: {x: 0, y: 0, z: -7}
        - idBullet: 12
          timeDelay: 0
          offset: {x: 0.2, y: 0.4, z: 0}
          eulerAngle: {x: 0, y: 0, z: -11}
    - level: 8
      attacks:
      - rateAttack: 0.15
        scaleDamage: 1
        withBulletLaser: 0.1
        typeAttack: 0
        dataAttack:
        - idBullet: 12
          timeDelay: 0
          offset: {x: 0.2, y: 0.4, z: 0}
          eulerAngle: {x: 0, y: 0, z: 0}
        - idBullet: 12
          timeDelay: 0
          offset: {x: 0, y: 0.4, z: 0}
          eulerAngle: {x: 0, y: 0, z: 0}
        - idBullet: 12
          timeDelay: 0
          offset: {x: -0.2, y: 0.4, z: 0}
          eulerAngle: {x: 0, y: 0, z: 0}
        - idBullet: 12
          timeDelay: 0
          offset: {x: 0.2, y: 0.4, z: 0}
          eulerAngle: {x: 0, y: 0, z: -3}
        - idBullet: 12
          timeDelay: 0
          offset: {x: 0.2, y: 0.4, z: 0}
          eulerAngle: {x: 0, y: 0, z: -7}
        - idBullet: 12
          timeDelay: 0
          offset: {x: 0.2, y: 0.4, z: 0}
          eulerAngle: {x: 0, y: 0, z: -11}
        - idBullet: 12
          timeDelay: 0
          offset: {x: -0.2, y: 0.4, z: 0}
          eulerAngle: {x: 0, y: 0, z: 3}
        - idBullet: 12
          timeDelay: 0
          offset: {x: -0.2, y: 0.4, z: 0}
          eulerAngle: {x: 0, y: 0, z: 7}
        - idBullet: 12
          timeDelay: 0
          offset: {x: -0.2, y: 0.4, z: 0}
          eulerAngle: {x: 0, y: 0, z: 11}
    - level: 9
      attacks:
      - rateAttack: 0.15
        scaleDamage: 1
        withBulletLaser: 0.1
        typeAttack: 0
        dataAttack:
        - idBullet: 12
          timeDelay: 0
          offset: {x: 0.15, y: 0.4, z: 0}
          eulerAngle: {x: 0, y: 0, z: 0}
        - idBullet: 12
          timeDelay: 0
          offset: {x: -0.15, y: 0.4, z: 0}
          eulerAngle: {x: 0, y: 0, z: 0}
        - idBullet: 12
          timeDelay: 0
          offset: {x: -0.2, y: 0.4, z: 0}
          eulerAngle: {x: 0, y: 0, z: 3}
        - idBullet: 12
          timeDelay: 0
          offset: {x: -0.2, y: 0.4, z: 0}
          eulerAngle: {x: 0, y: 0, z: 7}
        - idBullet: 12
          timeDelay: 0
          offset: {x: -0.2, y: 0.4, z: 0}
          eulerAngle: {x: 0, y: 0, z: 11}
        - idBullet: 12
          timeDelay: 0
          offset: {x: -0.2, y: 0.4, z: 0}
          eulerAngle: {x: 0, y: 0, z: 15}
        - idBullet: 12
          timeDelay: 0
          offset: {x: 0.2, y: 0.4, z: 0}
          eulerAngle: {x: 0, y: 0, z: -3}
        - idBullet: 12
          timeDelay: 0
          offset: {x: 0.2, y: 0.4, z: 0}
          eulerAngle: {x: 0, y: 0, z: -7}
        - idBullet: 12
          timeDelay: 0
          offset: {x: 0.2, y: 0.4, z: 0}
          eulerAngle: {x: 0, y: 0, z: -11}
        - idBullet: 12
          timeDelay: 0
          offset: {x: 0.2, y: 0.4, z: 0}
          eulerAngle: {x: 0, y: 0, z: -15}
    - level: 10
      attacks:
      - rateAttack: 0.15
        scaleDamage: 1
        withBulletLaser: 0.1
        typeAttack: 0
        dataAttack:
        - idBullet: 12
          timeDelay: 0
          offset: {x: 0.2, y: 0.4, z: 0}
          eulerAngle: {x: 0, y: 0, z: 0}
        - idBullet: 12
          timeDelay: 0
          offset: {x: 0, y: 0.4, z: 0}
          eulerAngle: {x: 0, y: 0, z: 0}
        - idBullet: 12
          timeDelay: 0
          offset: {x: -0.2, y: 0.4, z: 0}
          eulerAngle: {x: 0, y: 0, z: 0}
        - idBullet: 12
          timeDelay: 0
          offset: {x: 0.3, y: 0.4, z: 0}
          eulerAngle: {x: 0, y: 0, z: -3}
        - idBullet: 12
          timeDelay: 0
          offset: {x: 0.3, y: 0.4, z: 0}
          eulerAngle: {x: 0, y: 0, z: -7}
        - idBullet: 12
          timeDelay: 0
          offset: {x: 0.3, y: 0.4, z: 0}
          eulerAngle: {x: 0, y: 0, z: -11}
        - idBullet: 12
          timeDelay: 0
          offset: {x: -0.3, y: 0.4, z: 0}
          eulerAngle: {x: 0, y: 0, z: 3}
        - idBullet: 12
          timeDelay: 0
          offset: {x: -0.3, y: 0.4, z: 0}
          eulerAngle: {x: 0, y: 0, z: 7}
        - idBullet: 12
          timeDelay: 0
          offset: {x: -0.3, y: 0.4, z: 0}
          eulerAngle: {x: 0, y: 0, z: 11}
        - idBullet: 12
          timeDelay: 0
          offset: {x: 0.4, y: 0.4, z: 0}
          eulerAngle: {x: 0, y: 0, z: -15}
        - idBullet: 12
          timeDelay: 0
          offset: {x: 0.4, y: 0.4, z: 0}
          eulerAngle: {x: 0, y: 0, z: -19}
        - idBullet: 12
          timeDelay: 0
          offset: {x: 0.4, y: 0.4, z: 0}
          eulerAngle: {x: 0, y: 0, z: -23}
        - idBullet: 12
          timeDelay: 0
          offset: {x: -0.4, y: 0.4, z: 0}
          eulerAngle: {x: 0, y: 0, z: 15}
        - idBullet: 12
          timeDelay: 0
          offset: {x: -0.4, y: 0.4, z: 0}
          eulerAngle: {x: 0, y: 0, z: 19}
        - idBullet: 12
          timeDelay: 0
          offset: {x: -0.4, y: 0.4, z: 0}
          eulerAngle: {x: 0, y: 0, z: 23}
  - rank: 2
    timeSuper: 5
    levels:
    - level: 0
      attacks:
      - rateAttack: 0.15
        scaleDamage: 1
        withBulletLaser: 0.1
        typeAttack: 0
        dataAttack:
        - idBullet: 12
          timeDelay: 0
          offset: {x: 0, y: 0.4, z: 0}
          eulerAngle: {x: 0, y: 0, z: 0}
    - level: 1
      attacks:
      - rateAttack: 0.15
        scaleDamage: 1
        withBulletLaser: 0.1
        typeAttack: 0
        dataAttack:
        - idBullet: 12
          timeDelay: 0
          offset: {x: 0.15, y: 0.4, z: 0}
          eulerAngle: {x: 0, y: 0, z: 0}
        - idBullet: 12
          timeDelay: 0
          offset: {x: -0.15, y: 0.4, z: 0}
          eulerAngle: {x: 0, y: 0, z: 0}
    - level: 2
      attacks:
      - rateAttack: 0.15
        scaleDamage: 1
        withBulletLaser: 0.1
        typeAttack: 0
        dataAttack:
        - idBullet: 12
          timeDelay: 0
          offset: {x: 0, y: 0.4, z: 0}
          eulerAngle: {x: 0, y: 0, z: 0}
        - idBullet: 12
          timeDelay: 0
          offset: {x: -0.15, y: 0.4, z: 0}
          eulerAngle: {x: 0, y: 0, z: 2}
        - idBullet: 12
          timeDelay: 0
          offset: {x: 0.15, y: 0.4, z: 0}
          eulerAngle: {x: 0, y: 0, z: -2}
    - level: 3
      attacks:
      - rateAttack: 0.15
        scaleDamage: 1
        withBulletLaser: 0.1
        typeAttack: 0
        dataAttack:
        - idBullet: 12
          timeDelay: 0
          offset: {x: 0.15, y: 0.4, z: 0}
          eulerAngle: {x: 0, y: 0, z: 0}
        - idBullet: 12
          timeDelay: 0
          offset: {x: -0.15, y: 0.4, z: 0}
          eulerAngle: {x: 0, y: 0, z: 0}
        - idBullet: 12
          timeDelay: 0
          offset: {x: 0.25, y: 0.4, z: 0}
          eulerAngle: {x: 0, y: 0, z: -1.5}
        - idBullet: 12
          timeDelay: 0
          offset: {x: -0.25, y: 0.4, z: 0}
          eulerAngle: {x: 0, y: 0, z: 1.5}
    - level: 4
      attacks:
      - rateAttack: 0.15
        scaleDamage: 1
        withBulletLaser: 0.1
        typeAttack: 0
        dataAttack:
        - idBullet: 12
          timeDelay: 0
          offset: {x: 0, y: 0.4, z: 0}
          eulerAngle: {x: 0, y: 0, z: 0}
        - idBullet: 12
          timeDelay: 0
          offset: {x: -0.2, y: 0.4, z: 0}
          eulerAngle: {x: 0, y: 0, z: 0}
        - idBullet: 12
          timeDelay: 0
          offset: {x: 0.2, y: 0.4, z: 0}
          eulerAngle: {x: 0, y: 0, z: 0}
        - idBullet: 12
          timeDelay: 0
          offset: {x: -0.25, y: 0.4, z: 0}
          eulerAngle: {x: 0, y: 0, z: 2.5}
        - idBullet: 12
          timeDelay: 0
          offset: {x: 0.25, y: 0.4, z: 0}
          eulerAngle: {x: 0, y: 0, z: -2.5}
    - level: 5
      attacks:
      - rateAttack: 0.15
        scaleDamage: 1
        withBulletLaser: 0.1
        typeAttack: 0
        dataAttack:
        - idBullet: 12
          timeDelay: 0
          offset: {x: 0.25, y: 0.4, z: 0}
          eulerAngle: {x: 0, y: 0, z: -2.5}
        - idBullet: 12
          timeDelay: 0
          offset: {x: 0.15, y: 0.4, z: 0}
          eulerAngle: {x: 0, y: 0, z: 0}
        - idBullet: 12
          timeDelay: 0
          offset: {x: 0.3, y: 0.4, z: 0}
          eulerAngle: {x: 0, y: 0, z: -5}
        - idBullet: 12
          timeDelay: 0
          offset: {x: -0.3, y: 0.4, z: 0}
          eulerAngle: {x: 0, y: 0, z: 5}
        - idBullet: 12
          timeDelay: 0
          offset: {x: -0.15, y: 0.4, z: 0}
          eulerAngle: {x: 0, y: 0, z: 0}
        - idBullet: 12
          timeDelay: 0
          offset: {x: -0.25, y: 0.4, z: 0}
          eulerAngle: {x: 0, y: 0, z: 2.5}
    - level: 6
      attacks:
      - rateAttack: 0.15
        scaleDamage: 1
        withBulletLaser: 0.1
        typeAttack: 0
        dataAttack:
        - idBullet: 12
          timeDelay: 0
          offset: {x: 0, y: 0.4, z: 0}
          eulerAngle: {x: 0, y: 0, z: 0}
        - idBullet: 12
          timeDelay: 0
          offset: {x: 0.2, y: 0.4, z: 0}
          eulerAngle: {x: 0, y: 0, z: -1.5}
        - idBullet: 12
          timeDelay: 0
          offset: {x: 0.3, y: 0.4, z: 0}
          eulerAngle: {x: 0, y: 0, z: -3}
        - idBullet: 12
          timeDelay: 0
          offset: {x: 0.3, y: 0.4, z: 0}
          eulerAngle: {x: 0, y: 0, z: -6}
        - idBullet: 12
          timeDelay: 0
          offset: {x: -0.3, y: 0.4, z: 0}
          eulerAngle: {x: 0, y: 0, z: 6}
        - idBullet: 12
          timeDelay: 0
          offset: {x: -0.3, y: 0.4, z: 0}
          eulerAngle: {x: 0, y: 0, z: 3}
        - idBullet: 12
          timeDelay: 0
          offset: {x: -0.2, y: 0.4, z: 0}
          eulerAngle: {x: 0, y: 0, z: 1.5}
    - level: 7
      attacks:
      - rateAttack: 0.15
        scaleDamage: 1
        withBulletLaser: 0.1
        typeAttack: 0
        dataAttack:
        - idBullet: 12
          timeDelay: 0
          offset: {x: -0.1, y: 0.4, z: 0}
          eulerAngle: {x: 0, y: 0, z: 0}
        - idBullet: 12
          timeDelay: 0
          offset: {x: -0.25, y: 0.4, z: 0}
          eulerAngle: {x: 0, y: 0, z: 1.5}
        - idBullet: 12
          timeDelay: 0
          offset: {x: -0.25, y: 0.4, z: 0}
          eulerAngle: {x: 0, y: 0, z: 3.5}
        - idBullet: 12
          timeDelay: 0
          offset: {x: -0.3, y: 0.4, z: 0}
          eulerAngle: {x: 0, y: 0, z: 6}
        - idBullet: 12
          timeDelay: 0
          offset: {x: 0.3, y: 0.4, z: 0}
          eulerAngle: {x: 0, y: 0, z: -6}
        - idBullet: 12
          timeDelay: 0
          offset: {x: 0.25, y: 0.4, z: 0}
          eulerAngle: {x: 0, y: 0, z: -3.5}
        - idBullet: 12
          timeDelay: 0
          offset: {x: 0.25, y: 0.4, z: 0}
          eulerAngle: {x: 0, y: 0, z: -1.5}
        - idBullet: 12
          timeDelay: 0
          offset: {x: 0.1, y: 0.4, z: 0}
          eulerAngle: {x: 0, y: 0, z: 0}
    - level: 8
      attacks:
      - rateAttack: 0.15
        scaleDamage: 1
        withBulletLaser: 0.1
        typeAttack: 0
        dataAttack:
        - idBullet: 12
          timeDelay: 0
          offset: {x: 0, y: 0.4, z: 0}
          eulerAngle: {x: 0, y: 0, z: 0}
        - idBullet: 12
          timeDelay: 0
          offset: {x: -0.35, y: 0.4, z: 0}
          eulerAngle: {x: 0, y: 0, z: 6.5}
        - idBullet: 12
          timeDelay: 0
          offset: {x: -0.3, y: 0.4, z: 0}
          eulerAngle: {x: 0, y: 0, z: 5}
        - idBullet: 12
          timeDelay: 0
          offset: {x: -0.25, y: 0.4, z: 0}
          eulerAngle: {x: 0, y: 0, z: 3}
        - idBullet: 12
          timeDelay: 0
          offset: {x: -0.15, y: 0.4, z: 0}
          eulerAngle: {x: 0, y: 0, z: 1.5}
        - idBullet: 12
          timeDelay: 0
          offset: {x: 0.15, y: 0.4, z: 0}
          eulerAngle: {x: 0, y: 0, z: -1.5}
        - idBullet: 12
          timeDelay: 0
          offset: {x: 0.25, y: 0.4, z: 0}
          eulerAngle: {x: 0, y: 0, z: -3}
        - idBullet: 12
          timeDelay: 0
          offset: {x: 0.3, y: 0.4, z: 0}
          eulerAngle: {x: 0, y: 0, z: -5}
        - idBullet: 12
          timeDelay: 0
          offset: {x: 0.35, y: 0.4, z: 0}
          eulerAngle: {x: 0, y: 0, z: -6.5}
    - level: 9
      attacks:
      - rateAttack: 0.15
        scaleDamage: 1
        withBulletLaser: 0.1
        typeAttack: 0
        dataAttack:
        - idBullet: 12
          timeDelay: 0
          offset: {x: -0.35, y: 0.4, z: 0}
          eulerAngle: {x: 0, y: 0, z: 7}
        - idBullet: 12
          timeDelay: 0
          offset: {x: -0.3, y: 0.4, z: 0}
          eulerAngle: {x: 0, y: 0, z: 5}
        - idBullet: 12
          timeDelay: 0
          offset: {x: -0.25, y: 0.4, z: 0}
          eulerAngle: {x: 0, y: 0, z: 3.5}
        - idBullet: 12
          timeDelay: 0
          offset: {x: -0.2, y: 0.4, z: 0}
          eulerAngle: {x: 0, y: 0, z: 1.5}
        - idBullet: 12
          timeDelay: 0
          offset: {x: -0.1, y: 0.4, z: 0}
          eulerAngle: {x: 0, y: 0, z: 0}
        - idBullet: 12
          timeDelay: 0
          offset: {x: 0.1, y: 0.4, z: 0}
          eulerAngle: {x: 0, y: 0, z: 0}
        - idBullet: 12
          timeDelay: 0
          offset: {x: 0.2, y: 0.4, z: 0}
          eulerAngle: {x: 0, y: 0, z: -1.5}
        - idBullet: 12
          timeDelay: 0
          offset: {x: 0.25, y: 0.4, z: 0}
          eulerAngle: {x: 0, y: 0, z: -3.5}
        - idBullet: 12
          timeDelay: 0
          offset: {x: 0.3, y: 0.4, z: 0}
          eulerAngle: {x: 0, y: 0, z: -5}
        - idBullet: 12
          timeDelay: 0
          offset: {x: 0.35, y: 0.4, z: 0}
          eulerAngle: {x: 0, y: 0, z: -7}
    - level: 10
      attacks:
      - rateAttack: 0.15
        scaleDamage: 1
        withBulletLaser: 0.1
        typeAttack: 0
        dataAttack:
        - idBullet: 12
          timeDelay: 0
          offset: {x: 0.2, y: 0.4, z: 0}
          eulerAngle: {x: 0, y: 0, z: 0}
        - idBullet: 12
          timeDelay: 0
          offset: {x: 0, y: 0.4, z: 0}
          eulerAngle: {x: 0, y: 0, z: 0}
        - idBullet: 12
          timeDelay: 0
          offset: {x: -0.2, y: 0.4, z: 0}
          eulerAngle: {x: 0, y: 0, z: 0}
        - idBullet: 12
          timeDelay: 0
          offset: {x: 0.3, y: 0.4, z: 0}
          eulerAngle: {x: 0, y: 0, z: -3}
        - idBullet: 12
          timeDelay: 0
          offset: {x: 0.3, y: 0.4, z: 0}
          eulerAngle: {x: 0, y: 0, z: -7}
        - idBullet: 12
          timeDelay: 0
          offset: {x: 0.3, y: 0.4, z: 0}
          eulerAngle: {x: 0, y: 0, z: -11}
        - idBullet: 12
          timeDelay: 0
          offset: {x: -0.3, y: 0.4, z: 0}
          eulerAngle: {x: 0, y: 0, z: 3}
        - idBullet: 12
          timeDelay: 0
          offset: {x: -0.3, y: 0.4, z: 0}
          eulerAngle: {x: 0, y: 0, z: 7}
        - idBullet: 12
          timeDelay: 0
          offset: {x: -0.3, y: 0.4, z: 0}
          eulerAngle: {x: 0, y: 0, z: 11}
        - idBullet: 12
          timeDelay: 0
          offset: {x: 0.4, y: 0.4, z: 0}
          eulerAngle: {x: 0, y: 0, z: -15}
        - idBullet: 12
          timeDelay: 0
          offset: {x: 0.4, y: 0.4, z: 0}
          eulerAngle: {x: 0, y: 0, z: -19}
        - idBullet: 12
          timeDelay: 0
          offset: {x: 0.4, y: 0.4, z: 0}
          eulerAngle: {x: 0, y: 0, z: -23}
        - idBullet: 12
          timeDelay: 0
          offset: {x: -0.4, y: 0.4, z: 0}
          eulerAngle: {x: 0, y: 0, z: 15}
        - idBullet: 12
          timeDelay: 0
          offset: {x: -0.4, y: 0.4, z: 0}
          eulerAngle: {x: 0, y: 0, z: 19}
        - idBullet: 12
          timeDelay: 0
          offset: {x: -0.4, y: 0.4, z: 0}
          eulerAngle: {x: 0, y: 0, z: 23}
  - rank: 3
    timeSuper: 5
    levels:
    - level: 0
      attacks:
      - rateAttack: 0.15
        scaleDamage: 1
        withBulletLaser: 0.1
        typeAttack: 0
        dataAttack:
        - idBullet: 12
          timeDelay: 0
          offset: {x: 0, y: 0.4, z: 0}
          eulerAngle: {x: 0, y: 0, z: 0}
    - level: 1
      attacks:
      - rateAttack: 0.15
        scaleDamage: 1
        withBulletLaser: 0.1
        typeAttack: 0
        dataAttack:
        - idBullet: 12
          timeDelay: 0
          offset: {x: 0.15, y: 0.4, z: 0}
          eulerAngle: {x: 0, y: 0, z: 0}
        - idBullet: 12
          timeDelay: 0
          offset: {x: -0.15, y: 0.4, z: 0}
          eulerAngle: {x: 0, y: 0, z: 0}
    - level: 2
      attacks:
      - rateAttack: 0.15
        scaleDamage: 1
        withBulletLaser: 0.1
        typeAttack: 0
        dataAttack:
        - idBullet: 12
          timeDelay: 0
          offset: {x: 0, y: 0.4, z: 0}
          eulerAngle: {x: 0, y: 0, z: 0}
        - idBullet: 12
          timeDelay: 0
          offset: {x: -0.15, y: 0.4, z: 0}
          eulerAngle: {x: 0, y: 0, z: 2}
        - idBullet: 12
          timeDelay: 0
          offset: {x: 0.15, y: 0.4, z: 0}
          eulerAngle: {x: 0, y: 0, z: -2}
    - level: 3
      attacks:
      - rateAttack: 0.15
        scaleDamage: 1
        withBulletLaser: 0.1
        typeAttack: 0
        dataAttack:
        - idBullet: 12
          timeDelay: 0
          offset: {x: 0.15, y: 0.4, z: 0}
          eulerAngle: {x: 0, y: 0, z: 0}
        - idBullet: 12
          timeDelay: 0
          offset: {x: -0.15, y: 0.4, z: 0}
          eulerAngle: {x: 0, y: 0, z: 0}
        - idBullet: 12
          timeDelay: 0
          offset: {x: 0.25, y: 0.4, z: 0}
          eulerAngle: {x: 0, y: 0, z: -1.5}
        - idBullet: 12
          timeDelay: 0
          offset: {x: -0.25, y: 0.4, z: 0}
          eulerAngle: {x: 0, y: 0, z: 1.5}
    - level: 4
      attacks:
      - rateAttack: 0.15
        scaleDamage: 1
        withBulletLaser: 0.1
        typeAttack: 0
        dataAttack:
        - idBullet: 12
          timeDelay: 0
          offset: {x: 0, y: 0.4, z: 0}
          eulerAngle: {x: 0, y: 0, z: 0}
        - idBullet: 12
          timeDelay: 0
          offset: {x: -0.2, y: 0.4, z: 0}
          eulerAngle: {x: 0, y: 0, z: 0}
        - idBullet: 12
          timeDelay: 0
          offset: {x: 0.2, y: 0.4, z: 0}
          eulerAngle: {x: 0, y: 0, z: 0}
        - idBullet: 12
          timeDelay: 0
          offset: {x: -0.25, y: 0.4, z: 0}
          eulerAngle: {x: 0, y: 0, z: 2.5}
        - idBullet: 12
          timeDelay: 0
          offset: {x: 0.25, y: 0.4, z: 0}
          eulerAngle: {x: 0, y: 0, z: -2.5}
    - level: 5
      attacks:
      - rateAttack: 0.15
        scaleDamage: 1
        withBulletLaser: 0.1
        typeAttack: 0
        dataAttack:
        - idBullet: 12
          timeDelay: 0
          offset: {x: 0.25, y: 0.4, z: 0}
          eulerAngle: {x: 0, y: 0, z: -2.5}
        - idBullet: 12
          timeDelay: 0
          offset: {x: 0.15, y: 0.4, z: 0}
          eulerAngle: {x: 0, y: 0, z: 0}
        - idBullet: 12
          timeDelay: 0
          offset: {x: 0.3, y: 0.4, z: 0}
          eulerAngle: {x: 0, y: 0, z: -5}
        - idBullet: 12
          timeDelay: 0
          offset: {x: -0.3, y: 0.4, z: 0}
          eulerAngle: {x: 0, y: 0, z: 5}
        - idBullet: 12
          timeDelay: 0
          offset: {x: -0.15, y: 0.4, z: 0}
          eulerAngle: {x: 0, y: 0, z: 0}
        - idBullet: 12
          timeDelay: 0
          offset: {x: -0.25, y: 0.4, z: 0}
          eulerAngle: {x: 0, y: 0, z: 2.5}
    - level: 6
      attacks:
      - rateAttack: 0.15
        scaleDamage: 1
        withBulletLaser: 0.1
        typeAttack: 0
        dataAttack:
        - idBullet: 12
          timeDelay: 0
          offset: {x: 0, y: 0.4, z: 0}
          eulerAngle: {x: 0, y: 0, z: 0}
        - idBullet: 12
          timeDelay: 0
          offset: {x: 0.2, y: 0.4, z: 0}
          eulerAngle: {x: 0, y: 0, z: -1.5}
        - idBullet: 12
          timeDelay: 0
          offset: {x: 0.3, y: 0.4, z: 0}
          eulerAngle: {x: 0, y: 0, z: -3}
        - idBullet: 12
          timeDelay: 0
          offset: {x: 0.3, y: 0.4, z: 0}
          eulerAngle: {x: 0, y: 0, z: -6}
        - idBullet: 12
          timeDelay: 0
          offset: {x: -0.3, y: 0.4, z: 0}
          eulerAngle: {x: 0, y: 0, z: 6}
        - idBullet: 12
          timeDelay: 0
          offset: {x: -0.3, y: 0.4, z: 0}
          eulerAngle: {x: 0, y: 0, z: 3}
        - idBullet: 12
          timeDelay: 0
          offset: {x: -0.2, y: 0.4, z: 0}
          eulerAngle: {x: 0, y: 0, z: 1.5}
    - level: 7
      attacks:
      - rateAttack: 0.15
        scaleDamage: 1
        withBulletLaser: 0.1
        typeAttack: 0
        dataAttack:
        - idBullet: 12
          timeDelay: 0
          offset: {x: -0.1, y: 0.4, z: 0}
          eulerAngle: {x: 0, y: 0, z: 0}
        - idBullet: 12
          timeDelay: 0
          offset: {x: -0.25, y: 0.4, z: 0}
          eulerAngle: {x: 0, y: 0, z: 1.5}
        - idBullet: 12
          timeDelay: 0
          offset: {x: -0.25, y: 0.4, z: 0}
          eulerAngle: {x: 0, y: 0, z: 3.5}
        - idBullet: 12
          timeDelay: 0
          offset: {x: -0.3, y: 0.4, z: 0}
          eulerAngle: {x: 0, y: 0, z: 6}
        - idBullet: 12
          timeDelay: 0
          offset: {x: 0.3, y: 0.4, z: 0}
          eulerAngle: {x: 0, y: 0, z: -6}
        - idBullet: 12
          timeDelay: 0
          offset: {x: 0.25, y: 0.4, z: 0}
          eulerAngle: {x: 0, y: 0, z: -3.5}
        - idBullet: 12
          timeDelay: 0
          offset: {x: 0.25, y: 0.4, z: 0}
          eulerAngle: {x: 0, y: 0, z: -1.5}
        - idBullet: 12
          timeDelay: 0
          offset: {x: 0.1, y: 0.4, z: 0}
          eulerAngle: {x: 0, y: 0, z: 0}
    - level: 8
      attacks:
      - rateAttack: 0.15
        scaleDamage: 1
        withBulletLaser: 0.1
        typeAttack: 0
        dataAttack:
        - idBullet: 12
          timeDelay: 0
          offset: {x: 0, y: 0.4, z: 0}
          eulerAngle: {x: 0, y: 0, z: 0}
        - idBullet: 12
          timeDelay: 0
          offset: {x: -0.35, y: 0.4, z: 0}
          eulerAngle: {x: 0, y: 0, z: 6.5}
        - idBullet: 12
          timeDelay: 0
          offset: {x: -0.3, y: 0.4, z: 0}
          eulerAngle: {x: 0, y: 0, z: 5}
        - idBullet: 12
          timeDelay: 0
          offset: {x: -0.25, y: 0.4, z: 0}
          eulerAngle: {x: 0, y: 0, z: 3}
        - idBullet: 12
          timeDelay: 0
          offset: {x: -0.15, y: 0.4, z: 0}
          eulerAngle: {x: 0, y: 0, z: 1.5}
        - idBullet: 12
          timeDelay: 0
          offset: {x: 0.15, y: 0.4, z: 0}
          eulerAngle: {x: 0, y: 0, z: -1.5}
        - idBullet: 12
          timeDelay: 0
          offset: {x: 0.25, y: 0.4, z: 0}
          eulerAngle: {x: 0, y: 0, z: -3}
        - idBullet: 12
          timeDelay: 0
          offset: {x: 0.3, y: 0.4, z: 0}
          eulerAngle: {x: 0, y: 0, z: -5}
        - idBullet: 12
          timeDelay: 0
          offset: {x: 0.35, y: 0.4, z: 0}
          eulerAngle: {x: 0, y: 0, z: -6.5}
    - level: 9
      attacks:
      - rateAttack: 0.15
        scaleDamage: 1
        withBulletLaser: 0.1
        typeAttack: 0
        dataAttack:
        - idBullet: 12
          timeDelay: 0
          offset: {x: -0.35, y: 0.4, z: 0}
          eulerAngle: {x: 0, y: 0, z: 7}
        - idBullet: 12
          timeDelay: 0
          offset: {x: -0.3, y: 0.4, z: 0}
          eulerAngle: {x: 0, y: 0, z: 5}
        - idBullet: 12
          timeDelay: 0
          offset: {x: -0.25, y: 0.4, z: 0}
          eulerAngle: {x: 0, y: 0, z: 3.5}
        - idBullet: 12
          timeDelay: 0
          offset: {x: -0.2, y: 0.4, z: 0}
          eulerAngle: {x: 0, y: 0, z: 1.5}
        - idBullet: 12
          timeDelay: 0
          offset: {x: -0.1, y: 0.4, z: 0}
          eulerAngle: {x: 0, y: 0, z: 0}
        - idBullet: 12
          timeDelay: 0
          offset: {x: 0.1, y: 0.4, z: 0}
          eulerAngle: {x: 0, y: 0, z: 0}
        - idBullet: 12
          timeDelay: 0
          offset: {x: 0.2, y: 0.4, z: 0}
          eulerAngle: {x: 0, y: 0, z: -1.5}
        - idBullet: 12
          timeDelay: 0
          offset: {x: 0.25, y: 0.4, z: 0}
          eulerAngle: {x: 0, y: 0, z: -3.5}
        - idBullet: 12
          timeDelay: 0
          offset: {x: 0.3, y: 0.4, z: 0}
          eulerAngle: {x: 0, y: 0, z: -5}
        - idBullet: 12
          timeDelay: 0
          offset: {x: 0.35, y: 0.4, z: 0}
          eulerAngle: {x: 0, y: 0, z: -7}
    - level: 10
      attacks:
      - rateAttack: 0.15
        scaleDamage: 1
        withBulletLaser: 0.1
        typeAttack: 0
        dataAttack:
        - idBullet: 12
          timeDelay: 0
          offset: {x: -0.3, y: 0.4, z: 0}
          eulerAngle: {x: 0, y: 0, z: 3}
        - idBullet: 12
          timeDelay: 0
          offset: {x: -0.3, y: 0.4, z: 0}
          eulerAngle: {x: 0, y: 0, z: 7}
        - idBullet: 12
          timeDelay: 0
          offset: {x: -0.3, y: 0.4, z: 0}
          eulerAngle: {x: 0, y: 0, z: 11}
        - idBullet: 12
          timeDelay: 0
          offset: {x: -0.4, y: 0.4, z: 0}
          eulerAngle: {x: 0, y: 0, z: 15}
        - idBullet: 12
          timeDelay: 0
          offset: {x: -0.4, y: 0.4, z: 0}
          eulerAngle: {x: 0, y: 0, z: 19}
        - idBullet: 12
          timeDelay: 0
          offset: {x: -0.4, y: 0.4, z: 0}
          eulerAngle: {x: 0, y: 0, z: 23}
        - idBullet: 12
          timeDelay: 0
          offset: {x: 0.4, y: 0.4, z: 0}
          eulerAngle: {x: 0, y: 0, z: -23}
        - idBullet: 12
          timeDelay: 0
          offset: {x: 0.4, y: 0.4, z: 0}
          eulerAngle: {x: 0, y: 0, z: -19}
        - idBullet: 12
          timeDelay: 0
          offset: {x: 0.4, y: 0.4, z: 0}
          eulerAngle: {x: 0, y: 0, z: -15}
        - idBullet: 12
          timeDelay: 0
          offset: {x: 0.3, y: 0.4, z: 0}
          eulerAngle: {x: 0, y: 0, z: -11}
        - idBullet: 12
          timeDelay: 0
          offset: {x: 0.3, y: 0.4, z: 0}
          eulerAngle: {x: 0, y: 0, z: -7}
        - idBullet: 12
          timeDelay: 0
          offset: {x: 0.3, y: 0.4, z: 0}
          eulerAngle: {x: 0, y: 0, z: -3}
  - rank: 4
    timeSuper: 5
    levels:
    - level: 0
      attacks:
      - rateAttack: 0.15
        scaleDamage: 1
        withBulletLaser: 0.1
        typeAttack: 0
        dataAttack:
        - idBullet: 12
          timeDelay: 0
          offset: {x: 0, y: 0.4, z: 0}
          eulerAngle: {x: 0, y: 0, z: 0}
    - level: 1
      attacks:
      - rateAttack: 0.15
        scaleDamage: 1
        withBulletLaser: 0.1
        typeAttack: 0
        dataAttack:
        - idBullet: 12
          timeDelay: 0
          offset: {x: 0.15, y: 0.4, z: 0}
          eulerAngle: {x: 0, y: 0, z: 0}
        - idBullet: 12
          timeDelay: 0
          offset: {x: -0.15, y: 0.4, z: 0}
          eulerAngle: {x: 0, y: 0, z: 0}
    - level: 2
      attacks:
      - rateAttack: 0.15
        scaleDamage: 1
        withBulletLaser: 0.1
        typeAttack: 0
        dataAttack:
        - idBullet: 12
          timeDelay: 0
          offset: {x: 0, y: 0.4, z: 0}
          eulerAngle: {x: 0, y: 0, z: 0}
        - idBullet: 12
          timeDelay: 0
          offset: {x: -0.15, y: 0.4, z: 0}
          eulerAngle: {x: 0, y: 0, z: 2}
        - idBullet: 12
          timeDelay: 0
          offset: {x: 0.15, y: 0.4, z: 0}
          eulerAngle: {x: 0, y: 0, z: -2}
    - level: 3
      attacks:
      - rateAttack: 0.15
        scaleDamage: 1
        withBulletLaser: 0.1
        typeAttack: 0
        dataAttack:
        - idBullet: 12
          timeDelay: 0
          offset: {x: 0.15, y: 0.4, z: 0}
          eulerAngle: {x: 0, y: 0, z: 0}
        - idBullet: 12
          timeDelay: 0
          offset: {x: -0.15, y: 0.4, z: 0}
          eulerAngle: {x: 0, y: 0, z: 0}
        - idBullet: 12
          timeDelay: 0
          offset: {x: 0.25, y: 0.4, z: 0}
          eulerAngle: {x: 0, y: 0, z: -1.5}
        - idBullet: 12
          timeDelay: 0
          offset: {x: -0.25, y: 0.4, z: 0}
          eulerAngle: {x: 0, y: 0, z: 1.5}
    - level: 4
      attacks:
      - rateAttack: 0.15
        scaleDamage: 1
        withBulletLaser: 0.1
        typeAttack: 0
        dataAttack:
        - idBullet: 12
          timeDelay: 0
          offset: {x: 0, y: 0.4, z: 0}
          eulerAngle: {x: 0, y: 0, z: 0}
        - idBullet: 12
          timeDelay: 0
          offset: {x: -0.2, y: 0.4, z: 0}
          eulerAngle: {x: 0, y: 0, z: 0}
        - idBullet: 12
          timeDelay: 0
          offset: {x: 0.2, y: 0.4, z: 0}
          eulerAngle: {x: 0, y: 0, z: 0}
        - idBullet: 12
          timeDelay: 0
          offset: {x: -0.25, y: 0.4, z: 0}
          eulerAngle: {x: 0, y: 0, z: 2.5}
        - idBullet: 12
          timeDelay: 0
          offset: {x: 0.25, y: 0.4, z: 0}
          eulerAngle: {x: 0, y: 0, z: -2.5}
    - level: 5
      attacks:
      - rateAttack: 0.15
        scaleDamage: 1
        withBulletLaser: 0.1
        typeAttack: 0
        dataAttack:
        - idBullet: 12
          timeDelay: 0
          offset: {x: 0.25, y: 0.4, z: 0}
          eulerAngle: {x: 0, y: 0, z: -2.5}
        - idBullet: 12
          timeDelay: 0
          offset: {x: 0.15, y: 0.4, z: 0}
          eulerAngle: {x: 0, y: 0, z: 0}
        - idBullet: 12
          timeDelay: 0
          offset: {x: 0.3, y: 0.4, z: 0}
          eulerAngle: {x: 0, y: 0, z: -5}
        - idBullet: 12
          timeDelay: 0
          offset: {x: -0.3, y: 0.4, z: 0}
          eulerAngle: {x: 0, y: 0, z: 5}
        - idBullet: 12
          timeDelay: 0
          offset: {x: -0.15, y: 0.4, z: 0}
          eulerAngle: {x: 0, y: 0, z: 0}
        - idBullet: 12
          timeDelay: 0
          offset: {x: -0.25, y: 0.4, z: 0}
          eulerAngle: {x: 0, y: 0, z: 2.5}
    - level: 6
      attacks:
      - rateAttack: 0.15
        scaleDamage: 1
        withBulletLaser: 0.1
        typeAttack: 0
        dataAttack:
        - idBullet: 12
          timeDelay: 0
          offset: {x: 0, y: 0.4, z: 0}
          eulerAngle: {x: 0, y: 0, z: 0}
        - idBullet: 12
          timeDelay: 0
          offset: {x: 0.2, y: 0.4, z: 0}
          eulerAngle: {x: 0, y: 0, z: -1.5}
        - idBullet: 12
          timeDelay: 0
          offset: {x: 0.3, y: 0.4, z: 0}
          eulerAngle: {x: 0, y: 0, z: -3}
        - idBullet: 12
          timeDelay: 0
          offset: {x: 0.3, y: 0.4, z: 0}
          eulerAngle: {x: 0, y: 0, z: -6}
        - idBullet: 12
          timeDelay: 0
          offset: {x: -0.3, y: 0.4, z: 0}
          eulerAngle: {x: 0, y: 0, z: 6}
        - idBullet: 12
          timeDelay: 0
          offset: {x: -0.3, y: 0.4, z: 0}
          eulerAngle: {x: 0, y: 0, z: 3}
        - idBullet: 12
          timeDelay: 0
          offset: {x: -0.2, y: 0.4, z: 0}
          eulerAngle: {x: 0, y: 0, z: 1.5}
    - level: 7
      attacks:
      - rateAttack: 0.15
        scaleDamage: 1
        withBulletLaser: 0.1
        typeAttack: 0
        dataAttack:
        - idBullet: 12
          timeDelay: 0
          offset: {x: -0.1, y: 0.4, z: 0}
          eulerAngle: {x: 0, y: 0, z: 0}
        - idBullet: 12
          timeDelay: 0
          offset: {x: -0.25, y: 0.4, z: 0}
          eulerAngle: {x: 0, y: 0, z: 1.5}
        - idBullet: 12
          timeDelay: 0
          offset: {x: -0.25, y: 0.4, z: 0}
          eulerAngle: {x: 0, y: 0, z: 3.5}
        - idBullet: 12
          timeDelay: 0
          offset: {x: -0.3, y: 0.4, z: 0}
          eulerAngle: {x: 0, y: 0, z: 6}
        - idBullet: 12
          timeDelay: 0
          offset: {x: 0.3, y: 0.4, z: 0}
          eulerAngle: {x: 0, y: 0, z: -6}
        - idBullet: 12
          timeDelay: 0
          offset: {x: 0.25, y: 0.4, z: 0}
          eulerAngle: {x: 0, y: 0, z: -3.5}
        - idBullet: 12
          timeDelay: 0
          offset: {x: 0.25, y: 0.4, z: 0}
          eulerAngle: {x: 0, y: 0, z: -1.5}
        - idBullet: 12
          timeDelay: 0
          offset: {x: 0.1, y: 0.4, z: 0}
          eulerAngle: {x: 0, y: 0, z: 0}
    - level: 8
      attacks:
      - rateAttack: 0.15
        scaleDamage: 1
        withBulletLaser: 0.1
        typeAttack: 0
        dataAttack:
        - idBullet: 12
          timeDelay: 0
          offset: {x: 0, y: 0.4, z: 0}
          eulerAngle: {x: 0, y: 0, z: 0}
        - idBullet: 12
          timeDelay: 0
          offset: {x: -0.35, y: 0.4, z: 0}
          eulerAngle: {x: 0, y: 0, z: 6.5}
        - idBullet: 12
          timeDelay: 0
          offset: {x: -0.3, y: 0.4, z: 0}
          eulerAngle: {x: 0, y: 0, z: 5}
        - idBullet: 12
          timeDelay: 0
          offset: {x: -0.25, y: 0.4, z: 0}
          eulerAngle: {x: 0, y: 0, z: 3}
        - idBullet: 12
          timeDelay: 0
          offset: {x: -0.15, y: 0.4, z: 0}
          eulerAngle: {x: 0, y: 0, z: 1.5}
        - idBullet: 12
          timeDelay: 0
          offset: {x: 0.15, y: 0.4, z: 0}
          eulerAngle: {x: 0, y: 0, z: -1.5}
        - idBullet: 12
          timeDelay: 0
          offset: {x: 0.25, y: 0.4, z: 0}
          eulerAngle: {x: 0, y: 0, z: -3}
        - idBullet: 12
          timeDelay: 0
          offset: {x: 0.3, y: 0.4, z: 0}
          eulerAngle: {x: 0, y: 0, z: -5}
        - idBullet: 12
          timeDelay: 0
          offset: {x: 0.35, y: 0.4, z: 0}
          eulerAngle: {x: 0, y: 0, z: -6.5}
    - level: 9
      attacks:
      - rateAttack: 0.15
        scaleDamage: 1
        withBulletLaser: 0.1
        typeAttack: 0
        dataAttack:
        - idBullet: 12
          timeDelay: 0
          offset: {x: -0.35, y: 0.4, z: 0}
          eulerAngle: {x: 0, y: 0, z: 7}
        - idBullet: 12
          timeDelay: 0
          offset: {x: -0.3, y: 0.4, z: 0}
          eulerAngle: {x: 0, y: 0, z: 5}
        - idBullet: 12
          timeDelay: 0
          offset: {x: -0.25, y: 0.4, z: 0}
          eulerAngle: {x: 0, y: 0, z: 3.5}
        - idBullet: 12
          timeDelay: 0
          offset: {x: -0.2, y: 0.4, z: 0}
          eulerAngle: {x: 0, y: 0, z: 1.5}
        - idBullet: 12
          timeDelay: 0
          offset: {x: -0.1, y: 0.4, z: 0}
          eulerAngle: {x: 0, y: 0, z: 0}
        - idBullet: 12
          timeDelay: 0
          offset: {x: 0.1, y: 0.4, z: 0}
          eulerAngle: {x: 0, y: 0, z: 0}
        - idBullet: 12
          timeDelay: 0
          offset: {x: 0.2, y: 0.4, z: 0}
          eulerAngle: {x: 0, y: 0, z: -1.5}
        - idBullet: 12
          timeDelay: 0
          offset: {x: 0.25, y: 0.4, z: 0}
          eulerAngle: {x: 0, y: 0, z: -3.5}
        - idBullet: 12
          timeDelay: 0
          offset: {x: 0.3, y: 0.4, z: 0}
          eulerAngle: {x: 0, y: 0, z: -5}
        - idBullet: 12
          timeDelay: 0
          offset: {x: 0.35, y: 0.4, z: 0}
          eulerAngle: {x: 0, y: 0, z: -7}
    - level: 10
      attacks:
      - rateAttack: 0.15
        scaleDamage: 1
        withBulletLaser: 0.1
        typeAttack: 0
        dataAttack:
        - idBullet: 12
          timeDelay: 0
          offset: {x: -0.3, y: 0.4, z: 0}
          eulerAngle: {x: 0, y: 0, z: 3}
        - idBullet: 12
          timeDelay: 0
          offset: {x: -0.3, y: 0.4, z: 0}
          eulerAngle: {x: 0, y: 0, z: 7}
        - idBullet: 12
          timeDelay: 0
          offset: {x: -0.3, y: 0.4, z: 0}
          eulerAngle: {x: 0, y: 0, z: 11}
        - idBullet: 12
          timeDelay: 0
          offset: {x: -0.4, y: 0.4, z: 0}
          eulerAngle: {x: 0, y: 0, z: 15}
        - idBullet: 12
          timeDelay: 0
          offset: {x: -0.4, y: 0.4, z: 0}
          eulerAngle: {x: 0, y: 0, z: 19}
        - idBullet: 12
          timeDelay: 0
          offset: {x: -0.4, y: 0.4, z: 0}
          eulerAngle: {x: 0, y: 0, z: 23}
        - idBullet: 12
          timeDelay: 0
          offset: {x: 0.4, y: 0.4, z: 0}
          eulerAngle: {x: 0, y: 0, z: -23}
        - idBullet: 12
          timeDelay: 0
          offset: {x: 0.4, y: 0.4, z: 0}
          eulerAngle: {x: 0, y: 0, z: -19}
        - idBullet: 12
          timeDelay: 0
          offset: {x: 0.4, y: 0.4, z: 0}
          eulerAngle: {x: 0, y: 0, z: -15}
        - idBullet: 12
          timeDelay: 0
          offset: {x: 0.3, y: 0.4, z: 0}
          eulerAngle: {x: 0, y: 0, z: -11}
        - idBullet: 12
          timeDelay: 0
          offset: {x: 0.3, y: 0.4, z: 0}
          eulerAngle: {x: 0, y: 0, z: -7}
        - idBullet: 12
          timeDelay: 0
          offset: {x: 0.3, y: 0.4, z: 0}
          eulerAngle: {x: 0, y: 0, z: -3}
