%YAML 1.1
%TAG !u! tag:unity3d.com,2011:
--- !u!114 &11400000
MonoBehaviour:
  m_ObjectHideFlags: 0
  m_CorrespondingSourceObject: {fileID: 0}
  m_PrefabInstance: {fileID: 0}
  m_PrefabAsset: {fileID: 0}
  m_GameObject: {fileID: 0}
  m_Enabled: 1
  m_EditorHideFlags: 0
  m_Script: {fileID: 11500000, guid: 6984841916df507468082df36144d543, type: 3}
  m_Name: SpritesData
  m_EditorClassIdentifier: 
  GoldIcon: {fileID: 21300000, guid: 30419608b58f32c41aeabc5b71c46535, type: 3}
  GemIcon: {fileID: 21300000, guid: a93f010963cd98b44a7636a677eb73fd, type: 3}
  FuelIcon: {fileID: 21300000, guid: 66e4a34ddbbfece47b38b328f1027051, type: 3}
  Item3: {fileID: 21300000, guid: d1832aebeeb4bda4daff19d338a528f0, type: 3}
  Item5: {fileID: 21300000, guid: 9d52a43b60a54d64faa56188e4a89e18, type: 3}
  Item10: {fileID: 21300000, guid: d1b1e476516c2934285761d779a8759b, type: 3}
  Bomb: {fileID: 21300000, guid: 5050a46e2fb316b4190d74b195b858ad, type: 3}
  borderRanks:
  - rank: 0
    sprBorder: {fileID: 21300000, guid: 4e934092510f68c409a8cb941875bb2a, type: 3}
  - rank: 1
    sprBorder: {fileID: 21300000, guid: 20b580199a0f9cf448ccad00d919f770, type: 3}
  - rank: 2
    sprBorder: {fileID: 21300000, guid: f2408d83243fcb849a85119b6d56c85a, type: 3}
  - rank: 3
    sprBorder: {fileID: 21300000, guid: 4c0104c72e4dc1243a74cb551546b6c5, type: 3}
  - rank: 4
    sprBorder: {fileID: 21300000, guid: 62fdff6ff407bf14a836798f6b73f351, type: 3}
  - rank: 5
    sprBorder: {fileID: 21300000, guid: fad197cfb49911447af0d984ae3445b1, type: 3}
  - rank: 6
    sprBorder: {fileID: 0}
