
E36.png
size: 256,128
format: RGBA8888
filter: Linear,Linear
repeat: none
1
  rotate: false
  xy: 97, 83
  size: 66, 40
  orig: 66, 40
  offset: 0, 0
  index: -1
2
  rotate: false
  xy: 2, 2
  size: 93, 121
  orig: 93, 121
  offset: 0, 0
  index: -1
3
  rotate: false
  xy: 97, 16
  size: 34, 65
  orig: 34, 65
  offset: 0, 0
  index: -1
4
  rotate: true
  xy: 165, 89
  size: 34, 65
  orig: 34, 65
  offset: 0, 0
  index: -1
