%YAML 1.1
%TAG !u! tag:unity3d.com,2011:
--- !u!114 &11400000
MonoBehaviour:
  m_ObjectHideFlags: 0
  m_CorrespondingSourceObject: {fileID: 0}
  m_PrefabInstance: {fileID: 0}
  m_PrefabAsset: {fileID: 0}
  m_GameObject: {fileID: 0}
  m_Enabled: 1
  m_EditorHideFlags: 0
  m_Script: {fileID: 11500000, guid: a6b194f808b1af6499c93410e504af42, type: 3}
  m_Name: E37_Boss10_Atlas
  m_EditorClassIdentifier: 
  atlasFile: {fileID: 4900000, guid: cd7e0eeefc8b7b84f9ccfd57d5a86765, type: 3}
  materials:
  - {fileID: 2100000, guid: 7110130d098adf3448d6a427965095a2, type: 2}
