{
"skeleton": { "hash": "9nIGkTSbnEjdpmXSSoQTafbCQ+E", "spine": "3.6.53", "width": 547.82, "height": 760.02, "images": "./images/" },
"bones": [
	{ "name": "root" },
	{ "name": "X", "parent": "root", "length": 46.41, "x": -0.47, "y": -31.54 },
	{ "name": "Y", "parent": "X", "length": 44.07, "rotation": -90, "y": 0.39 },
	{ "name": "D1", "parent": "Y", "length": 50.19, "rotation": 180, "x": -54.14, "y": -0.14 },
	{ "name": "Lv5_L_01", "parent": "D1", "length": 29.44, "rotation": 179.13, "x": -7.28, "y": 57.07 },
	{ "name": "Lv1_L_01", "parent": "Lv5_L_01", "length": 24.53, "rotation": -96.26, "x": -34.17, "y": 1.29 },
	{ "name": "Lv5_R_01", "parent": "D1", "length": 26.76, "rotation": -180, "x": -6.85, "y": -58.42 },
	{ "name": "Lv1_R_01", "parent": "Lv5_R_01", "length": 30.49, "rotation": 93.81, "x": -34.22, "y": -4.68 },
	{ "name": "Lv2_L_01", "parent": "Lv5_L_01", "length": 35.49, "rotation": -142.26, "x": -49.47, "y": 7.15 },
	{ "name": "Lv2_R_01", "parent": "Lv5_R_01", "length": 27.42, "rotation": 146.31, "x": -48.93, "y": -9.24 },
	{ "name": "Lv3_L_01", "parent": "Lv5_L_01", "length": 41.59, "rotation": -177.73, "x": -75.46, "y": 15.37 },
	{ "name": "Lv3_R_01", "parent": "Lv5_R_01", "length": 40.1, "rotation": 177.1, "x": -77.32, "y": -20.9 }
],
"slots": [
	{ "name": "Lv5_L_01", "bone": "Lv5_L_01", "dark": "000000", "attachment": "Lv5_L_01" },
	{ "name": "Lv5_R_01", "bone": "Lv5_R_01", "dark": "000000", "attachment": "Lv5_R_01" },
	{ "name": "Lv1_L_01", "bone": "Lv1_L_01", "attachment": "Lv1_L_01" },
	{ "name": "Lv2_L_01", "bone": "Lv2_L_01", "attachment": "Lv2_L_01" },
	{ "name": "Lv3_L_01", "bone": "Lv3_L_01", "attachment": "Lv3_L_01" },
	{ "name": "Lv1_R_01", "bone": "Lv1_R_01", "attachment": "Lv1_R_01" },
	{ "name": "Lv2_R_01", "bone": "Lv2_R_01", "attachment": "Lv2_R_01" },
	{ "name": "Lv3_R_01", "bone": "Lv3_R_01", "attachment": "Lv3_R_01" },
	{ "name": "D1", "bone": "D1", "attachment": "D1" }
],
"skins": {
	"default": {
		"D1": {
			"D1": { "x": 33.99, "y": 0.33, "rotation": -90, "width": 160, "height": 135 }
		},
		"Lv1_L_01": {
			"Lv1_L_1": { "path": "Lv1_L_01", "x": 17.13, "y": 0.51, "rotation": -172.87, "width": 58, "height": 38 }
		},
		"Lv1_R_01": {
			"Lv1_R_1": { "path": "Lv1_R_01", "x": 17.96, "y": -0.08, "rotation": -3.81, "width": 58, "height": 38 }
		},
		"Lv2_L_01": {
			"Lv2_L_1": { "path": "Lv2_L_01", "x": 28.32, "y": -0.43, "rotation": -126.87, "width": 59, "height": 87 }
		},
		"Lv2_R_01": {
			"Lv2_R_1": { "path": "Lv2_R_01", "x": 27.93, "y": -0.6, "rotation": -56.31, "width": 59, "height": 87 }
		},
		"Lv3_L_01": {
			"Lv3_L_1": { "path": "Lv3_L_01", "x": 30.01, "y": -1.96, "rotation": -91.4, "width": 44, "height": 113 }
		},
		"Lv3_R_01": {
			"Lv3_R_1": { "path": "Lv3_R_01", "x": 27.54, "y": 0.24, "rotation": -87.1, "width": 44, "height": 113 }
		}
	},
	"Skin_Lv0": {
		"Lv5_L_01": {
			"Lv5_L_01": { "x": -47.85, "y": 15.04, "rotation": 90.87, "width": 62, "height": 117 }
		},
		"Lv5_R_01": {
			"Lv5_R_01": { "x": -46.43, "y": -16.69, "rotation": 90, "width": 62, "height": 117 }
		}
	},
	"Skin_Lv1": {
		"Lv3_L_01": {
			"Lv3_L_01": { "x": 30.01, "y": -1.96, "rotation": -91.4, "width": 44, "height": 113 }
		},
		"Lv3_R_01": {
			"Lv3_R_01": { "x": 27.54, "y": 0.24, "rotation": -87.1, "width": 44, "height": 113 }
		}
	},
	"Skin_Lv2": {
		"Lv2_L_01": {
			"Lv2_L_01": { "x": 28.32, "y": -0.43, "rotation": -126.87, "width": 59, "height": 87 }
		},
		"Lv2_R_01": {
			"Lv2_R_01": { "x": 27.93, "y": -0.6, "rotation": -56.31, "width": 59, "height": 87 }
		},
		"Lv3_L_01": {
			"Lv3_L_01": { "x": 30.01, "y": -1.96, "rotation": -91.4, "width": 44, "height": 113 }
		},
		"Lv3_R_01": {
			"Lv3_R_01": { "x": 27.54, "y": 0.24, "rotation": -87.1, "width": 44, "height": 113 }
		}
	},
	"Skin_Lv3": {
		"Lv1_L_01": {
			"Lv1_L_01": { "x": 17.13, "y": 0.51, "rotation": -172.87, "width": 58, "height": 38 }
		},
		"Lv1_R_01": {
			"Lv1_R_01": { "x": 17.96, "y": -0.08, "rotation": -3.81, "width": 58, "height": 38 }
		},
		"Lv2_L_01": {
			"Lv2_L_01": { "x": 28.32, "y": -0.43, "rotation": -126.87, "width": 59, "height": 87 }
		},
		"Lv2_R_01": {
			"Lv2_R_01": { "x": 27.93, "y": -0.6, "rotation": -56.31, "width": 59, "height": 87 }
		},
		"Lv3_L_01": {
			"Lv3_L_01": { "x": 30.01, "y": -1.96, "rotation": -91.4, "width": 44, "height": 113 }
		},
		"Lv3_R_01": {
			"Lv3_R_01": { "x": 27.54, "y": 0.24, "rotation": -87.1, "width": 44, "height": 113 }
		}
	},
	"Skin_Lv4": {
		"Lv1_L_01": {
			"Lv1_L_01": { "x": 31.88, "y": -25.91, "rotation": -172.87, "width": 58, "height": 38 }
		},
		"Lv1_R_01": {
			"Lv1_R_01": { "x": 30.5, "y": 27.9, "rotation": -3.81, "width": 58, "height": 38 }
		},
		"Lv2_L_01": {
			"Lv2_L_01": { "x": 57.57, "y": -8.16, "rotation": -126.87, "width": 59, "height": 87 }
		},
		"Lv2_R_01": {
			"Lv2_R_01": { "x": 57.76, "y": 6.49, "rotation": -56.31, "width": 59, "height": 87 }
		},
		"Lv3_L_01": {
			"Lv3_L_01": { "x": 58.32, "y": 8.71, "rotation": -91.4, "width": 44, "height": 113 }
		},
		"Lv3_R_01": {
			"Lv3_R_01": { "x": 56.8, "y": -8.94, "rotation": -87.1, "width": 44, "height": 113 }
		},
		"Lv5_L_01": {
			"Lv5_L_01": { "x": -75.72, "y": 3.25, "rotation": 90.87, "width": 62, "height": 117 }
		},
		"Lv5_R_01": {
			"Lv5_R_01": { "x": -75.18, "y": -6.04, "rotation": 90, "width": 62, "height": 117 }
		}
	}
},
"animations": {
	"Idle_1": {
		"bones": {
			"X": {
				"rotate": [
					{ "time": 0, "angle": 0, "curve": "stepped" },
					{ "time": 2, "angle": 0 }
				],
				"translate": [
					{ "time": 0, "x": 0, "y": 0, "curve": "stepped" },
					{ "time": 2, "x": 0, "y": 0 }
				],
				"scale": [
					{ "time": 0, "x": 1, "y": 1, "curve": "stepped" },
					{ "time": 2, "x": 1, "y": 1 }
				]
			},
			"Y": {
				"rotate": [
					{ "time": 0, "angle": 0, "curve": "stepped" },
					{ "time": 2, "angle": 0 }
				],
				"translate": [
					{ "time": 0, "x": 0, "y": 0, "curve": "stepped" },
					{ "time": 2, "x": 0, "y": 0 }
				],
				"scale": [
					{ "time": 0, "x": 1, "y": 1, "curve": "stepped" },
					{ "time": 2, "x": 1, "y": 1 }
				]
			},
			"D1": {
				"rotate": [
					{ "time": 0, "angle": 0, "curve": "stepped" },
					{ "time": 2, "angle": 0 }
				],
				"translate": [
					{ "time": 0, "x": 0, "y": 0, "curve": "stepped" },
					{ "time": 2, "x": 0, "y": 0 }
				],
				"scale": [
					{ "time": 0, "x": 1, "y": 1, "curve": "stepped" },
					{ "time": 2, "x": 1, "y": 1 }
				]
			},
			"Lv5_L_01": {
				"rotate": [
					{ "time": 0, "angle": 0, "curve": "stepped" },
					{ "time": 2, "angle": 0 }
				],
				"translate": [
					{ "time": 0, "x": 0, "y": 0 },
					{
						"time": 1,
						"x": -11.02,
						"y": 0,
						"curve": [ 0.25, 0, 0.75, 1 ]
					},
					{ "time": 2, "x": 0, "y": 0 }
				],
				"scale": [
					{ "time": 0, "x": 1, "y": 1, "curve": "stepped" },
					{ "time": 2, "x": 1, "y": 1 }
				]
			},
			"Lv1_L_01": {
				"rotate": [
					{
						"time": 0,
						"angle": 4.09,
						"curve": [ 0.324, 0.27, 0.674, 0.64 ]
					},
					{
						"time": 0.3333,
						"angle": 0,
						"curve": [ 0.301, 0.4, 0.75, 1 ]
					},
					{
						"time": 0.8333,
						"angle": -9.57,
						"curve": [ 0.25, 0, 0.75, 1 ]
					},
					{
						"time": 1.8333,
						"angle": 5.16,
						"curve": [ 0.266, 0, 0.618, 0.4 ]
					},
					{ "time": 2, "angle": 4.09 }
				],
				"translate": [
					{ "time": 0, "x": 0, "y": 0, "curve": "stepped" },
					{ "time": 0.3333, "x": 0, "y": 0, "curve": "stepped" },
					{ "time": 2, "x": 0, "y": 0 }
				],
				"scale": [
					{ "time": 0, "x": 1, "y": 1, "curve": "stepped" },
					{ "time": 0.3333, "x": 1, "y": 1, "curve": "stepped" },
					{ "time": 2, "x": 1, "y": 1 }
				]
			},
			"Lv5_R_01": {
				"rotate": [
					{ "time": 0, "angle": 0, "curve": "stepped" },
					{ "time": 2, "angle": 0 }
				],
				"translate": [
					{
						"time": 0,
						"x": 0,
						"y": 0,
						"curve": [ 0.25, 0, 0.75, 1 ]
					},
					{
						"time": 1,
						"x": -11.02,
						"y": 0,
						"curve": [ 0.25, 0, 0.75, 1 ]
					},
					{ "time": 2, "x": 0, "y": 0 }
				],
				"scale": [
					{ "time": 0, "x": 1, "y": 1, "curve": "stepped" },
					{ "time": 2, "x": 1, "y": 1 }
				]
			},
			"Lv1_R_01": {
				"rotate": [
					{
						"time": 0,
						"angle": -5.56,
						"curve": [ 0.324, 0.27, 0.674, 0.64 ]
					},
					{
						"time": 0.3333,
						"angle": 0,
						"curve": [ 0.301, 0.4, 0.75, 1 ]
					},
					{
						"time": 0.8333,
						"angle": 5.85,
						"curve": [ 0.25, 0, 0.75, 1 ]
					},
					{
						"time": 1.8333,
						"angle": -7.02,
						"curve": [ 0.266, 0, 0.618, 0.4 ]
					},
					{ "time": 2, "angle": -5.56 }
				],
				"translate": [
					{ "time": 0, "x": 0, "y": 0, "curve": "stepped" },
					{ "time": 0.3333, "x": 0, "y": 0, "curve": "stepped" },
					{ "time": 2, "x": 0, "y": 0 }
				],
				"scale": [
					{ "time": 0, "x": 1, "y": 1, "curve": "stepped" },
					{ "time": 0.3333, "x": 1, "y": 1, "curve": "stepped" },
					{ "time": 2, "x": 1, "y": 1 }
				]
			},
			"Lv2_R_01": {
				"rotate": [
					{
						"time": 0,
						"angle": -2.96,
						"curve": [ 0.379, 0.37, 0.731, 0.73 ]
					},
					{
						"time": 0.1667,
						"angle": 0,
						"curve": [ 0.301, 0.4, 0.75, 1 ]
					},
					{
						"time": 0.6667,
						"angle": 5.85,
						"curve": [ 0.25, 0, 0.75, 1 ]
					},
					{
						"time": 1.6667,
						"angle": -7.02,
						"curve": [ 0.244, 0, 0.647, 0.5 ]
					},
					{ "time": 2, "angle": -2.96 }
				],
				"translate": [
					{ "time": 0, "x": 0, "y": 0, "curve": "stepped" },
					{ "time": 0.1667, "x": 0, "y": 0, "curve": "stepped" },
					{ "time": 2, "x": 0, "y": 0 }
				],
				"scale": [
					{ "time": 0, "x": 1, "y": 1, "curve": "stepped" },
					{ "time": 0.1667, "x": 1, "y": 1, "curve": "stepped" },
					{ "time": 2, "x": 1, "y": 1 }
				]
			},
			"Lv2_L_01": {
				"rotate": [
					{
						"time": 0,
						"angle": 2.18,
						"curve": [ 0.379, 0.37, 0.731, 0.73 ]
					},
					{
						"time": 0.1667,
						"angle": 0,
						"curve": [ 0.301, 0.4, 0.75, 1 ]
					},
					{
						"time": 0.6667,
						"angle": -9.57,
						"curve": [ 0.25, 0, 0.75, 1 ]
					},
					{
						"time": 1.6667,
						"angle": 5.16,
						"curve": [ 0.244, 0, 0.647, 0.5 ]
					},
					{ "time": 2, "angle": 2.18 }
				],
				"translate": [
					{ "time": 0, "x": 0, "y": 0, "curve": "stepped" },
					{ "time": 0.1667, "x": 0, "y": 0, "curve": "stepped" },
					{ "time": 2, "x": 0, "y": 0 }
				],
				"scale": [
					{ "time": 0, "x": 1, "y": 1, "curve": "stepped" },
					{ "time": 0.1667, "x": 1, "y": 1, "curve": "stepped" },
					{ "time": 2, "x": 1, "y": 1 }
				]
			},
			"Lv3_L_01": {
				"rotate": [
					{
						"time": 0,
						"angle": 0,
						"curve": [ 0.271, 0.34, 0.75, 1 ]
					},
					{
						"time": 0.5,
						"angle": 350.43,
						"curve": [ 0.25, 0, 0.75, 1 ]
					},
					{
						"time": 1.5,
						"angle": 5.16,
						"curve": [ 0.25, 0, 0.732, 0.67 ]
					},
					{ "time": 2, "angle": 0 }
				],
				"translate": [
					{ "time": 0, "x": 0, "y": 0, "curve": "stepped" },
					{ "time": 2, "x": 0, "y": 0 }
				],
				"scale": [
					{ "time": 0, "x": 1, "y": 1, "curve": "stepped" },
					{ "time": 2, "x": 1, "y": 1 }
				]
			},
			"Lv3_R_01": {
				"rotate": [
					{
						"time": 0,
						"angle": 0,
						"curve": [ 0.271, 0.34, 0.75, 1 ]
					},
					{
						"time": 0.5,
						"angle": -354.15,
						"curve": [ 0.25, 0, 0.75, 1 ]
					},
					{
						"time": 1.5,
						"angle": -7.02,
						"curve": [ 0.25, 0, 0.732, 0.67 ]
					},
					{ "time": 2, "angle": 0 }
				],
				"translate": [
					{ "time": 0, "x": 0, "y": 0, "curve": "stepped" },
					{ "time": 2, "x": 0, "y": 0 }
				],
				"scale": [
					{ "time": 0, "x": 1, "y": 1, "curve": "stepped" },
					{ "time": 2, "x": 1, "y": 1 }
				]
			}
		}
	},
	"Up_Lv1": {
		"slots": {
			"Lv1_L_01": {
				"attachment": [
					{ "time": 0, "name": null }
				]
			},
			"Lv1_R_01": {
				"attachment": [
					{ "time": 0, "name": null }
				]
			},
			"Lv2_L_01": {
				"attachment": [
					{ "time": 0, "name": null }
				]
			},
			"Lv2_R_01": {
				"attachment": [
					{ "time": 0, "name": null }
				]
			},
			"Lv3_L_01": {
				"attachment": [
					{ "time": 0, "name": null },
					{ "time": 0.1333, "name": "Lv3_L_01" },
					{ "time": 0.8, "name": "Lv3_L_01" }
				]
			},
			"Lv3_R_01": {
				"attachment": [
					{ "time": 0, "name": null },
					{ "time": 0.1333, "name": "Lv3_R_01" },
					{ "time": 0.8, "name": "Lv3_R_01" }
				]
			}
		},
		"bones": {
			"X": {
				"rotate": [
					{ "time": 0, "angle": 0, "curve": "stepped" },
					{ "time": 0.4, "angle": 0, "curve": "stepped" },
					{ "time": 0.8, "angle": 0 }
				],
				"translate": [
					{ "time": 0, "x": 0, "y": 0, "curve": "stepped" },
					{ "time": 0.4, "x": 0, "y": 0, "curve": "stepped" },
					{ "time": 0.8, "x": 0, "y": 0 }
				],
				"scale": [
					{ "time": 0, "x": 1, "y": 1, "curve": "stepped" },
					{ "time": 0.4, "x": 1, "y": 1, "curve": "stepped" },
					{ "time": 0.8, "x": 1, "y": 1 }
				]
			},
			"Y": {
				"rotate": [
					{ "time": 0, "angle": 0, "curve": "stepped" },
					{ "time": 0.4, "angle": 0, "curve": "stepped" },
					{ "time": 0.8, "angle": 0 }
				],
				"translate": [
					{ "time": 0, "x": 0, "y": 0, "curve": "stepped" },
					{ "time": 0.4, "x": 0, "y": 0, "curve": "stepped" },
					{ "time": 0.8, "x": 0, "y": 0 }
				],
				"scale": [
					{ "time": 0, "x": 1, "y": 1, "curve": "stepped" },
					{ "time": 0.4, "x": 1, "y": 1, "curve": "stepped" },
					{ "time": 0.8, "x": 1, "y": 1 }
				]
			},
			"D1": {
				"rotate": [
					{ "time": 0, "angle": 0, "curve": "stepped" },
					{ "time": 0.1333, "angle": 0, "curve": "stepped" },
					{ "time": 0.4, "angle": 0, "curve": "stepped" },
					{ "time": 0.8, "angle": 0 }
				],
				"translate": [
					{ "time": 0, "x": 0, "y": 0, "curve": "stepped" },
					{ "time": 0.1333, "x": 0, "y": 0 },
					{ "time": 0.2, "x": 16.97, "y": 0 },
					{ "time": 0.2667, "x": -1.66, "y": 0 },
					{ "time": 0.3333, "x": 11.14, "y": 0 },
					{ "time": 0.4, "x": 0, "y": 0 },
					{ "time": 0.4667, "x": -10.98, "y": 0 },
					{ "time": 0.5333, "x": 3.19, "y": 0 },
					{ "time": 0.8, "x": 0, "y": 0 }
				],
				"scale": [
					{ "time": 0, "x": 1, "y": 1 },
					{ "time": 0.1333, "x": 0.98, "y": 1.02 },
					{ "time": 0.2667, "x": 1.07, "y": 0.98 },
					{ "time": 0.4, "x": 1, "y": 1, "curve": "stepped" },
					{ "time": 0.8, "x": 1, "y": 1 }
				]
			},
			"Lv5_L_01": {
				"rotate": [
					{ "time": 0, "angle": 0, "curve": "stepped" },
					{ "time": 0.4, "angle": 0, "curve": "stepped" },
					{ "time": 0.8, "angle": 0 }
				],
				"translate": [
					{ "time": 0, "x": 0, "y": 0, "curve": "stepped" },
					{ "time": 0.4, "x": 0, "y": 0, "curve": "stepped" },
					{ "time": 0.8, "x": 0, "y": 0 }
				],
				"scale": [
					{ "time": 0, "x": 1, "y": 1, "curve": "stepped" },
					{ "time": 0.4, "x": 1, "y": 1, "curve": "stepped" },
					{ "time": 0.8, "x": 1, "y": 1 }
				]
			},
			"Lv1_L_01": {
				"rotate": [
					{ "time": 0, "angle": 0, "curve": "stepped" },
					{ "time": 0.4, "angle": 0, "curve": "stepped" },
					{ "time": 0.8, "angle": 0 }
				],
				"translate": [
					{ "time": 0, "x": 0, "y": 0, "curve": "stepped" },
					{ "time": 0.4, "x": 0, "y": 0, "curve": "stepped" },
					{ "time": 0.8, "x": 0, "y": 0 }
				],
				"scale": [
					{ "time": 0, "x": 1, "y": 1, "curve": "stepped" },
					{ "time": 0.4, "x": 1, "y": 1, "curve": "stepped" },
					{ "time": 0.8, "x": 1, "y": 1 }
				]
			},
			"Lv5_R_01": {
				"rotate": [
					{ "time": 0, "angle": 0, "curve": "stepped" },
					{ "time": 0.4, "angle": 0, "curve": "stepped" },
					{ "time": 0.8, "angle": 0 }
				],
				"translate": [
					{ "time": 0, "x": 0, "y": 0, "curve": "stepped" },
					{ "time": 0.4, "x": 0, "y": 0, "curve": "stepped" },
					{ "time": 0.8, "x": 0, "y": 0 }
				],
				"scale": [
					{ "time": 0, "x": 1, "y": 1, "curve": "stepped" },
					{ "time": 0.4, "x": 1, "y": 1, "curve": "stepped" },
					{ "time": 0.8, "x": 1, "y": 1 }
				]
			},
			"Lv1_R_01": {
				"rotate": [
					{ "time": 0, "angle": 0, "curve": "stepped" },
					{ "time": 0.4, "angle": 0, "curve": "stepped" },
					{ "time": 0.8, "angle": 0 }
				],
				"translate": [
					{ "time": 0, "x": 0, "y": 0, "curve": "stepped" },
					{ "time": 0.4, "x": 0, "y": 0, "curve": "stepped" },
					{ "time": 0.8, "x": 0, "y": 0 }
				],
				"scale": [
					{ "time": 0, "x": 1, "y": 1, "curve": "stepped" },
					{ "time": 0.4, "x": 1, "y": 1, "curve": "stepped" },
					{ "time": 0.8, "x": 1, "y": 1 }
				]
			},
			"Lv2_R_01": {
				"rotate": [
					{ "time": 0, "angle": 0, "curve": "stepped" },
					{ "time": 0.4, "angle": 0, "curve": "stepped" },
					{ "time": 0.8, "angle": 0 }
				],
				"translate": [
					{ "time": 0, "x": 0, "y": 0, "curve": "stepped" },
					{ "time": 0.4, "x": 0, "y": 0, "curve": "stepped" },
					{ "time": 0.8, "x": 0, "y": 0 }
				],
				"scale": [
					{ "time": 0, "x": 1, "y": 1, "curve": "stepped" },
					{ "time": 0.4, "x": 1, "y": 1, "curve": "stepped" },
					{ "time": 0.8, "x": 1, "y": 1 }
				]
			},
			"Lv2_L_01": {
				"rotate": [
					{ "time": 0, "angle": 0, "curve": "stepped" },
					{ "time": 0.4, "angle": 0, "curve": "stepped" },
					{ "time": 0.8, "angle": 0 }
				],
				"translate": [
					{ "time": 0, "x": 0, "y": 0, "curve": "stepped" },
					{ "time": 0.4, "x": 0, "y": 0, "curve": "stepped" },
					{ "time": 0.8, "x": 0, "y": 0 }
				],
				"scale": [
					{ "time": 0, "x": 1, "y": 1, "curve": "stepped" },
					{ "time": 0.4, "x": 1, "y": 1, "curve": "stepped" },
					{ "time": 0.8, "x": 1, "y": 1 }
				]
			},
			"Lv3_L_01": {
				"rotate": [
					{ "time": 0, "angle": 0, "curve": "stepped" },
					{ "time": 0.4, "angle": 0, "curve": "stepped" },
					{ "time": 0.8, "angle": 0 }
				],
				"translate": [
					{ "time": 0, "x": 71.35, "y": 1.08, "curve": "stepped" },
					{ "time": 0.1333, "x": 71.35, "y": 1.08 },
					{ "time": 0.4, "x": 0, "y": 0, "curve": "stepped" },
					{ "time": 0.8, "x": 0, "y": 0 }
				],
				"scale": [
					{ "time": 0, "x": 1, "y": 1 },
					{ "time": 0.4, "x": 0.786, "y": 1 },
					{ "time": 0.8, "x": 1, "y": 1 }
				]
			},
			"Lv3_R_01": {
				"rotate": [
					{ "time": 0, "angle": 0, "curve": "stepped" },
					{ "time": 0.4, "angle": 0, "curve": "stepped" },
					{ "time": 0.8, "angle": 0 }
				],
				"translate": [
					{ "time": 0, "x": 71.35, "y": 0, "curve": "stepped" },
					{ "time": 0.1333, "x": 71.35, "y": 0 },
					{ "time": 0.4, "x": 0, "y": 0, "curve": "stepped" },
					{ "time": 0.8, "x": 0, "y": 0 }
				],
				"scale": [
					{ "time": 0, "x": 1, "y": 1 },
					{ "time": 0.4, "x": 0.786, "y": 1 },
					{ "time": 0.8, "x": 1, "y": 1 }
				]
			}
		}
	},
	"Up_Lv2": {
		"slots": {
			"Lv1_L_01": {
				"attachment": [
					{ "time": 0, "name": null }
				]
			},
			"Lv1_R_01": {
				"attachment": [
					{ "time": 0, "name": null }
				]
			},
			"Lv2_L_01": {
				"attachment": [
					{ "time": 0, "name": null },
					{ "time": 0.2, "name": "Lv2_L_01" }
				]
			},
			"Lv2_R_01": {
				"attachment": [
					{ "time": 0, "name": null },
					{ "time": 0.2, "name": "Lv2_R_01" }
				]
			},
			"Lv3_L_01": {
				"attachment": [
					{ "time": 0, "name": "Lv3_L_01" },
					{ "time": 0.1333, "name": "Lv3_L_01" },
					{ "time": 0.8, "name": "Lv3_L_01" }
				]
			},
			"Lv3_R_01": {
				"attachment": [
					{ "time": 0, "name": "Lv3_R_01" },
					{ "time": 0.1333, "name": "Lv3_R_01" },
					{ "time": 0.8, "name": "Lv3_R_01" }
				]
			}
		},
		"bones": {
			"X": {
				"rotate": [
					{ "time": 0, "angle": 0, "curve": "stepped" },
					{ "time": 0.4, "angle": 0, "curve": "stepped" },
					{ "time": 0.8, "angle": 0 }
				],
				"translate": [
					{ "time": 0, "x": 0, "y": 0, "curve": "stepped" },
					{ "time": 0.4, "x": 0, "y": 0, "curve": "stepped" },
					{ "time": 0.8, "x": 0, "y": 0 }
				],
				"scale": [
					{ "time": 0, "x": 1, "y": 1, "curve": "stepped" },
					{ "time": 0.4, "x": 1, "y": 1, "curve": "stepped" },
					{ "time": 0.8, "x": 1, "y": 1 }
				]
			},
			"Y": {
				"rotate": [
					{ "time": 0, "angle": 0, "curve": "stepped" },
					{ "time": 0.4, "angle": 0, "curve": "stepped" },
					{ "time": 0.8, "angle": 0 }
				],
				"translate": [
					{ "time": 0, "x": 0, "y": 0, "curve": "stepped" },
					{ "time": 0.4, "x": 0, "y": 0, "curve": "stepped" },
					{ "time": 0.8, "x": 0, "y": 0 }
				],
				"scale": [
					{ "time": 0, "x": 1, "y": 1, "curve": "stepped" },
					{ "time": 0.4, "x": 1, "y": 1, "curve": "stepped" },
					{ "time": 0.8, "x": 1, "y": 1 }
				]
			},
			"D1": {
				"rotate": [
					{ "time": 0, "angle": 0, "curve": "stepped" },
					{ "time": 0.1333, "angle": 0, "curve": "stepped" },
					{ "time": 0.4, "angle": 0, "curve": "stepped" },
					{ "time": 0.8, "angle": 0 }
				],
				"translate": [
					{ "time": 0, "x": 0, "y": 0, "curve": "stepped" },
					{ "time": 0.1333, "x": 0, "y": 0 },
					{ "time": 0.2, "x": 16.97, "y": 0 },
					{ "time": 0.2667, "x": -1.66, "y": 0 },
					{ "time": 0.3333, "x": 11.14, "y": 0 },
					{ "time": 0.4, "x": 0, "y": 0 },
					{ "time": 0.4667, "x": -10.98, "y": 0 },
					{ "time": 0.5333, "x": 3.19, "y": 0 },
					{ "time": 0.8, "x": 0, "y": 0 }
				],
				"scale": [
					{ "time": 0, "x": 1, "y": 1 },
					{ "time": 0.1333, "x": 0.98, "y": 1.02 },
					{ "time": 0.2667, "x": 1.07, "y": 0.98 },
					{ "time": 0.4, "x": 1, "y": 1, "curve": "stepped" },
					{ "time": 0.8, "x": 1, "y": 1 }
				]
			},
			"Lv5_L_01": {
				"rotate": [
					{ "time": 0, "angle": 0, "curve": "stepped" },
					{ "time": 0.4, "angle": 0, "curve": "stepped" },
					{ "time": 0.8, "angle": 0 }
				],
				"translate": [
					{ "time": 0, "x": 0, "y": 0, "curve": "stepped" },
					{ "time": 0.4, "x": 0, "y": 0, "curve": "stepped" },
					{ "time": 0.8, "x": 0, "y": 0 }
				],
				"scale": [
					{ "time": 0, "x": 1, "y": 1, "curve": "stepped" },
					{ "time": 0.4, "x": 1, "y": 1, "curve": "stepped" },
					{ "time": 0.8, "x": 1, "y": 1 }
				]
			},
			"Lv1_L_01": {
				"rotate": [
					{ "time": 0, "angle": 0, "curve": "stepped" },
					{ "time": 0.4, "angle": 0, "curve": "stepped" },
					{ "time": 0.8, "angle": 0 }
				],
				"translate": [
					{ "time": 0, "x": 0, "y": 0, "curve": "stepped" },
					{ "time": 0.4, "x": 0, "y": 0, "curve": "stepped" },
					{ "time": 0.8, "x": 0, "y": 0 }
				],
				"scale": [
					{ "time": 0, "x": 1, "y": 1, "curve": "stepped" },
					{ "time": 0.4, "x": 1, "y": 1, "curve": "stepped" },
					{ "time": 0.8, "x": 1, "y": 1 }
				]
			},
			"Lv5_R_01": {
				"rotate": [
					{ "time": 0, "angle": 0, "curve": "stepped" },
					{ "time": 0.4, "angle": 0, "curve": "stepped" },
					{ "time": 0.8, "angle": 0 }
				],
				"translate": [
					{ "time": 0, "x": 0, "y": 0, "curve": "stepped" },
					{ "time": 0.4, "x": 0, "y": 0, "curve": "stepped" },
					{ "time": 0.8, "x": 0, "y": 0 }
				],
				"scale": [
					{ "time": 0, "x": 1, "y": 1, "curve": "stepped" },
					{ "time": 0.4, "x": 1, "y": 1, "curve": "stepped" },
					{ "time": 0.8, "x": 1, "y": 1 }
				]
			},
			"Lv1_R_01": {
				"rotate": [
					{ "time": 0, "angle": 0, "curve": "stepped" },
					{ "time": 0.4, "angle": 0, "curve": "stepped" },
					{ "time": 0.8, "angle": 0 }
				],
				"translate": [
					{ "time": 0, "x": 0, "y": 0, "curve": "stepped" },
					{ "time": 0.4, "x": 0, "y": 0, "curve": "stepped" },
					{ "time": 0.8, "x": 0, "y": 0 }
				],
				"scale": [
					{ "time": 0, "x": 1, "y": 1, "curve": "stepped" },
					{ "time": 0.4, "x": 1, "y": 1, "curve": "stepped" },
					{ "time": 0.8, "x": 1, "y": 1 }
				]
			},
			"Lv2_R_01": {
				"rotate": [
					{ "time": 0, "angle": 0, "curve": "stepped" },
					{ "time": 0.4, "angle": 0, "curve": "stepped" },
					{ "time": 0.8, "angle": 0 }
				],
				"translate": [
					{ "time": 0, "x": 34.2, "y": -18.15, "curve": "stepped" },
					{ "time": 0.2, "x": 34.2, "y": -18.15 },
					{ "time": 0.4, "x": 0, "y": 0, "curve": "stepped" },
					{ "time": 0.8, "x": 0, "y": 0 }
				],
				"scale": [
					{ "time": 0, "x": 0.627, "y": 0.691, "curve": "stepped" },
					{ "time": 0.2, "x": 0.627, "y": 0.691 },
					{ "time": 0.4, "x": 1, "y": 1, "curve": "stepped" },
					{ "time": 0.8, "x": 1, "y": 1 }
				]
			},
			"Lv2_L_01": {
				"rotate": [
					{ "time": 0, "angle": 0, "curve": "stepped" },
					{ "time": 0.4, "angle": 0, "curve": "stepped" },
					{ "time": 0.8, "angle": 0 }
				],
				"translate": [
					{ "time": 0, "x": 33.98, "y": 14.91, "curve": "stepped" },
					{ "time": 0.2, "x": 33.98, "y": 14.91 },
					{ "time": 0.4, "x": 0, "y": 0, "curve": "stepped" },
					{ "time": 0.8, "x": 0, "y": 0 }
				],
				"scale": [
					{ "time": 0, "x": 0.629, "y": 0.674, "curve": "stepped" },
					{ "time": 0.2, "x": 0.629, "y": 0.674 },
					{ "time": 0.4, "x": 1, "y": 1, "curve": "stepped" },
					{ "time": 0.8, "x": 1, "y": 1 }
				]
			},
			"Lv3_L_01": {
				"rotate": [
					{ "time": 0, "angle": 0, "curve": "stepped" },
					{ "time": 0.4, "angle": 0, "curve": "stepped" },
					{ "time": 0.8, "angle": 0 }
				],
				"translate": [
					{ "time": 0, "x": 0, "y": 0 },
					{ "time": 0.1333, "x": 71.35, "y": 1.08 },
					{ "time": 0.4, "x": 0, "y": 0, "curve": "stepped" },
					{ "time": 0.8, "x": 0, "y": 0 }
				],
				"scale": [
					{ "time": 0, "x": 1, "y": 1 },
					{ "time": 0.1333, "x": 1.524, "y": 1 },
					{ "time": 0.4, "x": 0.786, "y": 1 },
					{ "time": 0.8, "x": 1, "y": 1 }
				]
			},
			"Lv3_R_01": {
				"rotate": [
					{ "time": 0, "angle": 0, "curve": "stepped" },
					{ "time": 0.4, "angle": 0, "curve": "stepped" },
					{ "time": 0.8, "angle": 0 }
				],
				"translate": [
					{ "time": 0, "x": 0, "y": 0 },
					{ "time": 0.1333, "x": 71.35, "y": 0 },
					{ "time": 0.4, "x": 0, "y": 0, "curve": "stepped" },
					{ "time": 0.8, "x": 0, "y": 0 }
				],
				"scale": [
					{ "time": 0, "x": 1, "y": 1 },
					{ "time": 0.1333, "x": 1.524, "y": 1 },
					{ "time": 0.4, "x": 0.786, "y": 1 },
					{ "time": 0.8, "x": 1, "y": 1 }
				]
			}
		}
	},
	"Up_Lv3": {
		"slots": {
			"Lv1_L_01": {
				"attachment": [
					{ "time": 0, "name": null },
					{ "time": 0.3333, "name": "Lv1_L_01" },
					{ "time": 0.8, "name": "Lv1_L_01" }
				]
			},
			"Lv1_R_01": {
				"attachment": [
					{ "time": 0, "name": null },
					{ "time": 0.3333, "name": "Lv1_R_01" },
					{ "time": 0.8, "name": "Lv1_R_01" }
				]
			},
			"Lv2_L_01": {
				"attachment": [
					{ "time": 0, "name": "Lv2_L_01" },
					{ "time": 0.2, "name": "Lv2_L_01" }
				]
			},
			"Lv2_R_01": {
				"attachment": [
					{ "time": 0, "name": "Lv2_R_01" },
					{ "time": 0.2, "name": "Lv2_R_01" }
				]
			},
			"Lv3_L_01": {
				"attachment": [
					{ "time": 0, "name": "Lv3_L_01" },
					{ "time": 0.1333, "name": "Lv3_L_01" },
					{ "time": 0.8, "name": "Lv3_L_01" }
				]
			},
			"Lv3_R_01": {
				"attachment": [
					{ "time": 0, "name": "Lv3_R_01" },
					{ "time": 0.1333, "name": "Lv3_R_01" },
					{ "time": 0.8, "name": "Lv3_R_01" }
				]
			}
		},
		"bones": {
			"X": {
				"rotate": [
					{ "time": 0, "angle": 0, "curve": "stepped" },
					{ "time": 0.4, "angle": 0, "curve": "stepped" },
					{ "time": 0.8, "angle": 0 }
				],
				"translate": [
					{ "time": 0, "x": 0, "y": 0, "curve": "stepped" },
					{ "time": 0.4, "x": 0, "y": 0, "curve": "stepped" },
					{ "time": 0.8, "x": 0, "y": 0 }
				],
				"scale": [
					{ "time": 0, "x": 1, "y": 1, "curve": "stepped" },
					{ "time": 0.4, "x": 1, "y": 1, "curve": "stepped" },
					{ "time": 0.8, "x": 1, "y": 1 }
				]
			},
			"Y": {
				"rotate": [
					{ "time": 0, "angle": 0, "curve": "stepped" },
					{ "time": 0.4, "angle": 0, "curve": "stepped" },
					{ "time": 0.8, "angle": 0 }
				],
				"translate": [
					{ "time": 0, "x": 0, "y": 0, "curve": "stepped" },
					{ "time": 0.4, "x": 0, "y": 0, "curve": "stepped" },
					{ "time": 0.8, "x": 0, "y": 0 }
				],
				"scale": [
					{ "time": 0, "x": 1, "y": 1, "curve": "stepped" },
					{ "time": 0.4, "x": 1, "y": 1, "curve": "stepped" },
					{ "time": 0.8, "x": 1, "y": 1 }
				]
			},
			"D1": {
				"rotate": [
					{ "time": 0, "angle": 0, "curve": "stepped" },
					{ "time": 0.1333, "angle": 0, "curve": "stepped" },
					{ "time": 0.4, "angle": 0, "curve": "stepped" },
					{ "time": 0.8, "angle": 0 }
				],
				"translate": [
					{ "time": 0, "x": 0, "y": 0, "curve": "stepped" },
					{ "time": 0.1333, "x": 0, "y": 0 },
					{ "time": 0.2, "x": 16.97, "y": 0 },
					{ "time": 0.2667, "x": -1.66, "y": 0 },
					{ "time": 0.3333, "x": 11.14, "y": 0 },
					{ "time": 0.4, "x": 0, "y": 0 },
					{ "time": 0.4667, "x": -10.98, "y": 0 },
					{ "time": 0.5333, "x": 3.19, "y": 0 },
					{ "time": 0.8, "x": 0, "y": 0 }
				],
				"scale": [
					{ "time": 0, "x": 1, "y": 1 },
					{ "time": 0.1333, "x": 0.98, "y": 1.02 },
					{ "time": 0.2667, "x": 1.07, "y": 0.98 },
					{ "time": 0.4, "x": 1, "y": 1, "curve": "stepped" },
					{ "time": 0.8, "x": 1, "y": 1 }
				]
			},
			"Lv5_L_01": {
				"rotate": [
					{ "time": 0, "angle": 0, "curve": "stepped" },
					{ "time": 0.4, "angle": 0, "curve": "stepped" },
					{ "time": 0.8, "angle": 0 }
				],
				"translate": [
					{ "time": 0, "x": 0, "y": 0, "curve": "stepped" },
					{ "time": 0.4, "x": 0, "y": 0, "curve": "stepped" },
					{ "time": 0.8, "x": 0, "y": 0 }
				],
				"scale": [
					{ "time": 0, "x": 1, "y": 1, "curve": "stepped" },
					{ "time": 0.4, "x": 1, "y": 1, "curve": "stepped" },
					{ "time": 0.8, "x": 1, "y": 1 }
				]
			},
			"Lv1_L_01": {
				"rotate": [
					{ "time": 0, "angle": 0, "curve": "stepped" },
					{ "time": 0.5333, "angle": 0, "curve": "stepped" },
					{ "time": 0.8, "angle": 0 }
				],
				"translate": [
					{ "time": 0, "x": 0, "y": 0 },
					{ "time": 0.3333, "x": -0.42, "y": 27.85 },
					{ "time": 0.5333, "x": 0, "y": 0, "curve": "stepped" },
					{ "time": 0.8, "x": 0, "y": 0 }
				],
				"scale": [
					{ "time": 0, "x": 1, "y": 1, "curve": "stepped" },
					{ "time": 0.5333, "x": 1, "y": 1, "curve": "stepped" },
					{ "time": 0.8, "x": 1, "y": 1 }
				]
			},
			"Lv5_R_01": {
				"rotate": [
					{ "time": 0, "angle": 0, "curve": "stepped" },
					{ "time": 0.4, "angle": 0, "curve": "stepped" },
					{ "time": 0.8, "angle": 0 }
				],
				"translate": [
					{ "time": 0, "x": 0, "y": 0, "curve": "stepped" },
					{ "time": 0.4, "x": 0, "y": 0, "curve": "stepped" },
					{ "time": 0.8, "x": 0, "y": 0 }
				],
				"scale": [
					{ "time": 0, "x": 1, "y": 1, "curve": "stepped" },
					{ "time": 0.4, "x": 1, "y": 1, "curve": "stepped" },
					{ "time": 0.8, "x": 1, "y": 1 }
				]
			},
			"Lv1_R_01": {
				"rotate": [
					{ "time": 0, "angle": 0, "curve": "stepped" },
					{ "time": 0.5333, "angle": 0, "curve": "stepped" },
					{ "time": 0.8, "angle": 0 }
				],
				"translate": [
					{ "time": 0, "x": 0, "y": 0 },
					{ "time": 0.3333, "x": 0, "y": -31.42 },
					{ "time": 0.5333, "x": 0, "y": 0, "curve": "stepped" },
					{ "time": 0.8, "x": 0, "y": 0 }
				],
				"scale": [
					{ "time": 0, "x": 1, "y": 1, "curve": "stepped" },
					{ "time": 0.5333, "x": 1, "y": 1, "curve": "stepped" },
					{ "time": 0.8, "x": 1, "y": 1 }
				]
			},
			"Lv2_R_01": {
				"rotate": [
					{ "time": 0, "angle": 0, "curve": "stepped" },
					{ "time": 0.4, "angle": 0, "curve": "stepped" },
					{ "time": 0.8, "angle": 0 }
				],
				"translate": [
					{ "time": 0, "x": 0, "y": 0 },
					{ "time": 0.2, "x": 21.05, "y": -9.36 },
					{ "time": 0.4, "x": 0, "y": 0, "curve": "stepped" },
					{ "time": 0.8, "x": 0, "y": 0 }
				],
				"scale": [
					{ "time": 0, "x": 1, "y": 1 },
					{ "time": 0.2, "x": 0.79, "y": 0.691 },
					{ "time": 0.4, "x": 1, "y": 1, "curve": "stepped" },
					{ "time": 0.8, "x": 1, "y": 1 }
				]
			},
			"Lv2_L_01": {
				"rotate": [
					{ "time": 0, "angle": 0, "curve": "stepped" },
					{ "time": 0.4, "angle": 0, "curve": "stepped" },
					{ "time": 0.8, "angle": 0 }
				],
				"translate": [
					{ "time": 0, "x": 0, "y": 0 },
					{ "time": 0.2, "x": 21.53, "y": 6.52 },
					{ "time": 0.4, "x": 0, "y": 0, "curve": "stepped" },
					{ "time": 0.8, "x": 0, "y": 0 }
				],
				"scale": [
					{ "time": 0, "x": 1, "y": 1 },
					{ "time": 0.2, "x": 0.801, "y": 0.699 },
					{ "time": 0.4, "x": 1, "y": 1, "curve": "stepped" },
					{ "time": 0.8, "x": 1, "y": 1 }
				]
			},
			"Lv3_L_01": {
				"rotate": [
					{ "time": 0, "angle": 0, "curve": "stepped" },
					{ "time": 0.4, "angle": 0, "curve": "stepped" },
					{ "time": 0.8, "angle": 0 }
				],
				"translate": [
					{ "time": 0, "x": 0, "y": 0 },
					{ "time": 0.1333, "x": 71.35, "y": 1.08 },
					{ "time": 0.4, "x": 0, "y": 0, "curve": "stepped" },
					{ "time": 0.8, "x": 0, "y": 0 }
				],
				"scale": [
					{ "time": 0, "x": 1, "y": 1 },
					{ "time": 0.1333, "x": 1.524, "y": 1 },
					{ "time": 0.4, "x": 0.786, "y": 1 },
					{ "time": 0.8, "x": 1, "y": 1 }
				]
			},
			"Lv3_R_01": {
				"rotate": [
					{ "time": 0, "angle": 0, "curve": "stepped" },
					{ "time": 0.4, "angle": 0, "curve": "stepped" },
					{ "time": 0.8, "angle": 0 }
				],
				"translate": [
					{ "time": 0, "x": 0, "y": 0 },
					{ "time": 0.1333, "x": 71.35, "y": 0 },
					{ "time": 0.4, "x": 0, "y": 0, "curve": "stepped" },
					{ "time": 0.8, "x": 0, "y": 0 }
				],
				"scale": [
					{ "time": 0, "x": 1, "y": 1 },
					{ "time": 0.1333, "x": 1.524, "y": 1 },
					{ "time": 0.4, "x": 0.786, "y": 1 },
					{ "time": 0.8, "x": 1, "y": 1 }
				]
			}
		}
	},
	"Up_Lv4": {
		"slots": {
			"Lv1_L_01": {
				"attachment": [
					{ "time": 0, "name": "Lv1_L_01" },
					{ "time": 0.3333, "name": "Lv1_L_01" },
					{ "time": 0.8, "name": "Lv1_L_01" }
				]
			},
			"Lv1_R_01": {
				"attachment": [
					{ "time": 0, "name": "Lv1_R_01" },
					{ "time": 0.3333, "name": "Lv1_R_01" },
					{ "time": 0.8, "name": "Lv1_R_01" }
				]
			},
			"Lv2_L_01": {
				"attachment": [
					{ "time": 0, "name": "Lv2_L_01" },
					{ "time": 0.2, "name": "Lv2_L_01" }
				]
			},
			"Lv2_R_01": {
				"attachment": [
					{ "time": 0, "name": "Lv2_R_01" },
					{ "time": 0.2, "name": "Lv2_R_01" }
				]
			},
			"Lv3_L_01": {
				"attachment": [
					{ "time": 0, "name": "Lv3_L_01" },
					{ "time": 0.1333, "name": "Lv3_L_01" },
					{ "time": 0.8, "name": "Lv3_L_01" }
				]
			},
			"Lv3_R_01": {
				"attachment": [
					{ "time": 0, "name": "Lv3_R_01" },
					{ "time": 0.1333, "name": "Lv3_R_01" },
					{ "time": 0.8, "name": "Lv3_R_01" }
				]
			},
			"Lv5_L_01": {
				"twoColor": [
					{ "time": 0, "light": "ffffff00", "dark": "000000" },
					{ "time": 0.1333, "light": "ffffffff", "dark": "7f7f7f" },
					{ "time": 0.2667, "light": "ffffffff", "dark": "ffffff" },
					{ "time": 0.5333, "light": "ffffffff", "dark": "000000" }
				],
				"attachment": [
					{ "time": 0, "name": null },
					{ "time": 0.1333, "name": "Lv5_L_01" }
				]
			},
			"Lv5_R_01": {
				"twoColor": [
					{ "time": 0, "light": "ffffff00", "dark": "000000" },
					{ "time": 0.1333, "light": "ffffffff", "dark": "7f7f7f" },
					{ "time": 0.2667, "light": "ffffffff", "dark": "ffffff" },
					{ "time": 0.5333, "light": "ffffffff", "dark": "000000" }
				],
				"attachment": [
					{ "time": 0, "name": null },
					{ "time": 0.1333, "name": "Lv5_R_01" }
				]
			}
		},
		"bones": {
			"X": {
				"rotate": [
					{ "time": 0, "angle": 0, "curve": "stepped" },
					{ "time": 0.1333, "angle": 0, "curve": "stepped" },
					{ "time": 0.4, "angle": 0, "curve": "stepped" },
					{ "time": 0.8, "angle": 0 }
				],
				"translate": [
					{ "time": 0, "x": 0, "y": 0, "curve": "stepped" },
					{ "time": 0.1333, "x": 0, "y": 0, "curve": "stepped" },
					{ "time": 0.4, "x": 0, "y": 0, "curve": "stepped" },
					{ "time": 0.8, "x": 0, "y": 0 }
				],
				"scale": [
					{ "time": 0, "x": 1, "y": 1, "curve": "stepped" },
					{ "time": 0.1333, "x": 1, "y": 1, "curve": "stepped" },
					{ "time": 0.4, "x": 1, "y": 1, "curve": "stepped" },
					{ "time": 0.8, "x": 1, "y": 1 }
				]
			},
			"Y": {
				"rotate": [
					{ "time": 0, "angle": 0, "curve": "stepped" },
					{ "time": 0.1333, "angle": 0, "curve": "stepped" },
					{ "time": 0.4, "angle": 0, "curve": "stepped" },
					{ "time": 0.8, "angle": 0 }
				],
				"translate": [
					{ "time": 0, "x": 0, "y": 0, "curve": "stepped" },
					{ "time": 0.1333, "x": 0, "y": 0, "curve": "stepped" },
					{ "time": 0.4, "x": 0, "y": 0, "curve": "stepped" },
					{ "time": 0.8, "x": 0, "y": 0 }
				],
				"scale": [
					{ "time": 0, "x": 1, "y": 1, "curve": "stepped" },
					{ "time": 0.1333, "x": 1, "y": 1, "curve": "stepped" },
					{ "time": 0.4, "x": 1, "y": 1, "curve": "stepped" },
					{ "time": 0.8, "x": 1, "y": 1 }
				]
			},
			"D1": {
				"rotate": [
					{ "time": 0, "angle": 0, "curve": "stepped" },
					{ "time": 0.1333, "angle": 0, "curve": "stepped" },
					{ "time": 0.4, "angle": 0, "curve": "stepped" },
					{ "time": 0.8, "angle": 0 }
				],
				"translate": [
					{ "time": 0, "x": 0, "y": 0, "curve": "stepped" },
					{ "time": 0.1333, "x": 0, "y": 0 },
					{ "time": 0.2, "x": 16.97, "y": 0 },
					{ "time": 0.2667, "x": -1.66, "y": 0 },
					{ "time": 0.3333, "x": 11.14, "y": 0 },
					{ "time": 0.4, "x": 0, "y": 0 },
					{ "time": 0.4667, "x": -10.98, "y": 0 },
					{ "time": 0.5333, "x": 3.19, "y": 0 },
					{ "time": 0.8, "x": 0, "y": 0 }
				],
				"scale": [
					{ "time": 0, "x": 1, "y": 1 },
					{ "time": 0.1333, "x": 0.98, "y": 1.02 },
					{ "time": 0.2667, "x": 1.07, "y": 0.98 },
					{ "time": 0.4, "x": 1, "y": 1, "curve": "stepped" },
					{ "time": 0.8, "x": 1, "y": 1 }
				]
			},
			"Lv5_L_01": {
				"rotate": [
					{ "time": 0, "angle": 0, "curve": "stepped" },
					{ "time": 0.1333, "angle": 0, "curve": "stepped" },
					{ "time": 0.2667, "angle": 0, "curve": "stepped" },
					{ "time": 0.8, "angle": 0 }
				],
				"translate": [
					{ "time": 0, "x": -26.18, "y": -15.16 },
					{ "time": 0.1333, "x": 0, "y": 0, "curve": "stepped" },
					{ "time": 0.2667, "x": 0, "y": 0, "curve": "stepped" },
					{ "time": 0.8, "x": 0, "y": 0 }
				],
				"scale": [
					{ "time": 0, "x": 1, "y": 1, "curve": "stepped" },
					{ "time": 0.1333, "x": 1, "y": 1, "curve": "stepped" },
					{ "time": 0.2667, "x": 1, "y": 1, "curve": "stepped" },
					{ "time": 0.8, "x": 1, "y": 1 }
				]
			},
			"Lv1_L_01": {
				"rotate": [
					{ "time": 0, "angle": 0, "curve": "stepped" },
					{ "time": 0.1333, "angle": 0, "curve": "stepped" },
					{ "time": 0.5333, "angle": 0, "curve": "stepped" },
					{ "time": 0.8, "angle": 0 }
				],
				"translate": [
					{ "time": 0, "x": 0, "y": 0 },
					{ "time": 0.1333, "x": 30.98, "y": 11.61 },
					{ "time": 0.3333, "x": -0.11, "y": 7.13 },
					{ "time": 0.5333, "x": 0, "y": 0, "curve": "stepped" },
					{ "time": 0.8, "x": 0, "y": 0 }
				],
				"scale": [
					{ "time": 0, "x": 1, "y": 1, "curve": "stepped" },
					{ "time": 0.1333, "x": 1, "y": 1, "curve": "stepped" },
					{ "time": 0.5333, "x": 1, "y": 1, "curve": "stepped" },
					{ "time": 0.8, "x": 1, "y": 1 }
				]
			},
			"Lv5_R_01": {
				"rotate": [
					{ "time": 0, "angle": 0, "curve": "stepped" },
					{ "time": 0.1333, "angle": 0, "curve": "stepped" },
					{ "time": 0.2667, "angle": 0, "curve": "stepped" },
					{ "time": 0.8, "angle": 0 }
				],
				"translate": [
					{ "time": 0, "x": -23.43, "y": 14.8 },
					{ "time": 0.1333, "x": 0, "y": 0, "curve": "stepped" },
					{ "time": 0.2667, "x": 0, "y": 0, "curve": "stepped" },
					{ "time": 0.8, "x": 0, "y": 0 }
				],
				"scale": [
					{ "time": 0, "x": 1, "y": 1, "curve": "stepped" },
					{ "time": 0.1333, "x": 1, "y": 1, "curve": "stepped" },
					{ "time": 0.2667, "x": 1, "y": 1, "curve": "stepped" },
					{ "time": 0.8, "x": 1, "y": 1 }
				]
			},
			"Lv1_R_01": {
				"rotate": [
					{ "time": 0, "angle": 0, "curve": "stepped" },
					{ "time": 0.1333, "angle": 0, "curve": "stepped" },
					{ "time": 0.5333, "angle": 0, "curve": "stepped" },
					{ "time": 0.8, "angle": 0 }
				],
				"translate": [
					{ "time": 0, "x": 0, "y": 0 },
					{ "time": 0.1333, "x": 29.2, "y": -12.57 },
					{ "time": 0.3333, "x": 0, "y": -8.29 },
					{ "time": 0.5333, "x": 0, "y": 0, "curve": "stepped" },
					{ "time": 0.8, "x": 0, "y": 0 }
				],
				"scale": [
					{ "time": 0, "x": 1, "y": 1, "curve": "stepped" },
					{ "time": 0.1333, "x": 1, "y": 1, "curve": "stepped" },
					{ "time": 0.5333, "x": 1, "y": 1, "curve": "stepped" },
					{ "time": 0.8, "x": 1, "y": 1 }
				]
			},
			"Lv2_R_01": {
				"rotate": [
					{ "time": 0, "angle": 0, "curve": "stepped" },
					{ "time": 0.1333, "angle": 0, "curve": "stepped" },
					{ "time": 0.4, "angle": 0, "curve": "stepped" },
					{ "time": 0.8, "angle": 0 }
				],
				"translate": [
					{ "time": 0, "x": 0, "y": 0 },
					{ "time": 0.1333, "x": 43.24, "y": -6.24 },
					{ "time": 0.2, "x": 21.05, "y": -9.36 },
					{ "time": 0.4, "x": 0, "y": 0, "curve": "stepped" },
					{ "time": 0.8, "x": 0, "y": 0 }
				],
				"scale": [
					{ "time": 0, "x": 1, "y": 1 },
					{ "time": 0.1333, "x": 0.86, "y": 0.794 },
					{ "time": 0.2, "x": 0.79, "y": 0.691 },
					{ "time": 0.4, "x": 1, "y": 1, "curve": "stepped" },
					{ "time": 0.8, "x": 1, "y": 1 }
				]
			},
			"Lv2_L_01": {
				"rotate": [
					{ "time": 0, "angle": 0, "curve": "stepped" },
					{ "time": 0.1333, "angle": 0, "curve": "stepped" },
					{ "time": 0.4, "angle": 0, "curve": "stepped" },
					{ "time": 0.8, "angle": 0 }
				],
				"translate": [
					{ "time": 0, "x": 0, "y": 0 },
					{ "time": 0.1333, "x": 45.5, "y": 4.82 },
					{ "time": 0.2, "x": 21.53, "y": 6.52 },
					{ "time": 0.4, "x": 0, "y": 0, "curve": "stepped" },
					{ "time": 0.8, "x": 0, "y": 0 }
				],
				"scale": [
					{ "time": 0, "x": 1, "y": 1 },
					{ "time": 0.1333, "x": 0.867, "y": 0.799 },
					{ "time": 0.2, "x": 0.801, "y": 0.699 },
					{ "time": 0.4, "x": 1, "y": 1, "curve": "stepped" },
					{ "time": 0.8, "x": 1, "y": 1 }
				]
			},
			"Lv3_L_01": {
				"rotate": [
					{ "time": 0, "angle": 0, "curve": "stepped" },
					{ "time": 0.1333, "angle": 0, "curve": "stepped" },
					{ "time": 0.4, "angle": 0, "curve": "stepped" },
					{ "time": 0.8, "angle": 0 }
				],
				"translate": [
					{ "time": 0, "x": 0, "y": 0 },
					{ "time": 0.1333, "x": 71.35, "y": 1.08 },
					{ "time": 0.4, "x": 0, "y": 0, "curve": "stepped" },
					{ "time": 0.8, "x": 0, "y": 0 }
				],
				"scale": [
					{ "time": 0, "x": 1, "y": 1 },
					{ "time": 0.1333, "x": 1.524, "y": 1 },
					{ "time": 0.4, "x": 0.786, "y": 1 },
					{ "time": 0.8, "x": 1, "y": 1 }
				]
			},
			"Lv3_R_01": {
				"rotate": [
					{ "time": 0, "angle": 0, "curve": "stepped" },
					{ "time": 0.1333, "angle": 0, "curve": "stepped" },
					{ "time": 0.4, "angle": 0, "curve": "stepped" },
					{ "time": 0.8, "angle": 0 }
				],
				"translate": [
					{ "time": 0, "x": 0, "y": 0 },
					{ "time": 0.1333, "x": 71.35, "y": 0 },
					{ "time": 0.4, "x": 0, "y": 0, "curve": "stepped" },
					{ "time": 0.8, "x": 0, "y": 0 }
				],
				"scale": [
					{ "time": 0, "x": 1, "y": 1 },
					{ "time": 0.1333, "x": 1.524, "y": 1 },
					{ "time": 0.4, "x": 0.786, "y": 1 },
					{ "time": 0.8, "x": 1, "y": 1 }
				]
			}
		}
	}
}
}