%YAML 1.1
%TAG !u! tag:unity3d.com,2011:
--- !u!114 &11400000
MonoBehaviour:
  m_ObjectHideFlags: 0
  m_CorrespondingSourceObject: {fileID: 0}
  m_PrefabInstance: {fileID: 0}
  m_PrefabAsset: {fileID: 0}
  m_GameObject: {fileID: 0}
  m_Enabled: 1
  m_EditorHideFlags: 0
  m_Script: {fileID: 11500000, guid: 04e77604d257e93438935ac65df3cd68, type: 3}
  m_Name: BlackMarketData
  m_EditorClassIdentifier: 
  Slot:
  - UnlockCurrency: 0
    UnlockNum: -1
    NoAdsUnlockCurrency: 0
    NoAdsUnlockNum: -1
    SlotInfor:
    - ItemIcon: {fileID: 21300000, guid: 61bce71fe2e435e4c9a7fde2f41f318e, type: 3}
      ItemType: 12
      ItemExtendId: 5
      ItemNum: 5
      CurrencyType: 2
      CurrencyNum: 5
      NoAdsCurrencyType: 1
      NoAdsCurrencyNum: 5
      Rate: 100
  - UnlockCurrency: 0
    UnlockNum: -1
    NoAdsUnlockCurrency: 0
    NoAdsUnlockNum: -1
    SlotInfor:
    - ItemIcon: {fileID: 21300000, guid: ce8a6c5486cf25948acd7ddd3796df13, type: 3}
      ItemType: 12
      ItemExtendId: 0
      ItemNum: 5
      CurrencyType: 0
      CurrencyNum: 500
      NoAdsCurrencyType: 0
      NoAdsCurrencyNum: 500
      Rate: 30
    - ItemIcon: {fileID: 21300000, guid: da06efdb0e627ea4fb983024e04ee3e9, type: 3}
      ItemType: 12
      ItemExtendId: 1
      ItemNum: 5
      CurrencyType: 0
      CurrencyNum: 1000
      NoAdsCurrencyType: 0
      NoAdsCurrencyNum: 1000
      Rate: 20
    - ItemIcon: {fileID: 21300000, guid: 641de733afe99574f8ea4b1bd8d7407a, type: 3}
      ItemType: 12
      ItemExtendId: 2
      ItemNum: 5
      CurrencyType: 0
      CurrencyNum: 1500
      NoAdsCurrencyType: 0
      NoAdsCurrencyNum: 1500
      Rate: 10
    - ItemIcon: {fileID: 21300000, guid: 62df481928fbab647b8b540b4099a921, type: 3}
      ItemType: 12
      ItemExtendId: 3
      ItemNum: 3
      CurrencyType: 2
      CurrencyNum: 3
      NoAdsCurrencyType: 0
      NoAdsCurrencyNum: 1800
      Rate: 1
    - ItemIcon: {fileID: 21300000, guid: 5145fb36e641bd94ab25e984b43e7304, type: 3}
      ItemType: 12
      ItemExtendId: 4
      ItemNum: 3
      CurrencyType: 2
      CurrencyNum: 3
      NoAdsCurrencyType: 0
      NoAdsCurrencyNum: 1800
      Rate: 1
    - ItemIcon: {fileID: 21300000, guid: 3fb8034ac6be7784b86ffb4954f4744f, type: 3}
      ItemType: 13
      ItemExtendId: 0
      ItemNum: 5
      CurrencyType: 0
      CurrencyNum: 350
      NoAdsCurrencyType: 0
      NoAdsCurrencyNum: 350
      Rate: 22
    - ItemIcon: {fileID: 21300000, guid: af74d2dc4a9e6d74398a8df001f2cd80, type: 3}
      ItemType: 13
      ItemExtendId: 1
      ItemNum: 5
      CurrencyType: 0
      CurrencyNum: 600
      NoAdsCurrencyType: 0
      NoAdsCurrencyNum: 600
      Rate: 15
    - ItemIcon: {fileID: 21300000, guid: 59c4ee9aea754034b9e115b168a5edb5, type: 3}
      ItemType: 13
      ItemExtendId: 2
      ItemNum: 5
      CurrencyType: 0
      CurrencyNum: 750
      NoAdsCurrencyType: 0
      NoAdsCurrencyNum: 750
      Rate: 1
  - UnlockCurrency: 0
    UnlockNum: -1
    NoAdsUnlockCurrency: 0
    NoAdsUnlockNum: -1
    SlotInfor:
    - ItemIcon: {fileID: 21300000, guid: ce8a6c5486cf25948acd7ddd3796df13, type: 3}
      ItemType: 12
      ItemExtendId: 0
      ItemNum: 5
      CurrencyType: 0
      CurrencyNum: 500
      NoAdsCurrencyType: 0
      NoAdsCurrencyNum: 500
      Rate: 25
    - ItemIcon: {fileID: 21300000, guid: da06efdb0e627ea4fb983024e04ee3e9, type: 3}
      ItemType: 12
      ItemExtendId: 1
      ItemNum: 5
      CurrencyType: 0
      CurrencyNum: 1000
      NoAdsCurrencyType: 0
      NoAdsCurrencyNum: 1000
      Rate: 25
    - ItemIcon: {fileID: 21300000, guid: 641de733afe99574f8ea4b1bd8d7407a, type: 3}
      ItemType: 12
      ItemExtendId: 2
      ItemNum: 5
      CurrencyType: 0
      CurrencyNum: 1500
      NoAdsCurrencyType: 0
      NoAdsCurrencyNum: 1500
      Rate: 10
    - ItemIcon: {fileID: 21300000, guid: 62df481928fbab647b8b540b4099a921, type: 3}
      ItemType: 12
      ItemExtendId: 3
      ItemNum: 3
      CurrencyType: 2
      CurrencyNum: 3
      NoAdsCurrencyType: 0
      NoAdsCurrencyNum: 1800
      Rate: 1
    - ItemIcon: {fileID: 21300000, guid: 5145fb36e641bd94ab25e984b43e7304, type: 3}
      ItemType: 12
      ItemExtendId: 4
      ItemNum: 3
      CurrencyType: 2
      CurrencyNum: 3
      NoAdsCurrencyType: 0
      NoAdsCurrencyNum: 1800
      Rate: 1
    - ItemIcon: {fileID: 21300000, guid: 3fb8034ac6be7784b86ffb4954f4744f, type: 3}
      ItemType: 13
      ItemExtendId: 0
      ItemNum: 5
      CurrencyType: 0
      CurrencyNum: 350
      NoAdsCurrencyType: 0
      NoAdsCurrencyNum: 350
      Rate: 17
    - ItemIcon: {fileID: 21300000, guid: af74d2dc4a9e6d74398a8df001f2cd80, type: 3}
      ItemType: 13
      ItemExtendId: 1
      ItemNum: 5
      CurrencyType: 0
      CurrencyNum: 600
      NoAdsCurrencyType: 0
      NoAdsCurrencyNum: 600
      Rate: 18
    - ItemIcon: {fileID: 21300000, guid: 59c4ee9aea754034b9e115b168a5edb5, type: 3}
      ItemType: 13
      ItemExtendId: 2
      ItemNum: 5
      CurrencyType: 0
      CurrencyNum: 750
      NoAdsCurrencyType: 0
      NoAdsCurrencyNum: 750
      Rate: 3
  - UnlockCurrency: 0
    UnlockNum: -1
    NoAdsUnlockCurrency: 0
    NoAdsUnlockNum: -1
    SlotInfor:
    - ItemIcon: {fileID: 21300000, guid: ce8a6c5486cf25948acd7ddd3796df13, type: 3}
      ItemType: 12
      ItemExtendId: 0
      ItemNum: 5
      CurrencyType: 0
      CurrencyNum: 500
      NoAdsCurrencyType: 0
      NoAdsCurrencyNum: 500
      Rate: 20
    - ItemIcon: {fileID: 21300000, guid: da06efdb0e627ea4fb983024e04ee3e9, type: 3}
      ItemType: 12
      ItemExtendId: 1
      ItemNum: 5
      CurrencyType: 0
      CurrencyNum: 1000
      NoAdsCurrencyType: 0
      NoAdsCurrencyNum: 1000
      Rate: 20
    - ItemIcon: {fileID: 21300000, guid: 641de733afe99574f8ea4b1bd8d7407a, type: 3}
      ItemType: 12
      ItemExtendId: 2
      ItemNum: 5
      CurrencyType: 0
      CurrencyNum: 1500
      NoAdsCurrencyType: 0
      NoAdsCurrencyNum: 1500
      Rate: 15
    - ItemIcon: {fileID: 21300000, guid: 62df481928fbab647b8b540b4099a921, type: 3}
      ItemType: 12
      ItemExtendId: 3
      ItemNum: 3
      CurrencyType: 2
      CurrencyNum: 3
      NoAdsCurrencyType: 0
      NoAdsCurrencyNum: 1800
      Rate: 1
    - ItemIcon: {fileID: 21300000, guid: 5145fb36e641bd94ab25e984b43e7304, type: 3}
      ItemType: 12
      ItemExtendId: 4
      ItemNum: 3
      CurrencyType: 2
      CurrencyNum: 3
      NoAdsCurrencyType: 0
      NoAdsCurrencyNum: 1800
      Rate: 1
    - ItemIcon: {fileID: 21300000, guid: 3fb8034ac6be7784b86ffb4954f4744f, type: 3}
      ItemType: 13
      ItemExtendId: 0
      ItemNum: 5
      CurrencyType: 0
      CurrencyNum: 350
      NoAdsCurrencyType: 0
      NoAdsCurrencyNum: 350
      Rate: 20
    - ItemIcon: {fileID: 21300000, guid: af74d2dc4a9e6d74398a8df001f2cd80, type: 3}
      ItemType: 13
      ItemExtendId: 1
      ItemNum: 5
      CurrencyType: 0
      CurrencyNum: 600
      NoAdsCurrencyType: 0
      NoAdsCurrencyNum: 600
      Rate: 15
    - ItemIcon: {fileID: 21300000, guid: 59c4ee9aea754034b9e115b168a5edb5, type: 3}
      ItemType: 13
      ItemExtendId: 2
      ItemNum: 5
      CurrencyType: 0
      CurrencyNum: 750
      NoAdsCurrencyType: 0
      NoAdsCurrencyNum: 750
      Rate: 8
  - UnlockCurrency: 0
    UnlockNum: -1
    NoAdsUnlockCurrency: 0
    NoAdsUnlockNum: -1
    SlotInfor:
    - ItemIcon: {fileID: 21300000, guid: ce8a6c5486cf25948acd7ddd3796df13, type: 3}
      ItemType: 12
      ItemExtendId: 0
      ItemNum: 5
      CurrencyType: 0
      CurrencyNum: 500
      NoAdsCurrencyType: 0
      NoAdsCurrencyNum: 500
      Rate: 10
    - ItemIcon: {fileID: 21300000, guid: da06efdb0e627ea4fb983024e04ee3e9, type: 3}
      ItemType: 12
      ItemExtendId: 1
      ItemNum: 5
      CurrencyType: 0
      CurrencyNum: 1000
      NoAdsCurrencyType: 0
      NoAdsCurrencyNum: 1000
      Rate: 10
    - ItemIcon: {fileID: 21300000, guid: 641de733afe99574f8ea4b1bd8d7407a, type: 3}
      ItemType: 12
      ItemExtendId: 2
      ItemNum: 5
      CurrencyType: 0
      CurrencyNum: 1500
      NoAdsCurrencyType: 0
      NoAdsCurrencyNum: 1500
      Rate: 21
    - ItemIcon: {fileID: 21300000, guid: 62df481928fbab647b8b540b4099a921, type: 3}
      ItemType: 12
      ItemExtendId: 3
      ItemNum: 3
      CurrencyType: 2
      CurrencyNum: 3
      NoAdsCurrencyType: 0
      NoAdsCurrencyNum: 1800
      Rate: 7
    - ItemIcon: {fileID: 21300000, guid: 5145fb36e641bd94ab25e984b43e7304, type: 3}
      ItemType: 12
      ItemExtendId: 4
      ItemNum: 3
      CurrencyType: 2
      CurrencyNum: 3
      NoAdsCurrencyType: 0
      NoAdsCurrencyNum: 1800
      Rate: 7
    - ItemIcon: {fileID: 21300000, guid: 3fb8034ac6be7784b86ffb4954f4744f, type: 3}
      ItemType: 13
      ItemExtendId: 0
      ItemNum: 5
      CurrencyType: 0
      CurrencyNum: 350
      NoAdsCurrencyType: 0
      NoAdsCurrencyNum: 350
      Rate: 15
    - ItemIcon: {fileID: 21300000, guid: af74d2dc4a9e6d74398a8df001f2cd80, type: 3}
      ItemType: 13
      ItemExtendId: 1
      ItemNum: 5
      CurrencyType: 0
      CurrencyNum: 600
      NoAdsCurrencyType: 0
      NoAdsCurrencyNum: 600
      Rate: 15
    - ItemIcon: {fileID: 21300000, guid: 59c4ee9aea754034b9e115b168a5edb5, type: 3}
      ItemType: 13
      ItemExtendId: 2
      ItemNum: 5
      CurrencyType: 0
      CurrencyNum: 750
      NoAdsCurrencyType: 0
      NoAdsCurrencyNum: 750
      Rate: 15
  - UnlockCurrency: 0
    UnlockNum: -1
    NoAdsUnlockCurrency: 0
    NoAdsUnlockNum: -1
    SlotInfor:
    - ItemIcon: {fileID: 21300000, guid: ce8a6c5486cf25948acd7ddd3796df13, type: 3}
      ItemType: 12
      ItemExtendId: 0
      ItemNum: 5
      CurrencyType: 0
      CurrencyNum: 500
      NoAdsCurrencyType: 0
      NoAdsCurrencyNum: 500
      Rate: 10
    - ItemIcon: {fileID: 21300000, guid: da06efdb0e627ea4fb983024e04ee3e9, type: 3}
      ItemType: 12
      ItemExtendId: 1
      ItemNum: 5
      CurrencyType: 0
      CurrencyNum: 1000
      NoAdsCurrencyType: 0
      NoAdsCurrencyNum: 1000
      Rate: 10
    - ItemIcon: {fileID: 21300000, guid: 641de733afe99574f8ea4b1bd8d7407a, type: 3}
      ItemType: 12
      ItemExtendId: 2
      ItemNum: 5
      CurrencyType: 0
      CurrencyNum: 1500
      NoAdsCurrencyType: 0
      NoAdsCurrencyNum: 1500
      Rate: 10
    - ItemIcon: {fileID: 21300000, guid: 62df481928fbab647b8b540b4099a921, type: 3}
      ItemType: 12
      ItemExtendId: 3
      ItemNum: 3
      CurrencyType: 2
      CurrencyNum: 3
      NoAdsCurrencyType: 0
      NoAdsCurrencyNum: 1800
      Rate: 15
    - ItemIcon: {fileID: 21300000, guid: 5145fb36e641bd94ab25e984b43e7304, type: 3}
      ItemType: 12
      ItemExtendId: 4
      ItemNum: 3
      CurrencyType: 2
      CurrencyNum: 3
      NoAdsCurrencyType: 0
      NoAdsCurrencyNum: 1800
      Rate: 15
    - ItemIcon: {fileID: 21300000, guid: 3fb8034ac6be7784b86ffb4954f4744f, type: 3}
      ItemType: 13
      ItemExtendId: 0
      ItemNum: 5
      CurrencyType: 0
      CurrencyNum: 350
      NoAdsCurrencyType: 0
      NoAdsCurrencyNum: 350
      Rate: 9
    - ItemIcon: {fileID: 21300000, guid: af74d2dc4a9e6d74398a8df001f2cd80, type: 3}
      ItemType: 13
      ItemExtendId: 1
      ItemNum: 5
      CurrencyType: 0
      CurrencyNum: 600
      NoAdsCurrencyType: 0
      NoAdsCurrencyNum: 600
      Rate: 9
    - ItemIcon: {fileID: 21300000, guid: 59c4ee9aea754034b9e115b168a5edb5, type: 3}
      ItemType: 13
      ItemExtendId: 2
      ItemNum: 5
      CurrencyType: 0
      CurrencyNum: 750
      NoAdsCurrencyType: 0
      NoAdsCurrencyNum: 750
      Rate: 20
    - ItemIcon: {fileID: 21300000, guid: ba3b530a033053d419add10d1485ba6f, type: 3}
      ItemType: 13
      ItemExtendId: 3
      ItemNum: 3
      CurrencyType: 2
      CurrencyNum: 3
      NoAdsCurrencyType: 0
      NoAdsCurrencyNum: 1800
      Rate: 1
    - ItemIcon: {fileID: 21300000, guid: ab1e1b871e466c04a800c5d5cb92520f, type: 3}
      ItemType: 13
      ItemExtendId: 4
      ItemNum: 3
      CurrencyType: 2
      CurrencyNum: 3
      NoAdsCurrencyType: 0
      NoAdsCurrencyNum: 1800
      Rate: 1
  - UnlockCurrency: 1
    UnlockNum: 5
    NoAdsUnlockCurrency: 1
    NoAdsUnlockNum: 5
    SlotInfor:
    - ItemIcon: {fileID: 21300000, guid: ce8a6c5486cf25948acd7ddd3796df13, type: 3}
      ItemType: 12
      ItemExtendId: 0
      ItemNum: 5
      CurrencyType: 0
      CurrencyNum: 500
      NoAdsCurrencyType: 0
      NoAdsCurrencyNum: 500
      Rate: 7
    - ItemIcon: {fileID: 21300000, guid: da06efdb0e627ea4fb983024e04ee3e9, type: 3}
      ItemType: 12
      ItemExtendId: 1
      ItemNum: 5
      CurrencyType: 0
      CurrencyNum: 1000
      NoAdsCurrencyType: 0
      NoAdsCurrencyNum: 1000
      Rate: 7
    - ItemIcon: {fileID: 21300000, guid: 641de733afe99574f8ea4b1bd8d7407a, type: 3}
      ItemType: 12
      ItemExtendId: 2
      ItemNum: 5
      CurrencyType: 0
      CurrencyNum: 1500
      NoAdsCurrencyType: 0
      NoAdsCurrencyNum: 1500
      Rate: 14
    - ItemIcon: {fileID: 21300000, guid: 62df481928fbab647b8b540b4099a921, type: 3}
      ItemType: 12
      ItemExtendId: 3
      ItemNum: 3
      CurrencyType: 2
      CurrencyNum: 3
      NoAdsCurrencyType: 0
      NoAdsCurrencyNum: 1800
      Rate: 15
    - ItemIcon: {fileID: 21300000, guid: 5145fb36e641bd94ab25e984b43e7304, type: 3}
      ItemType: 12
      ItemExtendId: 4
      ItemNum: 3
      CurrencyType: 2
      CurrencyNum: 3
      NoAdsCurrencyType: 0
      NoAdsCurrencyNum: 1800
      Rate: 15
    - ItemIcon: {fileID: 21300000, guid: 61bce71fe2e435e4c9a7fde2f41f318e, type: 3}
      ItemType: 12
      ItemExtendId: 5
      ItemNum: 1
      CurrencyType: 2
      CurrencyNum: 1
      NoAdsCurrencyType: 0
      NoAdsCurrencyNum: 600
      Rate: 1
    - ItemIcon: {fileID: 21300000, guid: 63cc2f105ade2464bab15a21060d172e, type: 3}
      ItemType: 12
      ItemExtendId: 6
      ItemNum: 1
      CurrencyType: 2
      CurrencyNum: 1
      NoAdsCurrencyType: 0
      NoAdsCurrencyNum: 600
      Rate: 1
    - ItemIcon: {fileID: 21300000, guid: 3fb8034ac6be7784b86ffb4954f4744f, type: 3}
      ItemType: 13
      ItemExtendId: 0
      ItemNum: 5
      CurrencyType: 0
      CurrencyNum: 350
      NoAdsCurrencyType: 0
      NoAdsCurrencyNum: 350
      Rate: 10
    - ItemIcon: {fileID: 21300000, guid: af74d2dc4a9e6d74398a8df001f2cd80, type: 3}
      ItemType: 13
      ItemExtendId: 1
      ItemNum: 5
      CurrencyType: 0
      CurrencyNum: 600
      NoAdsCurrencyType: 0
      NoAdsCurrencyNum: 600
      Rate: 10
    - ItemIcon: {fileID: 21300000, guid: 59c4ee9aea754034b9e115b168a5edb5, type: 3}
      ItemType: 13
      ItemExtendId: 2
      ItemNum: 5
      CurrencyType: 0
      CurrencyNum: 750
      NoAdsCurrencyType: 0
      NoAdsCurrencyNum: 750
      Rate: 18
    - ItemIcon: {fileID: 21300000, guid: ba3b530a033053d419add10d1485ba6f, type: 3}
      ItemType: 13
      ItemExtendId: 3
      ItemNum: 3
      CurrencyType: 2
      CurrencyNum: 3
      NoAdsCurrencyType: 0
      NoAdsCurrencyNum: 1800
      Rate: 1
    - ItemIcon: {fileID: 21300000, guid: ab1e1b871e466c04a800c5d5cb92520f, type: 3}
      ItemType: 13
      ItemExtendId: 4
      ItemNum: 3
      CurrencyType: 2
      CurrencyNum: 3
      NoAdsCurrencyType: 0
      NoAdsCurrencyNum: 1800
      Rate: 1
  - UnlockCurrency: 1
    UnlockNum: 10
    NoAdsUnlockCurrency: 1
    NoAdsUnlockNum: 10
    SlotInfor:
    - ItemIcon: {fileID: 21300000, guid: ce8a6c5486cf25948acd7ddd3796df13, type: 3}
      ItemType: 12
      ItemExtendId: 0
      ItemNum: 5
      CurrencyType: 0
      CurrencyNum: 500
      NoAdsCurrencyType: 0
      NoAdsCurrencyNum: 500
      Rate: 7
    - ItemIcon: {fileID: 21300000, guid: da06efdb0e627ea4fb983024e04ee3e9, type: 3}
      ItemType: 12
      ItemExtendId: 1
      ItemNum: 5
      CurrencyType: 0
      CurrencyNum: 1000
      NoAdsCurrencyType: 0
      NoAdsCurrencyNum: 1000
      Rate: 7
    - ItemIcon: {fileID: 21300000, guid: 641de733afe99574f8ea4b1bd8d7407a, type: 3}
      ItemType: 12
      ItemExtendId: 2
      ItemNum: 5
      CurrencyType: 0
      CurrencyNum: 1500
      NoAdsCurrencyType: 0
      NoAdsCurrencyNum: 1500
      Rate: 14
    - ItemIcon: {fileID: 21300000, guid: 62df481928fbab647b8b540b4099a921, type: 3}
      ItemType: 12
      ItemExtendId: 3
      ItemNum: 3
      CurrencyType: 2
      CurrencyNum: 3
      NoAdsCurrencyType: 0
      NoAdsCurrencyNum: 1800
      Rate: 15
    - ItemIcon: {fileID: 21300000, guid: 5145fb36e641bd94ab25e984b43e7304, type: 3}
      ItemType: 12
      ItemExtendId: 4
      ItemNum: 3
      CurrencyType: 2
      CurrencyNum: 3
      NoAdsCurrencyType: 0
      NoAdsCurrencyNum: 1800
      Rate: 15
    - ItemIcon: {fileID: 21300000, guid: 61bce71fe2e435e4c9a7fde2f41f318e, type: 3}
      ItemType: 12
      ItemExtendId: 5
      ItemNum: 1
      CurrencyType: 2
      CurrencyNum: 1
      NoAdsCurrencyType: 0
      NoAdsCurrencyNum: 600
      Rate: 1
    - ItemIcon: {fileID: 21300000, guid: 63cc2f105ade2464bab15a21060d172e, type: 3}
      ItemType: 12
      ItemExtendId: 6
      ItemNum: 1
      CurrencyType: 2
      CurrencyNum: 1
      NoAdsCurrencyType: 0
      NoAdsCurrencyNum: 600
      Rate: 1
    - ItemIcon: {fileID: 21300000, guid: 3fb8034ac6be7784b86ffb4954f4744f, type: 3}
      ItemType: 13
      ItemExtendId: 0
      ItemNum: 5
      CurrencyType: 0
      CurrencyNum: 350
      NoAdsCurrencyType: 0
      NoAdsCurrencyNum: 350
      Rate: 10
    - ItemIcon: {fileID: 21300000, guid: af74d2dc4a9e6d74398a8df001f2cd80, type: 3}
      ItemType: 13
      ItemExtendId: 1
      ItemNum: 5
      CurrencyType: 0
      CurrencyNum: 600
      NoAdsCurrencyType: 0
      NoAdsCurrencyNum: 600
      Rate: 10
    - ItemIcon: {fileID: 21300000, guid: 59c4ee9aea754034b9e115b168a5edb5, type: 3}
      ItemType: 13
      ItemExtendId: 2
      ItemNum: 5
      CurrencyType: 0
      CurrencyNum: 750
      NoAdsCurrencyType: 0
      NoAdsCurrencyNum: 750
      Rate: 18
    - ItemIcon: {fileID: 21300000, guid: ba3b530a033053d419add10d1485ba6f, type: 3}
      ItemType: 13
      ItemExtendId: 3
      ItemNum: 3
      CurrencyType: 2
      CurrencyNum: 3
      NoAdsCurrencyType: 0
      NoAdsCurrencyNum: 1800
      Rate: 1
    - ItemIcon: {fileID: 21300000, guid: ab1e1b871e466c04a800c5d5cb92520f, type: 3}
      ItemType: 13
      ItemExtendId: 4
      ItemNum: 3
      CurrencyType: 2
      CurrencyNum: 3
      NoAdsCurrencyType: 0
      NoAdsCurrencyNum: 2500
      Rate: 1
  - UnlockCurrency: 1
    UnlockNum: 15
    NoAdsUnlockCurrency: 1
    NoAdsUnlockNum: 15
    SlotInfor:
    - ItemIcon: {fileID: 21300000, guid: ce8a6c5486cf25948acd7ddd3796df13, type: 3}
      ItemType: 12
      ItemExtendId: 0
      ItemNum: 5
      CurrencyType: 0
      CurrencyNum: 500
      NoAdsCurrencyType: 0
      NoAdsCurrencyNum: 500
      Rate: 7
    - ItemIcon: {fileID: 21300000, guid: da06efdb0e627ea4fb983024e04ee3e9, type: 3}
      ItemType: 12
      ItemExtendId: 1
      ItemNum: 5
      CurrencyType: 0
      CurrencyNum: 1000
      NoAdsCurrencyType: 0
      NoAdsCurrencyNum: 1000
      Rate: 7
    - ItemIcon: {fileID: 21300000, guid: 641de733afe99574f8ea4b1bd8d7407a, type: 3}
      ItemType: 12
      ItemExtendId: 2
      ItemNum: 5
      CurrencyType: 0
      CurrencyNum: 1500
      NoAdsCurrencyType: 0
      NoAdsCurrencyNum: 1500
      Rate: 14
    - ItemIcon: {fileID: 21300000, guid: 62df481928fbab647b8b540b4099a921, type: 3}
      ItemType: 12
      ItemExtendId: 3
      ItemNum: 3
      CurrencyType: 2
      CurrencyNum: 3
      NoAdsCurrencyType: 0
      NoAdsCurrencyNum: 1800
      Rate: 15
    - ItemIcon: {fileID: 21300000, guid: 5145fb36e641bd94ab25e984b43e7304, type: 3}
      ItemType: 12
      ItemExtendId: 4
      ItemNum: 3
      CurrencyType: 2
      CurrencyNum: 3
      NoAdsCurrencyType: 0
      NoAdsCurrencyNum: 1800
      Rate: 15
    - ItemIcon: {fileID: 21300000, guid: 61bce71fe2e435e4c9a7fde2f41f318e, type: 3}
      ItemType: 12
      ItemExtendId: 5
      ItemNum: 1
      CurrencyType: 2
      CurrencyNum: 1
      NoAdsCurrencyType: 0
      NoAdsCurrencyNum: 600
      Rate: 1
    - ItemIcon: {fileID: 21300000, guid: 63cc2f105ade2464bab15a21060d172e, type: 3}
      ItemType: 12
      ItemExtendId: 6
      ItemNum: 1
      CurrencyType: 2
      CurrencyNum: 1
      NoAdsCurrencyType: 0
      NoAdsCurrencyNum: 600
      Rate: 1
    - ItemIcon: {fileID: 21300000, guid: 3fb8034ac6be7784b86ffb4954f4744f, type: 3}
      ItemType: 13
      ItemExtendId: 0
      ItemNum: 5
      CurrencyType: 0
      CurrencyNum: 350
      NoAdsCurrencyType: 0
      NoAdsCurrencyNum: 350
      Rate: 10
    - ItemIcon: {fileID: 21300000, guid: af74d2dc4a9e6d74398a8df001f2cd80, type: 3}
      ItemType: 13
      ItemExtendId: 1
      ItemNum: 5
      CurrencyType: 0
      CurrencyNum: 600
      NoAdsCurrencyType: 0
      NoAdsCurrencyNum: 600
      Rate: 10
    - ItemIcon: {fileID: 21300000, guid: 59c4ee9aea754034b9e115b168a5edb5, type: 3}
      ItemType: 13
      ItemExtendId: 2
      ItemNum: 5
      CurrencyType: 0
      CurrencyNum: 750
      NoAdsCurrencyType: 0
      NoAdsCurrencyNum: 750
      Rate: 18
    - ItemIcon: {fileID: 21300000, guid: ba3b530a033053d419add10d1485ba6f, type: 3}
      ItemType: 13
      ItemExtendId: 3
      ItemNum: 3
      CurrencyType: 2
      CurrencyNum: 3
      NoAdsCurrencyType: 0
      NoAdsCurrencyNum: 1800
      Rate: 1
    - ItemIcon: {fileID: 21300000, guid: ab1e1b871e466c04a800c5d5cb92520f, type: 3}
      ItemType: 13
      ItemExtendId: 4
      ItemNum: 3
      CurrencyType: 2
      CurrencyNum: 3
      NoAdsCurrencyType: 0
      NoAdsCurrencyNum: 1800
      Rate: 1
  - UnlockCurrency: 1
    UnlockNum: 20
    NoAdsUnlockCurrency: 1
    NoAdsUnlockNum: 20
    SlotInfor:
    - ItemIcon: {fileID: 21300000, guid: ce8a6c5486cf25948acd7ddd3796df13, type: 3}
      ItemType: 12
      ItemExtendId: 0
      ItemNum: 5
      CurrencyType: 0
      CurrencyNum: 500
      NoAdsCurrencyType: 0
      NoAdsCurrencyNum: 500
      Rate: 5
    - ItemIcon: {fileID: 21300000, guid: da06efdb0e627ea4fb983024e04ee3e9, type: 3}
      ItemType: 12
      ItemExtendId: 1
      ItemNum: 5
      CurrencyType: 0
      CurrencyNum: 1000
      NoAdsCurrencyType: 0
      NoAdsCurrencyNum: 1000
      Rate: 5
    - ItemIcon: {fileID: 21300000, guid: 641de733afe99574f8ea4b1bd8d7407a, type: 3}
      ItemType: 12
      ItemExtendId: 2
      ItemNum: 5
      CurrencyType: 0
      CurrencyNum: 1500
      NoAdsCurrencyType: 0
      NoAdsCurrencyNum: 1500
      Rate: 10
    - ItemIcon: {fileID: 21300000, guid: 62df481928fbab647b8b540b4099a921, type: 3}
      ItemType: 12
      ItemExtendId: 3
      ItemNum: 3
      CurrencyType: 2
      CurrencyNum: 3
      NoAdsCurrencyType: 0
      NoAdsCurrencyNum: 1800
      Rate: 17
    - ItemIcon: {fileID: 21300000, guid: 5145fb36e641bd94ab25e984b43e7304, type: 3}
      ItemType: 12
      ItemExtendId: 4
      ItemNum: 3
      CurrencyType: 2
      CurrencyNum: 3
      NoAdsCurrencyType: 0
      NoAdsCurrencyNum: 1800
      Rate: 17
    - ItemIcon: {fileID: 21300000, guid: 61bce71fe2e435e4c9a7fde2f41f318e, type: 3}
      ItemType: 12
      ItemExtendId: 5
      ItemNum: 1
      CurrencyType: 2
      CurrencyNum: 1
      NoAdsCurrencyType: 0
      NoAdsCurrencyNum: 600
      Rate: 5
    - ItemIcon: {fileID: 21300000, guid: 63cc2f105ade2464bab15a21060d172e, type: 3}
      ItemType: 12
      ItemExtendId: 6
      ItemNum: 1
      CurrencyType: 2
      CurrencyNum: 1
      NoAdsCurrencyType: 0
      NoAdsCurrencyNum: 600
      Rate: 5
    - ItemIcon: {fileID: 21300000, guid: 3fb8034ac6be7784b86ffb4954f4744f, type: 3}
      ItemType: 13
      ItemExtendId: 0
      ItemNum: 5
      CurrencyType: 0
      CurrencyNum: 350
      NoAdsCurrencyType: 0
      NoAdsCurrencyNum: 350
      Rate: 7
    - ItemIcon: {fileID: 21300000, guid: af74d2dc4a9e6d74398a8df001f2cd80, type: 3}
      ItemType: 13
      ItemExtendId: 1
      ItemNum: 5
      CurrencyType: 0
      CurrencyNum: 600
      NoAdsCurrencyType: 0
      NoAdsCurrencyNum: 600
      Rate: 7
    - ItemIcon: {fileID: 21300000, guid: 59c4ee9aea754034b9e115b168a5edb5, type: 3}
      ItemType: 13
      ItemExtendId: 2
      ItemNum: 5
      CurrencyType: 0
      CurrencyNum: 750
      NoAdsCurrencyType: 0
      NoAdsCurrencyNum: 750
      Rate: 14
    - ItemIcon: {fileID: 21300000, guid: ba3b530a033053d419add10d1485ba6f, type: 3}
      ItemType: 13
      ItemExtendId: 3
      ItemNum: 3
      CurrencyType: 2
      CurrencyNum: 3
      NoAdsCurrencyType: 0
      NoAdsCurrencyNum: 1800
      Rate: 3
    - ItemIcon: {fileID: 21300000, guid: ab1e1b871e466c04a800c5d5cb92520f, type: 3}
      ItemType: 13
      ItemExtendId: 4
      ItemNum: 3
      CurrencyType: 2
      CurrencyNum: 3
      NoAdsCurrencyType: 0
      NoAdsCurrencyNum: 1800
      Rate: 3
    - ItemIcon: {fileID: 21300000, guid: e55ab6958416bc04ab3ef7b96cab4aac, type: 3}
      ItemType: 12
      ItemExtendId: 7
      ItemNum: 1
      CurrencyType: 2
      CurrencyNum: 1
      NoAdsCurrencyType: 0
      NoAdsCurrencyNum: 600
      Rate: 1
    - ItemIcon: {fileID: 21300000, guid: 4e679bb4e922ffd4d91339a8324bb454, type: 3}
      ItemType: 13
      ItemExtendId: 5
      ItemNum: 1
      CurrencyType: 2
      CurrencyNum: 1
      NoAdsCurrencyType: 0
      NoAdsCurrencyNum: 600
      Rate: 1
  - UnlockCurrency: 1
    UnlockNum: 25
    NoAdsUnlockCurrency: 1
    NoAdsUnlockNum: 25
    SlotInfor:
    - ItemIcon: {fileID: 21300000, guid: ce8a6c5486cf25948acd7ddd3796df13, type: 3}
      ItemType: 12
      ItemExtendId: 0
      ItemNum: 5
      CurrencyType: 0
      CurrencyNum: 500
      NoAdsCurrencyType: 0
      NoAdsCurrencyNum: 500
      Rate: 5
    - ItemIcon: {fileID: 21300000, guid: da06efdb0e627ea4fb983024e04ee3e9, type: 3}
      ItemType: 12
      ItemExtendId: 1
      ItemNum: 5
      CurrencyType: 0
      CurrencyNum: 1000
      NoAdsCurrencyType: 0
      NoAdsCurrencyNum: 1000
      Rate: 5
    - ItemIcon: {fileID: 21300000, guid: 641de733afe99574f8ea4b1bd8d7407a, type: 3}
      ItemType: 12
      ItemExtendId: 2
      ItemNum: 5
      CurrencyType: 0
      CurrencyNum: 1500
      NoAdsCurrencyType: 0
      NoAdsCurrencyNum: 1500
      Rate: 10
    - ItemIcon: {fileID: 21300000, guid: 62df481928fbab647b8b540b4099a921, type: 3}
      ItemType: 12
      ItemExtendId: 3
      ItemNum: 3
      CurrencyType: 2
      CurrencyNum: 3
      NoAdsCurrencyType: 0
      NoAdsCurrencyNum: 1800
      Rate: 17
    - ItemIcon: {fileID: 21300000, guid: 5145fb36e641bd94ab25e984b43e7304, type: 3}
      ItemType: 12
      ItemExtendId: 4
      ItemNum: 3
      CurrencyType: 2
      CurrencyNum: 3
      NoAdsCurrencyType: 0
      NoAdsCurrencyNum: 1800
      Rate: 17
    - ItemIcon: {fileID: 21300000, guid: 61bce71fe2e435e4c9a7fde2f41f318e, type: 3}
      ItemType: 12
      ItemExtendId: 5
      ItemNum: 1
      CurrencyType: 2
      CurrencyNum: 1
      NoAdsCurrencyType: 0
      NoAdsCurrencyNum: 600
      Rate: 5
    - ItemIcon: {fileID: 21300000, guid: 63cc2f105ade2464bab15a21060d172e, type: 3}
      ItemType: 12
      ItemExtendId: 6
      ItemNum: 1
      CurrencyType: 2
      CurrencyNum: 1
      NoAdsCurrencyType: 0
      NoAdsCurrencyNum: 600
      Rate: 5
    - ItemIcon: {fileID: 21300000, guid: 3fb8034ac6be7784b86ffb4954f4744f, type: 3}
      ItemType: 13
      ItemExtendId: 0
      ItemNum: 5
      CurrencyType: 0
      CurrencyNum: 350
      NoAdsCurrencyType: 0
      NoAdsCurrencyNum: 350
      Rate: 7
    - ItemIcon: {fileID: 21300000, guid: af74d2dc4a9e6d74398a8df001f2cd80, type: 3}
      ItemType: 13
      ItemExtendId: 1
      ItemNum: 5
      CurrencyType: 0
      CurrencyNum: 600
      NoAdsCurrencyType: 0
      NoAdsCurrencyNum: 600
      Rate: 7
    - ItemIcon: {fileID: 21300000, guid: 59c4ee9aea754034b9e115b168a5edb5, type: 3}
      ItemType: 13
      ItemExtendId: 2
      ItemNum: 5
      CurrencyType: 0
      CurrencyNum: 750
      NoAdsCurrencyType: 0
      NoAdsCurrencyNum: 750
      Rate: 14
    - ItemIcon: {fileID: 21300000, guid: ba3b530a033053d419add10d1485ba6f, type: 3}
      ItemType: 13
      ItemExtendId: 3
      ItemNum: 3
      CurrencyType: 2
      CurrencyNum: 3
      NoAdsCurrencyType: 0
      NoAdsCurrencyNum: 1800
      Rate: 3
    - ItemIcon: {fileID: 21300000, guid: ab1e1b871e466c04a800c5d5cb92520f, type: 3}
      ItemType: 13
      ItemExtendId: 4
      ItemNum: 3
      CurrencyType: 2
      CurrencyNum: 3
      NoAdsCurrencyType: 0
      NoAdsCurrencyNum: 1800
      Rate: 3
    - ItemIcon: {fileID: 21300000, guid: e55ab6958416bc04ab3ef7b96cab4aac, type: 3}
      ItemType: 12
      ItemExtendId: 7
      ItemNum: 1
      CurrencyType: 2
      CurrencyNum: 1
      NoAdsCurrencyType: 0
      NoAdsCurrencyNum: 600
      Rate: 1
    - ItemIcon: {fileID: 21300000, guid: 4e679bb4e922ffd4d91339a8324bb454, type: 3}
      ItemType: 13
      ItemExtendId: 5
      ItemNum: 1
      CurrencyType: 2
      CurrencyNum: 1
      NoAdsCurrencyType: 0
      NoAdsCurrencyNum: 600
      Rate: 1
  - UnlockCurrency: 1
    UnlockNum: 30
    NoAdsUnlockCurrency: 1
    NoAdsUnlockNum: 30
    SlotInfor:
    - ItemIcon: {fileID: 21300000, guid: ce8a6c5486cf25948acd7ddd3796df13, type: 3}
      ItemType: 12
      ItemExtendId: 0
      ItemNum: 5
      CurrencyType: 0
      CurrencyNum: 500
      NoAdsCurrencyType: 0
      NoAdsCurrencyNum: 500
      Rate: 5
    - ItemIcon: {fileID: 21300000, guid: da06efdb0e627ea4fb983024e04ee3e9, type: 3}
      ItemType: 12
      ItemExtendId: 1
      ItemNum: 5
      CurrencyType: 0
      CurrencyNum: 1000
      NoAdsCurrencyType: 0
      NoAdsCurrencyNum: 1000
      Rate: 5
    - ItemIcon: {fileID: 21300000, guid: 641de733afe99574f8ea4b1bd8d7407a, type: 3}
      ItemType: 12
      ItemExtendId: 2
      ItemNum: 5
      CurrencyType: 0
      CurrencyNum: 1500
      NoAdsCurrencyType: 0
      NoAdsCurrencyNum: 1500
      Rate: 10
    - ItemIcon: {fileID: 21300000, guid: 62df481928fbab647b8b540b4099a921, type: 3}
      ItemType: 12
      ItemExtendId: 3
      ItemNum: 3
      CurrencyType: 2
      CurrencyNum: 3
      NoAdsCurrencyType: 0
      NoAdsCurrencyNum: 1800
      Rate: 17
    - ItemIcon: {fileID: 21300000, guid: 5145fb36e641bd94ab25e984b43e7304, type: 3}
      ItemType: 12
      ItemExtendId: 4
      ItemNum: 3
      CurrencyType: 2
      CurrencyNum: 3
      NoAdsCurrencyType: 0
      NoAdsCurrencyNum: 1800
      Rate: 17
    - ItemIcon: {fileID: 21300000, guid: 61bce71fe2e435e4c9a7fde2f41f318e, type: 3}
      ItemType: 12
      ItemExtendId: 5
      ItemNum: 1
      CurrencyType: 2
      CurrencyNum: 1
      NoAdsCurrencyType: 0
      NoAdsCurrencyNum: 600
      Rate: 5
    - ItemIcon: {fileID: 21300000, guid: 63cc2f105ade2464bab15a21060d172e, type: 3}
      ItemType: 12
      ItemExtendId: 6
      ItemNum: 1
      CurrencyType: 2
      CurrencyNum: 1
      NoAdsCurrencyType: 0
      NoAdsCurrencyNum: 600
      Rate: 5
    - ItemIcon: {fileID: 21300000, guid: 3fb8034ac6be7784b86ffb4954f4744f, type: 3}
      ItemType: 13
      ItemExtendId: 0
      ItemNum: 5
      CurrencyType: 0
      CurrencyNum: 350
      NoAdsCurrencyType: 0
      NoAdsCurrencyNum: 350
      Rate: 7
    - ItemIcon: {fileID: 21300000, guid: af74d2dc4a9e6d74398a8df001f2cd80, type: 3}
      ItemType: 13
      ItemExtendId: 1
      ItemNum: 5
      CurrencyType: 0
      CurrencyNum: 600
      NoAdsCurrencyType: 0
      NoAdsCurrencyNum: 600
      Rate: 7
    - ItemIcon: {fileID: 21300000, guid: 59c4ee9aea754034b9e115b168a5edb5, type: 3}
      ItemType: 13
      ItemExtendId: 2
      ItemNum: 5
      CurrencyType: 0
      CurrencyNum: 750
      NoAdsCurrencyType: 0
      NoAdsCurrencyNum: 750
      Rate: 14
    - ItemIcon: {fileID: 21300000, guid: ba3b530a033053d419add10d1485ba6f, type: 3}
      ItemType: 13
      ItemExtendId: 3
      ItemNum: 3
      CurrencyType: 2
      CurrencyNum: 3
      NoAdsCurrencyType: 0
      NoAdsCurrencyNum: 1800
      Rate: 3
    - ItemIcon: {fileID: 21300000, guid: ab1e1b871e466c04a800c5d5cb92520f, type: 3}
      ItemType: 13
      ItemExtendId: 4
      ItemNum: 3
      CurrencyType: 2
      CurrencyNum: 3
      NoAdsCurrencyType: 0
      NoAdsCurrencyNum: 1800
      Rate: 3
    - ItemIcon: {fileID: 21300000, guid: e55ab6958416bc04ab3ef7b96cab4aac, type: 3}
      ItemType: 12
      ItemExtendId: 7
      ItemNum: 1
      CurrencyType: 2
      CurrencyNum: 1
      NoAdsCurrencyType: 0
      NoAdsCurrencyNum: 600
      Rate: 1
    - ItemIcon: {fileID: 21300000, guid: 4e679bb4e922ffd4d91339a8324bb454, type: 3}
      ItemType: 13
      ItemExtendId: 5
      ItemNum: 1
      CurrencyType: 2
      CurrencyNum: 1
      NoAdsCurrencyType: 0
      NoAdsCurrencyNum: 600
      Rate: 1
  - UnlockCurrency: 1
    UnlockNum: 35
    NoAdsUnlockCurrency: 1
    NoAdsUnlockNum: 35
    SlotInfor:
    - ItemIcon: {fileID: 21300000, guid: ce8a6c5486cf25948acd7ddd3796df13, type: 3}
      ItemType: 12
      ItemExtendId: 0
      ItemNum: 5
      CurrencyType: 0
      CurrencyNum: 500
      NoAdsCurrencyType: 0
      NoAdsCurrencyNum: 500
      Rate: 3
    - ItemIcon: {fileID: 21300000, guid: da06efdb0e627ea4fb983024e04ee3e9, type: 3}
      ItemType: 12
      ItemExtendId: 1
      ItemNum: 5
      CurrencyType: 0
      CurrencyNum: 1000
      NoAdsCurrencyType: 0
      NoAdsCurrencyNum: 1000
      Rate: 3
    - ItemIcon: {fileID: 21300000, guid: 641de733afe99574f8ea4b1bd8d7407a, type: 3}
      ItemType: 12
      ItemExtendId: 2
      ItemNum: 5
      CurrencyType: 0
      CurrencyNum: 1500
      NoAdsCurrencyType: 0
      NoAdsCurrencyNum: 1500
      Rate: 5
    - ItemIcon: {fileID: 21300000, guid: 62df481928fbab647b8b540b4099a921, type: 3}
      ItemType: 12
      ItemExtendId: 3
      ItemNum: 3
      CurrencyType: 2
      CurrencyNum: 3
      NoAdsCurrencyType: 0
      NoAdsCurrencyNum: 1800
      Rate: 19
    - ItemIcon: {fileID: 21300000, guid: 5145fb36e641bd94ab25e984b43e7304, type: 3}
      ItemType: 12
      ItemExtendId: 4
      ItemNum: 3
      CurrencyType: 2
      CurrencyNum: 3
      NoAdsCurrencyType: 0
      NoAdsCurrencyNum: 1800
      Rate: 19
    - ItemIcon: {fileID: 21300000, guid: 61bce71fe2e435e4c9a7fde2f41f318e, type: 3}
      ItemType: 12
      ItemExtendId: 5
      ItemNum: 1
      CurrencyType: 2
      CurrencyNum: 1
      NoAdsCurrencyType: 0
      NoAdsCurrencyNum: 600
      Rate: 7
    - ItemIcon: {fileID: 21300000, guid: 63cc2f105ade2464bab15a21060d172e, type: 3}
      ItemType: 12
      ItemExtendId: 6
      ItemNum: 1
      CurrencyType: 2
      CurrencyNum: 1
      NoAdsCurrencyType: 0
      NoAdsCurrencyNum: 600
      Rate: 7
    - ItemIcon: {fileID: 21300000, guid: 3fb8034ac6be7784b86ffb4954f4744f, type: 3}
      ItemType: 13
      ItemExtendId: 0
      ItemNum: 5
      CurrencyType: 0
      CurrencyNum: 350
      NoAdsCurrencyType: 0
      NoAdsCurrencyNum: 350
      Rate: 6
    - ItemIcon: {fileID: 21300000, guid: af74d2dc4a9e6d74398a8df001f2cd80, type: 3}
      ItemType: 13
      ItemExtendId: 1
      ItemNum: 5
      CurrencyType: 0
      CurrencyNum: 600
      NoAdsCurrencyType: 0
      NoAdsCurrencyNum: 600
      Rate: 6
    - ItemIcon: {fileID: 21300000, guid: 59c4ee9aea754034b9e115b168a5edb5, type: 3}
      ItemType: 13
      ItemExtendId: 2
      ItemNum: 5
      CurrencyType: 0
      CurrencyNum: 750
      NoAdsCurrencyType: 0
      NoAdsCurrencyNum: 750
      Rate: 9
    - ItemIcon: {fileID: 21300000, guid: ba3b530a033053d419add10d1485ba6f, type: 3}
      ItemType: 13
      ItemExtendId: 3
      ItemNum: 3
      CurrencyType: 2
      CurrencyNum: 3
      NoAdsCurrencyType: 0
      NoAdsCurrencyNum: 1800
      Rate: 5
    - ItemIcon: {fileID: 21300000, guid: ab1e1b871e466c04a800c5d5cb92520f, type: 3}
      ItemType: 13
      ItemExtendId: 4
      ItemNum: 3
      CurrencyType: 2
      CurrencyNum: 3
      NoAdsCurrencyType: 0
      NoAdsCurrencyNum: 1800
      Rate: 5
    - ItemIcon: {fileID: 21300000, guid: e55ab6958416bc04ab3ef7b96cab4aac, type: 3}
      ItemType: 12
      ItemExtendId: 7
      ItemNum: 1
      CurrencyType: 2
      CurrencyNum: 1
      NoAdsCurrencyType: 0
      NoAdsCurrencyNum: 600
      Rate: 3
    - ItemIcon: {fileID: 21300000, guid: 4e679bb4e922ffd4d91339a8324bb454, type: 3}
      ItemType: 13
      ItemExtendId: 5
      ItemNum: 1
      CurrencyType: 2
      CurrencyNum: 1
      NoAdsCurrencyType: 0
      NoAdsCurrencyNum: 600
      Rate: 3
  - UnlockCurrency: 1
    UnlockNum: 40
    NoAdsUnlockCurrency: 1
    NoAdsUnlockNum: 40
    SlotInfor:
    - ItemIcon: {fileID: 21300000, guid: ce8a6c5486cf25948acd7ddd3796df13, type: 3}
      ItemType: 12
      ItemExtendId: 0
      ItemNum: 5
      CurrencyType: 0
      CurrencyNum: 500
      NoAdsCurrencyType: 0
      NoAdsCurrencyNum: 500
      Rate: 3
    - ItemIcon: {fileID: 21300000, guid: da06efdb0e627ea4fb983024e04ee3e9, type: 3}
      ItemType: 12
      ItemExtendId: 1
      ItemNum: 5
      CurrencyType: 0
      CurrencyNum: 1000
      NoAdsCurrencyType: 0
      NoAdsCurrencyNum: 1000
      Rate: 3
    - ItemIcon: {fileID: 21300000, guid: 641de733afe99574f8ea4b1bd8d7407a, type: 3}
      ItemType: 12
      ItemExtendId: 2
      ItemNum: 5
      CurrencyType: 0
      CurrencyNum: 1500
      NoAdsCurrencyType: 0
      NoAdsCurrencyNum: 1500
      Rate: 5
    - ItemIcon: {fileID: 21300000, guid: 62df481928fbab647b8b540b4099a921, type: 3}
      ItemType: 12
      ItemExtendId: 3
      ItemNum: 3
      CurrencyType: 2
      CurrencyNum: 3
      NoAdsCurrencyType: 0
      NoAdsCurrencyNum: 1800
      Rate: 19
    - ItemIcon: {fileID: 21300000, guid: 5145fb36e641bd94ab25e984b43e7304, type: 3}
      ItemType: 12
      ItemExtendId: 4
      ItemNum: 3
      CurrencyType: 2
      CurrencyNum: 3
      NoAdsCurrencyType: 0
      NoAdsCurrencyNum: 1800
      Rate: 19
    - ItemIcon: {fileID: 21300000, guid: 61bce71fe2e435e4c9a7fde2f41f318e, type: 3}
      ItemType: 12
      ItemExtendId: 5
      ItemNum: 1
      CurrencyType: 2
      CurrencyNum: 1
      NoAdsCurrencyType: 0
      NoAdsCurrencyNum: 600
      Rate: 7
    - ItemIcon: {fileID: 21300000, guid: 63cc2f105ade2464bab15a21060d172e, type: 3}
      ItemType: 12
      ItemExtendId: 6
      ItemNum: 1
      CurrencyType: 2
      CurrencyNum: 1
      NoAdsCurrencyType: 0
      NoAdsCurrencyNum: 600
      Rate: 7
    - ItemIcon: {fileID: 21300000, guid: 3fb8034ac6be7784b86ffb4954f4744f, type: 3}
      ItemType: 13
      ItemExtendId: 0
      ItemNum: 5
      CurrencyType: 0
      CurrencyNum: 350
      NoAdsCurrencyType: 0
      NoAdsCurrencyNum: 350
      Rate: 6
    - ItemIcon: {fileID: 21300000, guid: af74d2dc4a9e6d74398a8df001f2cd80, type: 3}
      ItemType: 13
      ItemExtendId: 1
      ItemNum: 5
      CurrencyType: 0
      CurrencyNum: 600
      NoAdsCurrencyType: 0
      NoAdsCurrencyNum: 600
      Rate: 6
    - ItemIcon: {fileID: 21300000, guid: 59c4ee9aea754034b9e115b168a5edb5, type: 3}
      ItemType: 13
      ItemExtendId: 2
      ItemNum: 5
      CurrencyType: 0
      CurrencyNum: 750
      NoAdsCurrencyType: 0
      NoAdsCurrencyNum: 750
      Rate: 9
    - ItemIcon: {fileID: 21300000, guid: ba3b530a033053d419add10d1485ba6f, type: 3}
      ItemType: 13
      ItemExtendId: 3
      ItemNum: 3
      CurrencyType: 2
      CurrencyNum: 3
      NoAdsCurrencyType: 0
      NoAdsCurrencyNum: 1800
      Rate: 5
    - ItemIcon: {fileID: 21300000, guid: ab1e1b871e466c04a800c5d5cb92520f, type: 3}
      ItemType: 13
      ItemExtendId: 4
      ItemNum: 3
      CurrencyType: 2
      CurrencyNum: 3
      NoAdsCurrencyType: 0
      NoAdsCurrencyNum: 1800
      Rate: 5
    - ItemIcon: {fileID: 21300000, guid: e55ab6958416bc04ab3ef7b96cab4aac, type: 3}
      ItemType: 12
      ItemExtendId: 7
      ItemNum: 1
      CurrencyType: 2
      CurrencyNum: 1
      NoAdsCurrencyType: 0
      NoAdsCurrencyNum: 600
      Rate: 3
    - ItemIcon: {fileID: 21300000, guid: 4e679bb4e922ffd4d91339a8324bb454, type: 3}
      ItemType: 13
      ItemExtendId: 5
      ItemNum: 1
      CurrencyType: 2
      CurrencyNum: 1
      NoAdsCurrencyType: 0
      NoAdsCurrencyNum: 600
      Rate: 3
  - UnlockCurrency: 1
    UnlockNum: 45
    NoAdsUnlockCurrency: 1
    NoAdsUnlockNum: 45
    SlotInfor:
    - ItemIcon: {fileID: 21300000, guid: ce8a6c5486cf25948acd7ddd3796df13, type: 3}
      ItemType: 12
      ItemExtendId: 0
      ItemNum: 5
      CurrencyType: 0
      CurrencyNum: 500
      NoAdsCurrencyType: 0
      NoAdsCurrencyNum: 500
      Rate: 3
    - ItemIcon: {fileID: 21300000, guid: da06efdb0e627ea4fb983024e04ee3e9, type: 3}
      ItemType: 12
      ItemExtendId: 1
      ItemNum: 5
      CurrencyType: 0
      CurrencyNum: 1000
      NoAdsCurrencyType: 0
      NoAdsCurrencyNum: 1000
      Rate: 3
    - ItemIcon: {fileID: 21300000, guid: 641de733afe99574f8ea4b1bd8d7407a, type: 3}
      ItemType: 12
      ItemExtendId: 2
      ItemNum: 5
      CurrencyType: 0
      CurrencyNum: 1500
      NoAdsCurrencyType: 0
      NoAdsCurrencyNum: 1500
      Rate: 5
    - ItemIcon: {fileID: 21300000, guid: 62df481928fbab647b8b540b4099a921, type: 3}
      ItemType: 12
      ItemExtendId: 3
      ItemNum: 3
      CurrencyType: 2
      CurrencyNum: 3
      NoAdsCurrencyType: 0
      NoAdsCurrencyNum: 1800
      Rate: 19
    - ItemIcon: {fileID: 21300000, guid: 5145fb36e641bd94ab25e984b43e7304, type: 3}
      ItemType: 12
      ItemExtendId: 4
      ItemNum: 3
      CurrencyType: 2
      CurrencyNum: 3
      NoAdsCurrencyType: 0
      NoAdsCurrencyNum: 1800
      Rate: 19
    - ItemIcon: {fileID: 21300000, guid: 61bce71fe2e435e4c9a7fde2f41f318e, type: 3}
      ItemType: 12
      ItemExtendId: 5
      ItemNum: 1
      CurrencyType: 2
      CurrencyNum: 1
      NoAdsCurrencyType: 0
      NoAdsCurrencyNum: 600
      Rate: 7
    - ItemIcon: {fileID: 21300000, guid: 63cc2f105ade2464bab15a21060d172e, type: 3}
      ItemType: 12
      ItemExtendId: 6
      ItemNum: 1
      CurrencyType: 2
      CurrencyNum: 1
      NoAdsCurrencyType: 0
      NoAdsCurrencyNum: 600
      Rate: 7
    - ItemIcon: {fileID: 21300000, guid: 3fb8034ac6be7784b86ffb4954f4744f, type: 3}
      ItemType: 13
      ItemExtendId: 0
      ItemNum: 5
      CurrencyType: 0
      CurrencyNum: 350
      NoAdsCurrencyType: 0
      NoAdsCurrencyNum: 350
      Rate: 6
    - ItemIcon: {fileID: 21300000, guid: af74d2dc4a9e6d74398a8df001f2cd80, type: 3}
      ItemType: 13
      ItemExtendId: 1
      ItemNum: 5
      CurrencyType: 0
      CurrencyNum: 600
      NoAdsCurrencyType: 0
      NoAdsCurrencyNum: 600
      Rate: 6
    - ItemIcon: {fileID: 21300000, guid: 59c4ee9aea754034b9e115b168a5edb5, type: 3}
      ItemType: 13
      ItemExtendId: 2
      ItemNum: 5
      CurrencyType: 0
      CurrencyNum: 750
      NoAdsCurrencyType: 0
      NoAdsCurrencyNum: 750
      Rate: 9
    - ItemIcon: {fileID: 21300000, guid: ba3b530a033053d419add10d1485ba6f, type: 3}
      ItemType: 13
      ItemExtendId: 3
      ItemNum: 3
      CurrencyType: 2
      CurrencyNum: 3
      NoAdsCurrencyType: 0
      NoAdsCurrencyNum: 1800
      Rate: 5
    - ItemIcon: {fileID: 21300000, guid: ab1e1b871e466c04a800c5d5cb92520f, type: 3}
      ItemType: 13
      ItemExtendId: 4
      ItemNum: 3
      CurrencyType: 2
      CurrencyNum: 3
      NoAdsCurrencyType: 0
      NoAdsCurrencyNum: 1800
      Rate: 5
    - ItemIcon: {fileID: 21300000, guid: e55ab6958416bc04ab3ef7b96cab4aac, type: 3}
      ItemType: 12
      ItemExtendId: 7
      ItemNum: 1
      CurrencyType: 2
      CurrencyNum: 1
      NoAdsCurrencyType: 0
      NoAdsCurrencyNum: 600
      Rate: 3
    - ItemIcon: {fileID: 21300000, guid: 4e679bb4e922ffd4d91339a8324bb454, type: 3}
      ItemType: 13
      ItemExtendId: 5
      ItemNum: 1
      CurrencyType: 2
      CurrencyNum: 1
      NoAdsCurrencyType: 0
      NoAdsCurrencyNum: 600
      Rate: 3
