%YAML 1.1
%TAG !u! tag:unity3d.com,2011:
--- !u!114 &11400000
MonoBehaviour:
  m_ObjectHideFlags: 0
  m_CorrespondingSourceObject: {fileID: 0}
  m_PrefabInstance: {fileID: 0}
  m_PrefabAsset: {fileID: 0}
  m_GameObject: {fileID: 0}
  m_Enabled: 1
  m_EditorHideFlags: 0
  m_Script: {fileID: 11500000, guid: bf5d7ed2671cf0d4b825cab5b09dbcb8, type: 3}
  m_Name: Level 44
  m_EditorClassIdentifier: 
  FuelCost: 4
  CoinReward: 4450
  ReFightCoinReward: 2225
  CombatPower: 39571
  EvolveShipNum: 6
  EvolveShipId: 0
  EvolveDroneNum: 6
  EvolveDroneId: 3
  Waves:
  - WaveType: 0
    FireRate: 1
    Hp: 1
    Items:
      List:
      - Type: 1
        Num: 3
      NumEnemiesCanHaveItem: 10
    HasPower: 0
    NoDam: 0
    IsTeam: 1
    DestroyOnFinish: 0
    IdleType: 4
    TimeMove: 1
    Ease: 0
    Paths:
    - DelayTime: 0
      Distance: 0.3
      MoveSpeed: 10
      Index: 4
      Offset: {x: 0, y: 0}
      FlipX: 0
      FlipY: 0
      Cells:
      - Row: 0
        Coll: 2
      - Row: 1
        Coll: 2
      - Row: 2
        Coll: 2
      - Row: 1
        Coll: 1
      - Row: 2
        Coll: 1
      - Row: 3
        Coll: 1
      - Row: 4
        Coll: 1
      - Row: 2
        Coll: 0
      - Row: 3
        Coll: 0
      - Row: 4
        Coll: 0
    - DelayTime: 0
      Distance: 0.3
      MoveSpeed: 10
      Index: 4
      Offset: {x: 0, y: 0}
      FlipX: 1
      FlipY: 0
      Cells:
      - Row: 0
        Coll: 4
      - Row: 1
        Coll: 4
      - Row: 2
        Coll: 4
      - Row: 1
        Coll: 5
      - Row: 2
        Coll: 5
      - Row: 3
        Coll: 5
      - Row: 4
        Coll: 5
      - Row: 2
        Coll: 6
      - Row: 3
        Coll: 6
      - Row: 4
        Coll: 6
    - DelayTime: 0
      Distance: 0.3
      MoveSpeed: 8
      Index: 7
      Offset: {x: 0, y: 0}
      FlipX: 0
      FlipY: 0
      Cells:
      - Row: 2
        Coll: 3
    - DelayTime: 0
      Distance: 0.3
      MoveSpeed: 8
      Index: 7
      Offset: {x: 0, y: 0}
      FlipX: 0
      FlipY: 0
      Cells:
      - Row: 3
        Coll: 3
    - DelayTime: 0
      Distance: 0.3
      MoveSpeed: 8
      Index: 7
      Offset: {x: 0, y: 0}
      FlipX: 0
      FlipY: 0
      Cells:
      - Row: 4
        Coll: 3
    - DelayTime: 0
      Distance: 0.3
      MoveSpeed: 8
      Index: 7
      Offset: {x: 0, y: 0}
      FlipX: 0
      FlipY: 0
      Cells:
      - Row: 3
        Coll: 2
    - DelayTime: 0
      Distance: 0.3
      MoveSpeed: 8
      Index: 7
      Offset: {x: 0, y: 0}
      FlipX: 0
      FlipY: 0
      Cells:
      - Row: 4
        Coll: 2
    - DelayTime: 0
      Distance: 0.3
      MoveSpeed: 8
      Index: 7
      Offset: {x: 0, y: 0}
      FlipX: 0
      FlipY: 0
      Cells:
      - Row: 5
        Coll: 2
    - DelayTime: 0
      Distance: 0.3
      MoveSpeed: 8
      Index: 7
      Offset: {x: 0, y: 0}
      FlipX: 0
      FlipY: 0
      Cells:
      - Row: 6
        Coll: 2
    - DelayTime: 0
      Distance: 0.3
      MoveSpeed: 8
      Index: 7
      Offset: {x: 0, y: 0}
      FlipX: 0
      FlipY: 0
      Cells:
      - Row: 3
        Coll: 4
    - DelayTime: 0
      Distance: 0.3
      MoveSpeed: 8
      Index: 7
      Offset: {x: 0, y: 0}
      FlipX: 0
      FlipY: 0
      Cells:
      - Row: 4
        Coll: 4
    - DelayTime: 0
      Distance: 0.3
      MoveSpeed: 8
      Index: 7
      Offset: {x: 0, y: 0}
      FlipX: 0
      FlipY: 0
      Cells:
      - Row: 5
        Coll: 4
    - DelayTime: 0
      Distance: 0.3
      MoveSpeed: 5
      Index: 7
      Offset: {x: 0, y: 0}
      FlipX: 0
      FlipY: 0
      Cells:
      - Row: 6
        Coll: 4
    Enemies:
    - Rows:
      - EnemyId: -1
        PathId: 0
      - EnemyId: -1
        PathId: 0
      - EnemyId: 27
        PathId: 0
      - EnemyId: -1
        PathId: 0
      - EnemyId: 27
        PathId: 0
      - EnemyId: -1
        PathId: 0
      - EnemyId: -1
        PathId: 0
    - Rows:
      - EnemyId: -1
        PathId: 0
      - EnemyId: 25
        PathId: 0
      - EnemyId: 25
        PathId: 0
      - EnemyId: -1
        PathId: 0
      - EnemyId: 25
        PathId: 0
      - EnemyId: 25
        PathId: 0
      - EnemyId: -1
        PathId: 0
    - Rows:
      - EnemyId: 27
        PathId: 0
      - EnemyId: 15
        PathId: 0
      - EnemyId: 15
        PathId: 0
      - EnemyId: 26
        PathId: 0
      - EnemyId: 15
        PathId: 0
      - EnemyId: 15
        PathId: 0
      - EnemyId: 27
        PathId: 0
    - Rows:
      - EnemyId: 27
        PathId: 0
      - EnemyId: 15
        PathId: 0
      - EnemyId: 15
        PathId: 0
      - EnemyId: 25
        PathId: 0
      - EnemyId: 15
        PathId: 0
      - EnemyId: 15
        PathId: 0
      - EnemyId: 27
        PathId: 0
    - Rows:
      - EnemyId: 27
        PathId: 0
      - EnemyId: 27
        PathId: 0
      - EnemyId: 27
        PathId: 0
      - EnemyId: 27
        PathId: 0
      - EnemyId: 27
        PathId: 0
      - EnemyId: 27
        PathId: 0
      - EnemyId: 27
        PathId: 0
    - Rows:
      - EnemyId: -1
        PathId: 0
      - EnemyId: -1
        PathId: 0
      - EnemyId: 19
        PathId: 0
      - EnemyId: -1
        PathId: 0
      - EnemyId: 19
        PathId: 0
      - EnemyId: -1
        PathId: 0
      - EnemyId: -1
        PathId: 0
    - Rows:
      - EnemyId: -1
        PathId: 0
      - EnemyId: -1
        PathId: 0
      - EnemyId: 19
        PathId: 0
      - EnemyId: -1
        PathId: 0
      - EnemyId: 19
        PathId: 0
      - EnemyId: -1
        PathId: 0
      - EnemyId: -1
        PathId: 0
    GiftBox:
      NumGiftBox: 0
      Duration: 0
      Speed: 0
    NumEnemyAttack: 4
    SpeedMoveAttack: 5
    DistanceTimeAttack: 0.3
    LoopTimeAttack: 2
    CombatDiff:
      TimeFireRate: 0
      FireRateDecrease: 0
      TimeEnemyAttack: 0
      EnemyAttackDecease: 0
      IsIncreaseNumberFire: 0
      TimeIncreaseNumberFire: 0
    Boss:
      BossIndex: 1
      Hps: []
    Rock:
      StartPosition: {x: 0, y: 0, z: 0}
      EndPosition: {x: 0, y: 0, z: 0}
      Range: 3
      Speed: 3
      NumSmall: 0
      NumNormal: 0
      NumBig: 0
      Duration: 5
    UseWarning: 0
    WarningPositions: []
    IsShow: 1
  - WaveType: 0
    FireRate: 1
    Hp: 1
    Items:
      List:
      - Type: 0
        Num: 1
      - Type: 1
        Num: 2
      NumEnemiesCanHaveItem: 6
    HasPower: 0
    NoDam: 0
    IsTeam: 1
    DestroyOnFinish: 0
    IdleType: 1
    TimeMove: 1
    Ease: 0
    Paths:
    - DelayTime: 0
      Distance: 0.3
      MoveSpeed: 10
      Index: 32
      Offset: {x: 0, y: 0}
      FlipX: 0
      FlipY: 0
      Cells:
      - Row: 5
        Coll: 5
      - Row: 4
        Coll: 5
      - Row: 3
        Coll: 5
      - Row: 2
        Coll: 5
      - Row: 1
        Coll: 5
      - Row: 0
        Coll: 5
      - Row: 0
        Coll: 6
      - Row: 1
        Coll: 6
      - Row: 2
        Coll: 6
      - Row: 3
        Coll: 6
      - Row: 4
        Coll: 6
      - Row: 5
        Coll: 6
      - Row: 6
        Coll: 6
    - DelayTime: 0
      Distance: 0.3
      MoveSpeed: 10
      Index: 32
      Offset: {x: 0, y: 0}
      FlipX: 1
      FlipY: 0
      Cells:
      - Row: 5
        Coll: 1
      - Row: 4
        Coll: 1
      - Row: 3
        Coll: 1
      - Row: 2
        Coll: 1
      - Row: 1
        Coll: 1
      - Row: 0
        Coll: 1
      - Row: 0
        Coll: 0
      - Row: 1
        Coll: 0
      - Row: 2
        Coll: 0
      - Row: 3
        Coll: 0
      - Row: 4
        Coll: 0
      - Row: 5
        Coll: 0
      - Row: 6
        Coll: 0
    - DelayTime: 0
      Distance: 0.3
      MoveSpeed: 8
      Index: 15
      Offset: {x: 0, y: 0}
      FlipX: 0
      FlipY: 0
      Cells:
      - Row: 0
        Coll: 4
    - DelayTime: 3
      Distance: 0.3
      MoveSpeed: 8
      Index: 15
      Offset: {x: 0, y: 0}
      FlipX: 0
      FlipY: 0
      Cells:
      - Row: 1
        Coll: 4
    - DelayTime: 3
      Distance: 0.3
      MoveSpeed: 8
      Index: 15
      Offset: {x: 0, y: 0}
      FlipX: 0
      FlipY: 0
      Cells:
      - Row: 2
        Coll: 4
    - DelayTime: 3
      Distance: 0.3
      MoveSpeed: 8
      Index: 15
      Offset: {x: 0, y: 0}
      FlipX: 0
      FlipY: 0
      Cells:
      - Row: 3
        Coll: 4
    - DelayTime: 3
      Distance: 0.3
      MoveSpeed: 8
      Index: 15
      Offset: {x: 0, y: 0}
      FlipX: 0
      FlipY: 0
      Cells:
      - Row: 4
        Coll: 4
    - DelayTime: 3
      Distance: 0.3
      MoveSpeed: 8
      Index: 15
      Offset: {x: 0, y: 0}
      FlipX: 1
      FlipY: 0
      Cells:
      - Row: 0
        Coll: 2
    - DelayTime: 3
      Distance: 0.3
      MoveSpeed: 8
      Index: 15
      Offset: {x: 0, y: 0}
      FlipX: 1
      FlipY: 0
      Cells:
      - Row: 1
        Coll: 2
    - DelayTime: 3
      Distance: 0.3
      MoveSpeed: 8
      Index: 15
      Offset: {x: 0, y: 0}
      FlipX: 1
      FlipY: 0
      Cells:
      - Row: 2
        Coll: 2
    - DelayTime: 3
      Distance: 0.3
      MoveSpeed: 8
      Index: 15
      Offset: {x: 0, y: 0}
      FlipX: 1
      FlipY: 0
      Cells:
      - Row: 3
        Coll: 2
    - DelayTime: 3
      Distance: 0.3
      MoveSpeed: 8
      Index: 15
      Offset: {x: 0, y: 0}
      FlipX: 1
      FlipY: 0
      Cells:
      - Row: 4
        Coll: 2
    Enemies:
    - Rows:
      - EnemyId: 11
        PathId: 0
      - EnemyId: 25
        PathId: 0
      - EnemyId: 8
        PathId: 0
      - EnemyId: -1
        PathId: 0
      - EnemyId: 8
        PathId: 0
      - EnemyId: 25
        PathId: 0
      - EnemyId: 11
        PathId: 0
    - Rows:
      - EnemyId: 22
        PathId: 0
      - EnemyId: 15
        PathId: 0
      - EnemyId: 8
        PathId: 0
      - EnemyId: -1
        PathId: 0
      - EnemyId: 8
        PathId: 0
      - EnemyId: 15
        PathId: 0
      - EnemyId: 22
        PathId: 0
    - Rows:
      - EnemyId: 22
        PathId: 0
      - EnemyId: 25
        PathId: 0
      - EnemyId: 26
        PathId: 0
      - EnemyId: -1
        PathId: 0
      - EnemyId: 26
        PathId: 0
      - EnemyId: 25
        PathId: 0
      - EnemyId: 22
        PathId: 0
    - Rows:
      - EnemyId: 27
        PathId: 0
      - EnemyId: 15
        PathId: 0
      - EnemyId: 26
        PathId: 0
      - EnemyId: -1
        PathId: 0
      - EnemyId: 26
        PathId: 0
      - EnemyId: 15
        PathId: 0
      - EnemyId: 27
        PathId: 0
    - Rows:
      - EnemyId: 27
        PathId: 0
      - EnemyId: 25
        PathId: 0
      - EnemyId: 26
        PathId: 0
      - EnemyId: -1
        PathId: 0
      - EnemyId: 26
        PathId: 0
      - EnemyId: 25
        PathId: 0
      - EnemyId: 27
        PathId: 0
    - Rows:
      - EnemyId: 27
        PathId: 0
      - EnemyId: 15
        PathId: 0
      - EnemyId: -1
        PathId: 0
      - EnemyId: -1
        PathId: 0
      - EnemyId: -1
        PathId: 0
      - EnemyId: 15
        PathId: 0
      - EnemyId: 27
        PathId: 0
    - Rows:
      - EnemyId: 27
        PathId: 0
      - EnemyId: -1
        PathId: 0
      - EnemyId: -1
        PathId: 0
      - EnemyId: -1
        PathId: 0
      - EnemyId: -1
        PathId: 0
      - EnemyId: -1
        PathId: 0
      - EnemyId: 27
        PathId: 0
    GiftBox:
      NumGiftBox: 0
      Duration: 0
      Speed: 0
    NumEnemyAttack: 4
    SpeedMoveAttack: 5
    DistanceTimeAttack: 0.3
    LoopTimeAttack: 2
    CombatDiff:
      TimeFireRate: 0
      FireRateDecrease: 0
      TimeEnemyAttack: 5
      EnemyAttackDecease: 0.1
      IsIncreaseNumberFire: 0
      TimeIncreaseNumberFire: 0
    Boss:
      BossIndex: 1
      Hps: []
    Rock:
      StartPosition: {x: 0, y: 0, z: 0}
      EndPosition: {x: 0, y: 0, z: 0}
      Range: 3
      Speed: 3
      NumSmall: 0
      NumNormal: 0
      NumBig: 0
      Duration: 5
    UseWarning: 0
    WarningPositions: []
    IsShow: 1
  - WaveType: 0
    FireRate: 1
    Hp: 1
    Items:
      List:
      - Type: 1
        Num: 3
      NumEnemiesCanHaveItem: 10
    HasPower: 0
    NoDam: 0
    IsTeam: 1
    DestroyOnFinish: 0
    IdleType: 2
    TimeMove: 1
    Ease: 0
    Paths:
    - DelayTime: 0
      Distance: 0.3
      MoveSpeed: 8
      Index: 14
      Offset: {x: 0, y: 0}
      FlipX: 0
      FlipY: 0
      Cells:
      - Row: 0
        Coll: 6
    - DelayTime: 0
      Distance: 0.3
      MoveSpeed: 8
      Index: 14
      Offset: {x: 0, y: 0}
      FlipX: 0
      FlipY: 0
      Cells:
      - Row: 0
        Coll: 5
    - DelayTime: 0
      Distance: 0.3
      MoveSpeed: 8
      Index: 14
      Offset: {x: 0, y: 0}
      FlipX: 0
      FlipY: 0
      Cells:
      - Row: 1
        Coll: 5
    - DelayTime: 0
      Distance: 0.3
      MoveSpeed: 8
      Index: 14
      Offset: {x: 0, y: 0}
      FlipX: 0
      FlipY: 0
      Cells:
      - Row: 2
        Coll: 5
    - DelayTime: 0
      Distance: 0.3
      MoveSpeed: 8
      Index: 14
      Offset: {x: 0, y: 0}
      FlipX: 0
      FlipY: 0
      Cells:
      - Row: 1
        Coll: 4
    - DelayTime: 0
      Distance: 0.3
      MoveSpeed: 8
      Index: 14
      Offset: {x: 0, y: 0}
      FlipX: 0
      FlipY: 0
      Cells:
      - Row: 2
        Coll: 4
    - DelayTime: 0
      Distance: 0.3
      MoveSpeed: 8
      Index: 14
      Offset: {x: 0, y: 0}
      FlipX: 1
      FlipY: 0
      Cells:
      - Row: 1
        Coll: 3
    - DelayTime: 0
      Distance: 0.3
      MoveSpeed: 8
      Index: 14
      Offset: {x: 0, y: 0}
      FlipX: 1
      FlipY: 0
      Cells:
      - Row: 2
        Coll: 3
    - DelayTime: 0
      Distance: 0.3
      MoveSpeed: 8
      Index: 14
      Offset: {x: 0, y: 0}
      FlipX: 1
      FlipY: 0
      Cells:
      - Row: 1
        Coll: 2
    - DelayTime: 0
      Distance: 0.3
      MoveSpeed: 8
      Index: 14
      Offset: {x: 0, y: 0}
      FlipX: 1
      FlipY: 0
      Cells:
      - Row: 2
        Coll: 2
    - DelayTime: 0
      Distance: 0.3
      MoveSpeed: 8
      Index: 14
      Offset: {x: 0, y: 0}
      FlipX: 1
      FlipY: 0
      Cells:
      - Row: 1
        Coll: 1
    - DelayTime: 0
      Distance: 0.3
      MoveSpeed: 8
      Index: 14
      Offset: {x: 0, y: 0}
      FlipX: 1
      FlipY: 0
      Cells:
      - Row: 2
        Coll: 1
    - DelayTime: 0
      Distance: 0.3
      MoveSpeed: 8
      Index: 14
      Offset: {x: 0, y: 0}
      FlipX: 1
      FlipY: 0
      Cells:
      - Row: 0
        Coll: 1
    - DelayTime: 0
      Distance: 0.3
      MoveSpeed: 8
      Index: 14
      Offset: {x: 0, y: 0}
      FlipX: 1
      FlipY: 0
      Cells:
      - Row: 0
        Coll: 0
    - DelayTime: 0
      Distance: 0.3
      MoveSpeed: 8
      Index: 0
      Offset: {x: 0, y: 0}
      FlipX: 0
      FlipY: 0
      Cells:
      - Row: 3
        Coll: 1
    - DelayTime: 0
      Distance: 0.3
      MoveSpeed: 8
      Index: 0
      Offset: {x: 0, y: 0}
      FlipX: 0
      FlipY: 0
      Cells:
      - Row: 3
        Coll: 2
    - DelayTime: 0
      Distance: 0.3
      MoveSpeed: 8
      Index: 0
      Offset: {x: 0, y: 0}
      FlipX: 0
      FlipY: 0
      Cells:
      - Row: 4
        Coll: 1
    - DelayTime: 0
      Distance: 0.3
      MoveSpeed: 8
      Index: 0
      Offset: {x: 0, y: 0}
      FlipX: 0
      FlipY: 0
      Cells:
      - Row: 4
        Coll: 2
    - DelayTime: 0
      Distance: 0.3
      MoveSpeed: 8
      Index: 0
      Offset: {x: 0, y: 0}
      FlipX: 0
      FlipY: 0
      Cells:
      - Row: 5
        Coll: 0
    - DelayTime: 0
      Distance: 0.3
      MoveSpeed: 8
      Index: 0
      Offset: {x: 0, y: 0}
      FlipX: 0
      FlipY: 0
      Cells:
      - Row: 5
        Coll: 1
    - DelayTime: 0
      Distance: 0.3
      MoveSpeed: 8
      Index: 0
      Offset: {x: 0, y: 0}
      FlipX: 1
      FlipY: 0
      Cells:
      - Row: 3
        Coll: 3
    - DelayTime: 0
      Distance: 0.3
      MoveSpeed: 8
      Index: 0
      Offset: {x: 0, y: 0}
      FlipX: 1
      FlipY: 0
      Cells:
      - Row: 3
        Coll: 4
    - DelayTime: 0
      Distance: 0.3
      MoveSpeed: 8
      Index: 0
      Offset: {x: 0, y: 0}
      FlipX: 1
      FlipY: 0
      Cells:
      - Row: 3
        Coll: 5
    - DelayTime: 0
      Distance: 0.3
      MoveSpeed: 8
      Index: 0
      Offset: {x: 0, y: 0}
      FlipX: 1
      FlipY: 0
      Cells:
      - Row: 4
        Coll: 3
    - DelayTime: 0
      Distance: 0.3
      MoveSpeed: 8
      Index: 0
      Offset: {x: 0, y: 0}
      FlipX: 1
      FlipY: 0
      Cells:
      - Row: 4
        Coll: 4
    - DelayTime: 0
      Distance: 0.3
      MoveSpeed: 8
      Index: 0
      Offset: {x: 0, y: 0}
      FlipX: 1
      FlipY: 0
      Cells:
      - Row: 4
        Coll: 5
    - DelayTime: 0
      Distance: 0.3
      MoveSpeed: 8
      Index: 0
      Offset: {x: 0, y: 0}
      FlipX: 1
      FlipY: 0
      Cells:
      - Row: 5
        Coll: 5
    - DelayTime: 0
      Distance: 0.3
      MoveSpeed: 8
      Index: 0
      Offset: {x: 0, y: 0}
      FlipX: 1
      FlipY: 0
      Cells:
      - Row: 5
        Coll: 6
    Enemies:
    - Rows:
      - EnemyId: 22
        PathId: 0
      - EnemyId: 22
        PathId: 0
      - EnemyId: -1
        PathId: 0
      - EnemyId: -1
        PathId: 0
      - EnemyId: -1
        PathId: 0
      - EnemyId: 22
        PathId: 0
      - EnemyId: 22
        PathId: 0
    - Rows:
      - EnemyId: -1
        PathId: 0
      - EnemyId: 27
        PathId: 0
      - EnemyId: 25
        PathId: 0
      - EnemyId: 15
        PathId: 0
      - EnemyId: 25
        PathId: 0
      - EnemyId: 27
        PathId: 0
      - EnemyId: -1
        PathId: 0
    - Rows:
      - EnemyId: -1
        PathId: 0
      - EnemyId: 15
        PathId: 0
      - EnemyId: 26
        PathId: 0
      - EnemyId: 26
        PathId: 0
      - EnemyId: 26
        PathId: 0
      - EnemyId: 15
        PathId: 0
      - EnemyId: -1
        PathId: 0
    - Rows:
      - EnemyId: -1
        PathId: 0
      - EnemyId: 15
        PathId: 0
      - EnemyId: 26
        PathId: 0
      - EnemyId: 26
        PathId: 0
      - EnemyId: 26
        PathId: 0
      - EnemyId: 15
        PathId: 0
      - EnemyId: -1
        PathId: 0
    - Rows:
      - EnemyId: -1
        PathId: 0
      - EnemyId: 27
        PathId: 0
      - EnemyId: 25
        PathId: 0
      - EnemyId: 15
        PathId: 0
      - EnemyId: 25
        PathId: 0
      - EnemyId: 27
        PathId: 0
      - EnemyId: -1
        PathId: 0
    - Rows:
      - EnemyId: 22
        PathId: 0
      - EnemyId: 22
        PathId: 0
      - EnemyId: -1
        PathId: 0
      - EnemyId: -1
        PathId: 0
      - EnemyId: -1
        PathId: 0
      - EnemyId: 22
        PathId: 0
      - EnemyId: 22
        PathId: 0
    - Rows:
      - EnemyId: -1
        PathId: 0
      - EnemyId: -1
        PathId: 0
      - EnemyId: -1
        PathId: 0
      - EnemyId: -1
        PathId: 0
      - EnemyId: -1
        PathId: 0
      - EnemyId: -1
        PathId: 0
      - EnemyId: -1
        PathId: 0
    GiftBox:
      NumGiftBox: 0
      Duration: 0
      Speed: 0
    NumEnemyAttack: 1
    SpeedMoveAttack: 5
    DistanceTimeAttack: 0.3
    LoopTimeAttack: 2
    CombatDiff:
      TimeFireRate: 5
      FireRateDecrease: 0.1
      TimeEnemyAttack: 5
      EnemyAttackDecease: 0.1
      IsIncreaseNumberFire: 0
      TimeIncreaseNumberFire: 0
    Boss:
      BossIndex: 1
      Hps: []
    Rock:
      StartPosition: {x: 0, y: 0, z: 0}
      EndPosition: {x: 0, y: 0, z: 0}
      Range: 3
      Speed: 3
      NumSmall: 0
      NumNormal: 0
      NumBig: 0
      Duration: 5
    UseWarning: 0
    WarningPositions: []
    IsShow: 1
  - WaveType: 0
    FireRate: 1
    Hp: 1
    Items:
      List:
      - Type: 0
        Num: 1
      - Type: 1
        Num: 2
      NumEnemiesCanHaveItem: 6
    HasPower: 0
    NoDam: 0
    IsTeam: 0
    DestroyOnFinish: 1
    IdleType: 0
    TimeMove: 1
    Ease: 0
    Paths:
    - DelayTime: 0
      Distance: 0.3
      MoveSpeed: 8
      Index: 28
      Offset: {x: 0, y: 0}
      FlipX: 0
      FlipY: 0
      Cells:
      - Row: 0
        Coll: 0
      - Row: 1
        Coll: 0
      - Row: 2
        Coll: 0
      - Row: 3
        Coll: 0
      - Row: 4
        Coll: 0
      - Row: 5
        Coll: 0
      - Row: 6
        Coll: 0
    - DelayTime: 5
      Distance: 0.3
      MoveSpeed: 8
      Index: 34
      Offset: {x: 0, y: 0}
      FlipX: 1
      FlipY: 0
      Cells:
      - Row: 0
        Coll: 6
      - Row: 1
        Coll: 6
      - Row: 2
        Coll: 6
      - Row: 3
        Coll: 6
      - Row: 4
        Coll: 6
      - Row: 5
        Coll: 6
      - Row: 6
        Coll: 6
    - DelayTime: 10
      Distance: 0.3
      MoveSpeed: 8
      Index: 57
      Offset: {x: 0, y: 0}
      FlipX: 1
      FlipY: 0
      Cells:
      - Row: 0
        Coll: 2
      - Row: 1
        Coll: 2
      - Row: 2
        Coll: 2
      - Row: 3
        Coll: 2
      - Row: 4
        Coll: 2
      - Row: 5
        Coll: 2
      - Row: 6
        Coll: 2
    - DelayTime: 15
      Distance: 0.3
      MoveSpeed: 8
      Index: 82
      Offset: {x: 0, y: 0}
      FlipX: 1
      FlipY: 0
      Cells:
      - Row: 0
        Coll: 4
      - Row: 1
        Coll: 4
      - Row: 2
        Coll: 4
      - Row: 3
        Coll: 4
      - Row: 4
        Coll: 4
      - Row: 5
        Coll: 4
      - Row: 6
        Coll: 4
    Enemies:
    - Rows:
      - EnemyId: 26
        PathId: 0
      - EnemyId: -1
        PathId: 0
      - EnemyId: 26
        PathId: 0
      - EnemyId: -1
        PathId: 0
      - EnemyId: 26
        PathId: 0
      - EnemyId: -1
        PathId: 0
      - EnemyId: 26
        PathId: 0
    - Rows:
      - EnemyId: 22
        PathId: 0
      - EnemyId: -1
        PathId: 0
      - EnemyId: 15
        PathId: 0
      - EnemyId: -1
        PathId: 0
      - EnemyId: 27
        PathId: 0
      - EnemyId: -1
        PathId: 0
      - EnemyId: 19
        PathId: 0
    - Rows:
      - EnemyId: 26
        PathId: 0
      - EnemyId: -1
        PathId: 0
      - EnemyId: 26
        PathId: 0
      - EnemyId: -1
        PathId: 0
      - EnemyId: 26
        PathId: 0
      - EnemyId: -1
        PathId: 0
      - EnemyId: 26
        PathId: 0
    - Rows:
      - EnemyId: 22
        PathId: 0
      - EnemyId: -1
        PathId: 0
      - EnemyId: 15
        PathId: 0
      - EnemyId: -1
        PathId: 0
      - EnemyId: 27
        PathId: 0
      - EnemyId: -1
        PathId: 0
      - EnemyId: 19
        PathId: 0
    - Rows:
      - EnemyId: 26
        PathId: 0
      - EnemyId: -1
        PathId: 0
      - EnemyId: 26
        PathId: 0
      - EnemyId: -1
        PathId: 0
      - EnemyId: 26
        PathId: 0
      - EnemyId: -1
        PathId: 0
      - EnemyId: 26
        PathId: 0
    - Rows:
      - EnemyId: 22
        PathId: 0
      - EnemyId: -1
        PathId: 0
      - EnemyId: 15
        PathId: 0
      - EnemyId: -1
        PathId: 0
      - EnemyId: 27
        PathId: 0
      - EnemyId: -1
        PathId: 0
      - EnemyId: 19
        PathId: 0
    - Rows:
      - EnemyId: 26
        PathId: 0
      - EnemyId: -1
        PathId: 0
      - EnemyId: 26
        PathId: 0
      - EnemyId: -1
        PathId: 0
      - EnemyId: 26
        PathId: 0
      - EnemyId: -1
        PathId: 0
      - EnemyId: 26
        PathId: 0
    GiftBox:
      NumGiftBox: 0
      Duration: 0
      Speed: 0
    NumEnemyAttack: 0
    SpeedMoveAttack: 5
    DistanceTimeAttack: 0.3
    LoopTimeAttack: 2
    CombatDiff:
      TimeFireRate: 5
      FireRateDecrease: 0.2
      TimeEnemyAttack: 0
      EnemyAttackDecease: 0
      IsIncreaseNumberFire: 0
      TimeIncreaseNumberFire: 0
    Boss:
      BossIndex: 1
      Hps: []
    Rock:
      StartPosition: {x: 0, y: 0, z: 0}
      EndPosition: {x: 0, y: 0, z: 0}
      Range: 3
      Speed: 3
      NumSmall: 0
      NumNormal: 0
      NumBig: 0
      Duration: 5
    UseWarning: 0
    WarningPositions: []
    IsShow: 1
  - WaveType: 1
    FireRate: 1
    Hp: 1
    Items:
      List: []
      NumEnemiesCanHaveItem: 0
    HasPower: 0
    NoDam: 0
    IsTeam: 1
    DestroyOnFinish: 0
    IdleType: 0
    TimeMove: 1
    Ease: 0
    Paths: []
    Enemies:
    - Rows:
      - EnemyId: -1
        PathId: 0
      - EnemyId: -1
        PathId: 0
      - EnemyId: -1
        PathId: 0
      - EnemyId: -1
        PathId: 0
      - EnemyId: -1
        PathId: 0
      - EnemyId: -1
        PathId: 0
      - EnemyId: -1
        PathId: 0
    - Rows:
      - EnemyId: -1
        PathId: 0
      - EnemyId: -1
        PathId: 0
      - EnemyId: -1
        PathId: 0
      - EnemyId: -1
        PathId: 0
      - EnemyId: -1
        PathId: 0
      - EnemyId: -1
        PathId: 0
      - EnemyId: -1
        PathId: 0
    - Rows:
      - EnemyId: -1
        PathId: 0
      - EnemyId: -1
        PathId: 0
      - EnemyId: -1
        PathId: 0
      - EnemyId: -1
        PathId: 0
      - EnemyId: -1
        PathId: 0
      - EnemyId: -1
        PathId: 0
      - EnemyId: -1
        PathId: 0
    - Rows:
      - EnemyId: -1
        PathId: 0
      - EnemyId: -1
        PathId: 0
      - EnemyId: -1
        PathId: 0
      - EnemyId: -1
        PathId: 0
      - EnemyId: -1
        PathId: 0
      - EnemyId: -1
        PathId: 0
      - EnemyId: -1
        PathId: 0
    - Rows:
      - EnemyId: -1
        PathId: 0
      - EnemyId: -1
        PathId: 0
      - EnemyId: -1
        PathId: 0
      - EnemyId: -1
        PathId: 0
      - EnemyId: -1
        PathId: 0
      - EnemyId: -1
        PathId: 0
      - EnemyId: -1
        PathId: 0
    - Rows:
      - EnemyId: -1
        PathId: 0
      - EnemyId: -1
        PathId: 0
      - EnemyId: -1
        PathId: 0
      - EnemyId: -1
        PathId: 0
      - EnemyId: -1
        PathId: 0
      - EnemyId: -1
        PathId: 0
      - EnemyId: -1
        PathId: 0
    - Rows:
      - EnemyId: -1
        PathId: 0
      - EnemyId: -1
        PathId: 0
      - EnemyId: -1
        PathId: 0
      - EnemyId: -1
        PathId: 0
      - EnemyId: -1
        PathId: 0
      - EnemyId: -1
        PathId: 0
      - EnemyId: -1
        PathId: 0
    GiftBox:
      NumGiftBox: 0
      Duration: 0
      Speed: 0
    NumEnemyAttack: 0
    SpeedMoveAttack: 5
    DistanceTimeAttack: 0.3
    LoopTimeAttack: 2
    CombatDiff:
      TimeFireRate: 0
      FireRateDecrease: 0
      TimeEnemyAttack: 0
      EnemyAttackDecease: 0
      IsIncreaseNumberFire: 0
      TimeIncreaseNumberFire: 0
    Boss:
      BossIndex: 1
      Hps: []
    Rock:
      StartPosition: {x: 2.08834, y: 7.7436733, z: 0}
      EndPosition: {x: -2.633638, y: -7.3767104, z: 0}
      Range: 3.8038743
      Speed: 5
      NumSmall: 10
      NumNormal: 10
      NumBig: 20
      Duration: 5
    UseWarning: 0
    WarningPositions: []
    IsShow: 1
  - WaveType: 0
    FireRate: 1
    Hp: 1
    Items:
      List: []
      NumEnemiesCanHaveItem: 0
    HasPower: 0
    NoDam: 0
    IsTeam: 1
    DestroyOnFinish: 0
    IdleType: 3
    TimeMove: 1
    Ease: 0
    Paths:
    - DelayTime: 0
      Distance: 0.3
      MoveSpeed: 8
      Index: 8
      Offset: {x: 0, y: 0}
      FlipX: 0
      FlipY: 0
      Cells:
      - Row: 1
        Coll: 0
      - Row: 2
        Coll: 0
      - Row: 3
        Coll: 0
      - Row: 4
        Coll: 0
      - Row: 4
        Coll: 1
      - Row: 5
        Coll: 1
      - Row: 3
        Coll: 1
      - Row: 2
        Coll: 1
      - Row: 1
        Coll: 1
      - Row: 0
        Coll: 1
      - Row: 3
        Coll: 2
      - Row: 4
        Coll: 2
    - DelayTime: 0
      Distance: 0.3
      MoveSpeed: 8
      Index: 8
      Offset: {x: 0, y: 0}
      FlipX: 1
      FlipY: 0
      Cells:
      - Row: 1
        Coll: 6
      - Row: 2
        Coll: 6
      - Row: 3
        Coll: 6
      - Row: 4
        Coll: 6
      - Row: 4
        Coll: 5
      - Row: 5
        Coll: 5
      - Row: 3
        Coll: 5
      - Row: 2
        Coll: 5
      - Row: 1
        Coll: 5
      - Row: 0
        Coll: 5
    Enemies:
    - Rows:
      - EnemyId: -1
        PathId: 0
      - EnemyId: 27
        PathId: 0
      - EnemyId: -1
        PathId: 0
      - EnemyId: -1
        PathId: 0
      - EnemyId: -1
        PathId: 0
      - EnemyId: 27
        PathId: 0
      - EnemyId: -1
        PathId: 0
    - Rows:
      - EnemyId: 27
        PathId: 0
      - EnemyId: 25
        PathId: 0
      - EnemyId: -1
        PathId: 0
      - EnemyId: -1
        PathId: 0
      - EnemyId: -1
        PathId: 0
      - EnemyId: 25
        PathId: 0
      - EnemyId: 27
        PathId: 0
    - Rows:
      - EnemyId: 27
        PathId: 0
      - EnemyId: 26
        PathId: 0
      - EnemyId: -1
        PathId: 0
      - EnemyId: -1
        PathId: 0
      - EnemyId: -1
        PathId: 0
      - EnemyId: 26
        PathId: 0
      - EnemyId: 27
        PathId: 0
    - Rows:
      - EnemyId: 27
        PathId: 0
      - EnemyId: 26
        PathId: 0
      - EnemyId: 27
        PathId: 0
      - EnemyId: -1
        PathId: 0
      - EnemyId: 27
        PathId: 0
      - EnemyId: 26
        PathId: 0
      - EnemyId: 27
        PathId: 0
    - Rows:
      - EnemyId: 27
        PathId: 0
      - EnemyId: 25
        PathId: 0
      - EnemyId: 27
        PathId: 0
      - EnemyId: -1
        PathId: 0
      - EnemyId: 27
        PathId: 0
      - EnemyId: 25
        PathId: 0
      - EnemyId: 27
        PathId: 0
    - Rows:
      - EnemyId: -1
        PathId: 0
      - EnemyId: 27
        PathId: 0
      - EnemyId: -1
        PathId: 0
      - EnemyId: -1
        PathId: 0
      - EnemyId: -1
        PathId: 0
      - EnemyId: 27
        PathId: 0
      - EnemyId: -1
        PathId: 0
    - Rows:
      - EnemyId: -1
        PathId: 0
      - EnemyId: -1
        PathId: 0
      - EnemyId: -1
        PathId: 0
      - EnemyId: -1
        PathId: 0
      - EnemyId: -1
        PathId: 0
      - EnemyId: -1
        PathId: 0
      - EnemyId: -1
        PathId: 0
    GiftBox:
      NumGiftBox: 0
      Duration: 0
      Speed: 0
    NumEnemyAttack: 0
    SpeedMoveAttack: 5
    DistanceTimeAttack: 0.3
    LoopTimeAttack: 2
    CombatDiff:
      TimeFireRate: 5
      FireRateDecrease: 0.2
      TimeEnemyAttack: 3
      EnemyAttackDecease: 0.2
      IsIncreaseNumberFire: 0
      TimeIncreaseNumberFire: 0
    Boss:
      BossIndex: 1
      Hps: []
    Rock:
      StartPosition: {x: 0, y: 0, z: 0}
      EndPosition: {x: 0, y: 0, z: 0}
      Range: 3
      Speed: 3
      NumSmall: 0
      NumNormal: 0
      NumBig: 0
      Duration: 5
    UseWarning: 0
    WarningPositions: []
    IsShow: 1
  - WaveType: 0
    FireRate: 1
    Hp: 1
    Items:
      List: []
      NumEnemiesCanHaveItem: 0
    HasPower: 0
    NoDam: 0
    IsTeam: 0
    DestroyOnFinish: 1
    IdleType: 0
    TimeMove: 1
    Ease: 0
    Paths:
    - DelayTime: 0
      Distance: 0.3
      MoveSpeed: 8
      Index: 7
      Offset: {x: 0, y: 0}
      FlipX: 0
      FlipY: 0
      Cells:
      - Row: 0
        Coll: 2
    - DelayTime: 0
      Distance: 0.3
      MoveSpeed: 8
      Index: 7
      Offset: {x: 0, y: 0}
      FlipX: 0
      FlipY: 0
      Cells:
      - Row: 0
        Coll: 1
    - DelayTime: 0
      Distance: 0.3
      MoveSpeed: 8
      Index: 7
      Offset: {x: 0, y: 0}
      FlipX: 0
      FlipY: 0
      Cells:
      - Row: 0
        Coll: 0
    - DelayTime: 0
      Distance: 0.3
      MoveSpeed: 8
      Index: 7
      Offset: {x: 0, y: 0}
      FlipX: 0
      FlipY: 0
      Cells:
      - Row: 1
        Coll: 0
    - DelayTime: 0
      Distance: 0.3
      MoveSpeed: 8
      Index: 7
      Offset: {x: 0, y: 0}
      FlipX: 0
      FlipY: 0
      Cells:
      - Row: 1
        Coll: 1
    - DelayTime: 0
      Distance: 0.3
      MoveSpeed: 8
      Index: 7
      Offset: {x: 0, y: 0}
      FlipX: 0
      FlipY: 0
      Cells:
      - Row: 1
        Coll: 2
    - DelayTime: 0
      Distance: 0.3
      MoveSpeed: 8
      Index: 7
      Offset: {x: 0, y: 0}
      FlipX: 0
      FlipY: 0
      Cells:
      - Row: 2
        Coll: 0
    - DelayTime: 0
      Distance: 0.3
      MoveSpeed: 8
      Index: 7
      Offset: {x: 0, y: 0}
      FlipX: 0
      FlipY: 0
      Cells:
      - Row: 2
        Coll: 1
    - DelayTime: 0
      Distance: 0.3
      MoveSpeed: 8
      Index: 7
      Offset: {x: 0, y: 0}
      FlipX: 0
      FlipY: 0
      Cells:
      - Row: 2
        Coll: 2
    - DelayTime: 0
      Distance: 0.3
      MoveSpeed: 8
      Index: 7
      Offset: {x: 0, y: 0}
      FlipX: 0
      FlipY: 0
      Cells:
      - Row: 3
        Coll: 3
    - DelayTime: 0
      Distance: 0.3
      MoveSpeed: 8
      Index: 7
      Offset: {x: 0, y: 0}
      FlipX: 0
      FlipY: 0
      Cells:
      - Row: 3
        Coll: 4
    - DelayTime: 0
      Distance: 0.3
      MoveSpeed: 8
      Index: 7
      Offset: {x: 0, y: 0}
      FlipX: 0
      FlipY: 0
      Cells:
      - Row: 3
        Coll: 5
    - DelayTime: 0
      Distance: 0.3
      MoveSpeed: 8
      Index: 7
      Offset: {x: 0, y: 0}
      FlipX: 0
      FlipY: 0
      Cells:
      - Row: 3
        Coll: 6
    - DelayTime: 0
      Distance: 0.3
      MoveSpeed: 8
      Index: 7
      Offset: {x: 0, y: 0}
      FlipX: 0
      FlipY: 0
      Cells:
      - Row: 4
        Coll: 3
    - DelayTime: 0
      Distance: 0.3
      MoveSpeed: 8
      Index: 7
      Offset: {x: 0, y: 0}
      FlipX: 0
      FlipY: 0
      Cells:
      - Row: 4
        Coll: 4
    - DelayTime: 0
      Distance: 0.3
      MoveSpeed: 8
      Index: 7
      Offset: {x: 0, y: 0}
      FlipX: 0
      FlipY: 0
      Cells:
      - Row: 4
        Coll: 5
    - DelayTime: 0
      Distance: 0.3
      MoveSpeed: 8
      Index: 7
      Offset: {x: 0, y: 0}
      FlipX: 0
      FlipY: 0
      Cells:
      - Row: 4
        Coll: 6
    - DelayTime: 0
      Distance: 0.3
      MoveSpeed: 8
      Index: 7
      Offset: {x: 0, y: 0}
      FlipX: 0
      FlipY: 0
      Cells:
      - Row: 6
        Coll: 3
    - DelayTime: 0
      Distance: 0.3
      MoveSpeed: 8
      Index: 7
      Offset: {x: 0, y: 0}
      FlipX: 0
      FlipY: 0
      Cells:
      - Row: 6
        Coll: 4
    - DelayTime: 0
      Distance: 0.3
      MoveSpeed: 8
      Index: 7
      Offset: {x: 0, y: 0}
      FlipX: 0
      FlipY: 0
      Cells:
      - Row: 6
        Coll: 5
    - DelayTime: 0
      Distance: 0.3
      MoveSpeed: 8
      Index: 7
      Offset: {x: 0, y: 0}
      FlipX: 0
      FlipY: 0
      Cells:
      - Row: 6
        Coll: 6
    - DelayTime: 2
      Distance: 0.3
      MoveSpeed: 8
      Index: 15
      Offset: {x: 0, y: 0}
      FlipX: 0
      FlipY: 0
      Cells:
      - Row: 0
        Coll: 3
    - DelayTime: 2
      Distance: 0.3
      MoveSpeed: 8
      Index: 15
      Offset: {x: 0, y: 0}
      FlipX: 0
      FlipY: 0
      Cells:
      - Row: 0
        Coll: 4
    - DelayTime: 2
      Distance: 0.3
      MoveSpeed: 8
      Index: 15
      Offset: {x: 0, y: 0}
      FlipX: 0
      FlipY: 0
      Cells:
      - Row: 0
        Coll: 5
    - DelayTime: 2
      Distance: 0.3
      MoveSpeed: 8
      Index: 15
      Offset: {x: 0, y: 0}
      FlipX: 0
      FlipY: 0
      Cells:
      - Row: 0
        Coll: 6
    - DelayTime: 2
      Distance: 0.3
      MoveSpeed: 8
      Index: 15
      Offset: {x: 0, y: 0}
      FlipX: 0
      FlipY: 0
      Cells:
      - Row: 1
        Coll: 3
    - DelayTime: 2
      Distance: 0.3
      MoveSpeed: 8
      Index: 15
      Offset: {x: 0, y: 0}
      FlipX: 0
      FlipY: 0
      Cells:
      - Row: 1
        Coll: 4
    - DelayTime: 2
      Distance: 0.3
      MoveSpeed: 8
      Index: 15
      Offset: {x: 0, y: 0}
      FlipX: 0
      FlipY: 0
      Cells:
      - Row: 1
        Coll: 5
    - DelayTime: 2
      Distance: 0.3
      MoveSpeed: 8
      Index: 15
      Offset: {x: 0, y: 0}
      FlipX: 0
      FlipY: 0
      Cells:
      - Row: 1
        Coll: 6
    - DelayTime: 2
      Distance: 0.3
      MoveSpeed: 8
      Index: 15
      Offset: {x: 0, y: 0}
      FlipX: 0
      FlipY: 0
      Cells:
      - Row: 2
        Coll: 3
    - DelayTime: 2
      Distance: 0.3
      MoveSpeed: 8
      Index: 15
      Offset: {x: 0, y: 0}
      FlipX: 0
      FlipY: 0
      Cells:
      - Row: 2
        Coll: 4
    - DelayTime: 2
      Distance: 0.3
      MoveSpeed: 8
      Index: 15
      Offset: {x: 0, y: 0}
      FlipX: 0
      FlipY: 0
      Cells:
      - Row: 2
        Coll: 5
    - DelayTime: 2
      Distance: 0.3
      MoveSpeed: 8
      Index: 15
      Offset: {x: 0, y: 0}
      FlipX: 0
      FlipY: 0
      Cells:
      - Row: 2
        Coll: 6
    - DelayTime: 2
      Distance: 0.3
      MoveSpeed: 8
      Index: 15
      Offset: {x: 0, y: 0}
      FlipX: 0
      FlipY: 0
      Cells:
      - Row: 3
        Coll: 0
    - DelayTime: 2
      Distance: 0.3
      MoveSpeed: 8
      Index: 15
      Offset: {x: 0, y: 0}
      FlipX: 0
      FlipY: 0
      Cells:
      - Row: 3
        Coll: 1
    - DelayTime: 2
      Distance: 0.3
      MoveSpeed: 8
      Index: 15
      Offset: {x: 0, y: 0}
      FlipX: 0
      FlipY: 0
      Cells:
      - Row: 3
        Coll: 2
    - DelayTime: 2
      Distance: 0.3
      MoveSpeed: 8
      Index: 15
      Offset: {x: 0, y: 0}
      FlipX: 0
      FlipY: 0
      Cells:
      - Row: 4
        Coll: 0
    - DelayTime: 2
      Distance: 0.3
      MoveSpeed: 8
      Index: 15
      Offset: {x: 0, y: 0}
      FlipX: 0
      FlipY: 0
      Cells:
      - Row: 4
        Coll: 1
    - DelayTime: 2
      Distance: 0.3
      MoveSpeed: 8
      Index: 15
      Offset: {x: 0, y: 0}
      FlipX: 0
      FlipY: 0
      Cells:
      - Row: 4
        Coll: 2
    - DelayTime: 2
      Distance: 0.3
      MoveSpeed: 8
      Index: 15
      Offset: {x: 0, y: 0}
      FlipX: 0
      FlipY: 0
      Cells:
      - Row: 6
        Coll: 0
    - DelayTime: 2
      Distance: 0.3
      MoveSpeed: 8
      Index: 15
      Offset: {x: 0, y: 0}
      FlipX: 0
      FlipY: 0
      Cells:
      - Row: 6
        Coll: 1
    - DelayTime: 2
      Distance: 0.3
      MoveSpeed: 8
      Index: 15
      Offset: {x: 0, y: 0}
      FlipX: 0
      FlipY: 0
      Cells:
      - Row: 6
        Coll: 2
    Enemies:
    - Rows:
      - EnemyId: 15
        PathId: 0
      - EnemyId: 15
        PathId: 0
      - EnemyId: 15
        PathId: 0
      - EnemyId: 22
        PathId: 0
      - EnemyId: 15
        PathId: 0
      - EnemyId: 15
        PathId: 0
      - EnemyId: 15
        PathId: 0
    - Rows:
      - EnemyId: 25
        PathId: 0
      - EnemyId: 25
        PathId: 0
      - EnemyId: 22
        PathId: 0
      - EnemyId: 25
        PathId: 0
      - EnemyId: 22
        PathId: 0
      - EnemyId: 25
        PathId: 0
      - EnemyId: 25
        PathId: 0
    - Rows:
      - EnemyId: 25
        PathId: 0
      - EnemyId: 22
        PathId: 0
      - EnemyId: 19
        PathId: 0
      - EnemyId: 19
        PathId: 0
      - EnemyId: 19
        PathId: 0
      - EnemyId: 22
        PathId: 0
      - EnemyId: 25
        PathId: 0
    - Rows:
      - EnemyId: 22
        PathId: 0
      - EnemyId: 25
        PathId: 0
      - EnemyId: 25
        PathId: 0
      - EnemyId: 25
        PathId: 0
      - EnemyId: 25
        PathId: 0
      - EnemyId: 25
        PathId: 0
      - EnemyId: 22
        PathId: 0
    - Rows:
      - EnemyId: 26
        PathId: 0
      - EnemyId: 22
        PathId: 0
      - EnemyId: 26
        PathId: 0
      - EnemyId: 26
        PathId: 0
      - EnemyId: 26
        PathId: 0
      - EnemyId: 22
        PathId: 0
      - EnemyId: 26
        PathId: 0
    - Rows:
      - EnemyId: -1
        PathId: 0
      - EnemyId: -1
        PathId: 0
      - EnemyId: -1
        PathId: 0
      - EnemyId: -1
        PathId: 0
      - EnemyId: -1
        PathId: 0
      - EnemyId: -1
        PathId: 0
      - EnemyId: -1
        PathId: 0
    - Rows:
      - EnemyId: 26
        PathId: 0
      - EnemyId: 26
        PathId: 0
      - EnemyId: 26
        PathId: 0
      - EnemyId: 22
        PathId: 0
      - EnemyId: 26
        PathId: 0
      - EnemyId: 26
        PathId: 0
      - EnemyId: 26
        PathId: 0
    GiftBox:
      NumGiftBox: 0
      Duration: 0
      Speed: 0
    NumEnemyAttack: 0
    SpeedMoveAttack: 5
    DistanceTimeAttack: 0.3
    LoopTimeAttack: 2
    CombatDiff:
      TimeFireRate: 5
      FireRateDecrease: 0.2
      TimeEnemyAttack: 0
      EnemyAttackDecease: 0
      IsIncreaseNumberFire: 0
      TimeIncreaseNumberFire: 0
    Boss:
      BossIndex: 1
      Hps: []
    Rock:
      StartPosition: {x: 0, y: 0, z: 0}
      EndPosition: {x: 0, y: 0, z: 0}
      Range: 3
      Speed: 3
      NumSmall: 0
      NumNormal: 0
      NumBig: 0
      Duration: 5
    UseWarning: 0
    WarningPositions: []
    IsShow: 1
  - WaveType: 0
    FireRate: 1
    Hp: 1
    Items:
      List: []
      NumEnemiesCanHaveItem: 0
    HasPower: 0
    NoDam: 0
    IsTeam: 0
    DestroyOnFinish: 1
    IdleType: 0
    TimeMove: 1
    Ease: 0
    Paths:
    - DelayTime: 0
      Distance: 0.3
      MoveSpeed: 3.2
      Index: 3
      Offset: {x: 0, y: 2}
      FlipX: 1
      FlipY: 0
      Cells:
      - Row: 0
        Coll: 0
    - DelayTime: 1.2
      Distance: 0.3
      MoveSpeed: 3.2
      Index: 3
      Offset: {x: 0, y: 0}
      FlipX: 1
      FlipY: 0
      Cells:
      - Row: 1
        Coll: 0
    - DelayTime: 2.1
      Distance: 0.3
      MoveSpeed: 3.5
      Index: 3
      Offset: {x: 0, y: -5.1}
      FlipX: 1
      FlipY: 0
      Cells:
      - Row: 2
        Coll: 0
    - DelayTime: 3.8
      Distance: 0.3
      MoveSpeed: 3.5
      Index: 3
      Offset: {x: 0, y: -6.4}
      FlipX: 1
      FlipY: 0
      Cells:
      - Row: 3
        Coll: 0
    - DelayTime: 0.6
      Distance: 0.3
      MoveSpeed: 4
      Index: 3
      Offset: {x: 0, y: -7.6}
      FlipX: 1
      FlipY: 0
      Cells:
      - Row: 4
        Coll: 0
    - DelayTime: 1.2
      Distance: 0.3
      MoveSpeed: 4.1
      Index: 3
      Offset: {x: 0, y: 1.4}
      FlipX: 1
      FlipY: 0
      Cells:
      - Row: 5
        Coll: 0
    - DelayTime: 3.4
      Distance: 0.3
      MoveSpeed: 4.1
      Index: 3
      Offset: {x: 0, y: -2.9}
      FlipX: 1
      FlipY: 0
      Cells:
      - Row: 6
        Coll: 0
    - DelayTime: 4
      Distance: 0.3
      MoveSpeed: 4.3
      Index: 3
      Offset: {x: 0, y: -3.2}
      FlipX: 1
      FlipY: 0
      Cells:
      - Row: 0
        Coll: 1
    - DelayTime: 0.2
      Distance: 0.3
      MoveSpeed: 4.7
      Index: 3
      Offset: {x: 0, y: -1.6}
      FlipX: 1
      FlipY: 0
      Cells:
      - Row: 1
        Coll: 1
    - DelayTime: 1.2
      Distance: 0.3
      MoveSpeed: 5
      Index: 3
      Offset: {x: 0, y: -1.7}
      FlipX: 1
      FlipY: 0
      Cells:
      - Row: 2
        Coll: 1
    - DelayTime: 3.6
      Distance: 0.3
      MoveSpeed: 5.1
      Index: 3
      Offset: {x: 0, y: -2.1}
      FlipX: 1
      FlipY: 0
      Cells:
      - Row: 3
        Coll: 1
    - DelayTime: 4.1
      Distance: 0.3
      MoveSpeed: 5.1
      Index: 3
      Offset: {x: 0, y: -3.6}
      FlipX: 1
      FlipY: 0
      Cells:
      - Row: 4
        Coll: 1
    - DelayTime: 2.8
      Distance: 0.3
      MoveSpeed: 5.4
      Index: 3
      Offset: {x: 0, y: 0.7}
      FlipX: 1
      FlipY: 0
      Cells:
      - Row: 5
        Coll: 1
    - DelayTime: 2.3
      Distance: 0.3
      MoveSpeed: 5.4
      Index: 3
      Offset: {x: 0, y: 1.2}
      FlipX: 1
      FlipY: 0
      Cells:
      - Row: 6
        Coll: 1
    - DelayTime: 3.5
      Distance: 0.3
      MoveSpeed: 5.7
      Index: 3
      Offset: {x: 0, y: -0.8}
      FlipX: 1
      FlipY: 0
      Cells:
      - Row: 0
        Coll: 2
    - DelayTime: 7
      Distance: 0.3
      MoveSpeed: 5.8
      Index: 3
      Offset: {x: 0, y: -1.1}
      FlipX: 1
      FlipY: 0
      Cells:
      - Row: 1
        Coll: 2
    - DelayTime: 6
      Distance: 0.3
      MoveSpeed: 6
      Index: 3
      Offset: {x: 0, y: -3.8}
      FlipX: 1
      FlipY: 0
      Cells:
      - Row: 2
        Coll: 2
    - DelayTime: 2.3
      Distance: 0.3
      MoveSpeed: 6
      Index: 3
      Offset: {x: 0, y: -4.3}
      FlipX: 1
      FlipY: 0
      Cells:
      - Row: 4
        Coll: 2
    - DelayTime: 1.7
      Distance: 0.3
      MoveSpeed: 6
      Index: 3
      Offset: {x: 0, y: -1.4}
      FlipX: 1
      FlipY: 0
      Cells:
      - Row: 3
        Coll: 2
    - DelayTime: 3.6
      Distance: 0.3
      MoveSpeed: 6.3
      Index: 3
      Offset: {x: 0, y: -2.9}
      FlipX: 1
      FlipY: 0
      Cells:
      - Row: 5
        Coll: 2
    - DelayTime: 0.9
      Distance: 0.3
      MoveSpeed: 6.3
      Index: 3
      Offset: {x: 0, y: 1.4}
      FlipX: 1
      FlipY: 0
      Cells:
      - Row: 6
        Coll: 2
    - DelayTime: 2.3
      Distance: 0.3
      MoveSpeed: 6.8
      Index: 3
      Offset: {x: 0, y: 0.2}
      FlipX: 1
      FlipY: 0
      Cells:
      - Row: 0
        Coll: 3
    - DelayTime: 1.4
      Distance: 0.3
      MoveSpeed: 6.8
      Index: 3
      Offset: {x: 0, y: -1.7}
      FlipX: 1
      FlipY: 0
      Cells:
      - Row: 1
        Coll: 3
    - DelayTime: 6.2
      Distance: 0.3
      MoveSpeed: 6.8
      Index: 3
      Offset: {x: 0, y: -3.5}
      FlipX: 1
      FlipY: 0
      Cells:
      - Row: 2
        Coll: 3
    - DelayTime: 0
      Distance: 0.3
      MoveSpeed: 7.2
      Index: 3
      Offset: {x: 0, y: -2.4}
      FlipX: 1
      FlipY: 0
      Cells:
      - Row: 3
        Coll: 3
    - DelayTime: 6.2
      Distance: 0.3
      MoveSpeed: 7.2
      Index: 3
      Offset: {x: 0, y: -7.2}
      FlipX: 1
      FlipY: 0
      Cells:
      - Row: 4
        Coll: 3
    - DelayTime: 1.7
      Distance: 0.3
      MoveSpeed: 7.2
      Index: 3
      Offset: {x: 0, y: 0.9}
      FlipX: 1
      FlipY: 0
      Cells:
      - Row: 5
        Coll: 3
    - DelayTime: 2.3
      Distance: 0.3
      MoveSpeed: 7.6
      Index: 3
      Offset: {x: 0, y: 3}
      FlipX: 1
      FlipY: 0
      Cells:
      - Row: 6
        Coll: 3
    - DelayTime: 5.1
      Distance: 0.3
      MoveSpeed: 7.6
      Index: 3
      Offset: {x: 0, y: 2.4}
      FlipX: 1
      FlipY: 0
      Cells:
      - Row: 0
        Coll: 4
    - DelayTime: 1.6
      Distance: 0.3
      MoveSpeed: 7.7
      Index: 3
      Offset: {x: 0, y: -3.7}
      FlipX: 1
      FlipY: 0
      Cells:
      - Row: 1
        Coll: 4
    - DelayTime: 6.3
      Distance: 0.3
      MoveSpeed: 8
      Index: 3
      Offset: {x: 0, y: -2.6}
      FlipX: 1
      FlipY: 0
      Cells:
      - Row: 2
        Coll: 4
    - DelayTime: 0.9
      Distance: 0.3
      MoveSpeed: 8
      Index: 3
      Offset: {x: 0, y: 0.6}
      FlipX: 1
      FlipY: 0
      Cells:
      - Row: 3
        Coll: 4
    - DelayTime: 2.7
      Distance: 0.3
      MoveSpeed: 8.1
      Index: 3
      Offset: {x: 0, y: 1.2}
      FlipX: 1
      FlipY: 0
      Cells:
      - Row: 4
        Coll: 4
    - DelayTime: 4.1
      Distance: 0.3
      MoveSpeed: 8.2
      Index: 3
      Offset: {x: 0, y: 1.9}
      FlipX: 1
      FlipY: 0
      Cells:
      - Row: 4
        Coll: 5
    - DelayTime: 2.6
      Distance: 0.3
      MoveSpeed: 8.3
      Index: 3
      Offset: {x: 0, y: 2.1}
      FlipX: 1
      FlipY: 0
      Cells:
      - Row: 5
        Coll: 4
    - DelayTime: 1.4
      Distance: 0.3
      MoveSpeed: 8.5
      Index: 3
      Offset: {x: 0, y: -4.6}
      FlipX: 1
      FlipY: 0
      Cells:
      - Row: 6
        Coll: 4
    - DelayTime: 4.1
      Distance: 0.3
      MoveSpeed: 8.5
      Index: 3
      Offset: {x: 0, y: -0.1}
      FlipX: 1
      FlipY: 0
      Cells:
      - Row: 5
        Coll: 5
    - DelayTime: 0
      Distance: 0.3
      MoveSpeed: 8.5
      Index: 3
      Offset: {x: 0, y: -1.3}
      FlipX: 1
      FlipY: 0
      Cells:
      - Row: 6
        Coll: 5
    - DelayTime: 3.8
      Distance: 0.3
      MoveSpeed: 9
      Index: 3
      Offset: {x: 0, y: 2.6}
      FlipX: 1
      FlipY: 0
      Cells:
      - Row: 3
        Coll: 5
    - DelayTime: 2.1
      Distance: 0.3
      MoveSpeed: 9.3
      Index: 3
      Offset: {x: 0, y: 1.2}
      FlipX: 1
      FlipY: 0
      Cells:
      - Row: 3
        Coll: 6
    - DelayTime: 5.1
      Distance: 0.3
      MoveSpeed: 9.8
      Index: 3
      Offset: {x: 0, y: -7.2}
      FlipX: 1
      FlipY: 0
      Cells:
      - Row: 5
        Coll: 6
    - DelayTime: 1.3
      Distance: 0.3
      MoveSpeed: 10.3
      Index: 3
      Offset: {x: 0, y: -5.1}
      FlipX: 1
      FlipY: 0
      Cells:
      - Row: 4
        Coll: 6
    - DelayTime: 4
      Distance: 0.3
      MoveSpeed: 10.7
      Index: 3
      Offset: {x: 0, y: 1.6}
      FlipX: 1
      FlipY: 0
      Cells:
      - Row: 0
        Coll: 5
    - DelayTime: 2.3
      Distance: 0.3
      MoveSpeed: 11
      Index: 3
      Offset: {x: 0, y: 0.3}
      FlipX: 1
      FlipY: 0
      Cells:
      - Row: 1
        Coll: 6
    - DelayTime: 0
      Distance: 0.3
      MoveSpeed: 11.3
      Index: 3
      Offset: {x: 0, y: -5.2}
      FlipX: 1
      FlipY: 0
      Cells:
      - Row: 6
        Coll: 6
    - DelayTime: 1.1
      Distance: 0.3
      MoveSpeed: 11.8
      Index: 3
      Offset: {x: 0, y: -6.1}
      FlipX: 1
      FlipY: 0
      Cells:
      - Row: 2
        Coll: 5
    - DelayTime: 6.4
      Distance: 0.3
      MoveSpeed: 12
      Index: 3
      Offset: {x: 0, y: -2.1}
      FlipX: 1
      FlipY: 0
      Cells:
      - Row: 1
        Coll: 5
    - DelayTime: 7.3
      Distance: 0.3
      MoveSpeed: 12.2
      Index: 3
      Offset: {x: 0, y: 0.6}
      FlipX: 1
      FlipY: 0
      Cells:
      - Row: 0
        Coll: 6
    - DelayTime: 5.3
      Distance: 0.3
      MoveSpeed: 12.5
      Index: 3
      Offset: {x: 0, y: -3}
      FlipX: 1
      FlipY: 0
      Cells:
      - Row: 2
        Coll: 6
    Enemies:
    - Rows:
      - EnemyId: 26
        PathId: 0
      - EnemyId: 26
        PathId: 0
      - EnemyId: 26
        PathId: 0
      - EnemyId: 19
        PathId: 0
      - EnemyId: 26
        PathId: 0
      - EnemyId: 26
        PathId: 0
      - EnemyId: 25
        PathId: 0
    - Rows:
      - EnemyId: 27
        PathId: 0
      - EnemyId: 26
        PathId: 0
      - EnemyId: 9
        PathId: 0
      - EnemyId: 19
        PathId: 0
      - EnemyId: 26
        PathId: 0
      - EnemyId: 25
        PathId: 0
      - EnemyId: 25
        PathId: 0
    - Rows:
      - EnemyId: 27
        PathId: 0
      - EnemyId: 26
        PathId: 0
      - EnemyId: 25
        PathId: 0
      - EnemyId: 19
        PathId: 0
      - EnemyId: 18
        PathId: 0
      - EnemyId: 18
        PathId: 0
      - EnemyId: 18
        PathId: 0
    - Rows:
      - EnemyId: 26
        PathId: 0
      - EnemyId: 25
        PathId: 0
      - EnemyId: 26
        PathId: 0
      - EnemyId: 19
        PathId: 0
      - EnemyId: 18
        PathId: 0
      - EnemyId: 3
        PathId: 0
      - EnemyId: 18
        PathId: 0
    - Rows:
      - EnemyId: 14
        PathId: 0
      - EnemyId: 14
        PathId: 0
      - EnemyId: 9
        PathId: 0
      - EnemyId: 19
        PathId: 0
      - EnemyId: 19
        PathId: 0
      - EnemyId: 3
        PathId: 0
      - EnemyId: 15
        PathId: 0
    - Rows:
      - EnemyId: 14
        PathId: 0
      - EnemyId: 27
        PathId: 0
      - EnemyId: 14
        PathId: 0
      - EnemyId: 9
        PathId: 0
      - EnemyId: 15
        PathId: 0
      - EnemyId: 18
        PathId: 0
      - EnemyId: 18
        PathId: 0
    - Rows:
      - EnemyId: 14
        PathId: 0
      - EnemyId: 27
        PathId: 0
      - EnemyId: 27
        PathId: 0
      - EnemyId: 14
        PathId: 0
      - EnemyId: 15
        PathId: 0
      - EnemyId: 15
        PathId: 0
      - EnemyId: 15
        PathId: 0
    GiftBox:
      NumGiftBox: 0
      Duration: 0
      Speed: 0
    NumEnemyAttack: 0
    SpeedMoveAttack: 5
    DistanceTimeAttack: 0.3
    LoopTimeAttack: 2
    CombatDiff:
      TimeFireRate: 6
      FireRateDecrease: 0.2
      TimeEnemyAttack: 0
      EnemyAttackDecease: 0
      IsIncreaseNumberFire: 0
      TimeIncreaseNumberFire: 0
    Boss:
      BossIndex: 1
      Hps: []
    Rock:
      StartPosition: {x: 0, y: 0, z: 0}
      EndPosition: {x: 0, y: 0, z: 0}
      Range: 3
      Speed: 3
      NumSmall: 0
      NumNormal: 0
      NumBig: 0
      Duration: 5
    UseWarning: 0
    WarningPositions: []
    IsShow: 1
  - WaveType: 0
    FireRate: 1
    Hp: 1
    Items:
      List:
      - Type: 0
        Num: 1
      NumEnemiesCanHaveItem: 5
    HasPower: 0
    NoDam: 1
    IsTeam: 1
    DestroyOnFinish: 0
    IdleType: 10
    TimeMove: 1
    Ease: 0
    Paths:
    - DelayTime: 2
      Distance: 0.3
      MoveSpeed: 6
      Index: 30
      Offset: {x: 0, y: 0}
      FlipX: 0
      FlipY: 0
      Cells:
      - Row: 2
        Coll: 3
      - Row: 2
        Coll: 4
      - Row: 3
        Coll: 4
      - Row: 4
        Coll: 4
      - Row: 4
        Coll: 2
      - Row: 4
        Coll: 3
      - Row: 3
        Coll: 2
      - Row: 2
        Coll: 2
    - DelayTime: 0
      Distance: 0.3
      MoveSpeed: 8
      Index: 0
      Offset: {x: 0, y: 0}
      FlipX: 0
      FlipY: 0
      Cells:
      - Row: 0
        Coll: 0
    - DelayTime: 0
      Distance: 0.3
      MoveSpeed: 8
      Index: 0
      Offset: {x: 0, y: 0}
      FlipX: 0
      FlipY: 0
      Cells:
      - Row: 0
        Coll: 1
    - DelayTime: 0
      Distance: 0.3
      MoveSpeed: 8
      Index: 0
      Offset: {x: 0, y: 0}
      FlipX: 0
      FlipY: 0
      Cells:
      - Row: 0
        Coll: 2
    - DelayTime: 0
      Distance: 0.3
      MoveSpeed: 8
      Index: 0
      Offset: {x: 0, y: 0}
      FlipX: 0
      FlipY: 0
      Cells:
      - Row: 0
        Coll: 3
    - DelayTime: 0
      Distance: 0.3
      MoveSpeed: 8
      Index: 0
      Offset: {x: 0, y: 0}
      FlipX: 0
      FlipY: 0
      Cells:
      - Row: 0
        Coll: 4
    - DelayTime: 0
      Distance: 0.3
      MoveSpeed: 8
      Index: 0
      Offset: {x: 0, y: 0}
      FlipX: 0
      FlipY: 0
      Cells:
      - Row: 0
        Coll: 5
    - DelayTime: 0
      Distance: 0.3
      MoveSpeed: 8
      Index: 0
      Offset: {x: 0, y: 0}
      FlipX: 0
      FlipY: 0
      Cells:
      - Row: 0
        Coll: 6
    - DelayTime: 0
      Distance: 0.3
      MoveSpeed: 8
      Index: 0
      Offset: {x: 0, y: 0}
      FlipX: 0
      FlipY: 0
      Cells:
      - Row: 1
        Coll: 6
    - DelayTime: 0
      Distance: 0.3
      MoveSpeed: 8
      Index: 0
      Offset: {x: 0, y: 0}
      FlipX: 0
      FlipY: 0
      Cells:
      - Row: 2
        Coll: 6
    - DelayTime: 0
      Distance: 0.3
      MoveSpeed: 8
      Index: 0
      Offset: {x: 0, y: 0}
      FlipX: 0
      FlipY: 0
      Cells:
      - Row: 3
        Coll: 6
    - DelayTime: 0
      Distance: 0.3
      MoveSpeed: 8
      Index: 0
      Offset: {x: 0, y: 0}
      FlipX: 0
      FlipY: 0
      Cells:
      - Row: 4
        Coll: 6
    - DelayTime: 0
      Distance: 0.3
      MoveSpeed: 8
      Index: 0
      Offset: {x: 0, y: 0}
      FlipX: 0
      FlipY: 0
      Cells:
      - Row: 5
        Coll: 6
    - DelayTime: 0
      Distance: 0.3
      MoveSpeed: 8
      Index: 0
      Offset: {x: 0, y: 0}
      FlipX: 0
      FlipY: 0
      Cells:
      - Row: 6
        Coll: 6
    - DelayTime: 0
      Distance: 0.3
      MoveSpeed: 8
      Index: 0
      Offset: {x: 0, y: 0}
      FlipX: 0
      FlipY: 0
      Cells:
      - Row: 6
        Coll: 5
    - DelayTime: 0
      Distance: 0.3
      MoveSpeed: 8
      Index: 0
      Offset: {x: 0, y: 0}
      FlipX: 0
      FlipY: 0
      Cells:
      - Row: 6
        Coll: 4
    - DelayTime: 0
      Distance: 0.3
      MoveSpeed: 8
      Index: 0
      Offset: {x: 0, y: 0}
      FlipX: 0
      FlipY: 0
      Cells:
      - Row: 6
        Coll: 3
    - DelayTime: 0
      Distance: 0.3
      MoveSpeed: 8
      Index: 0
      Offset: {x: 0, y: 0}
      FlipX: 0
      FlipY: 0
      Cells:
      - Row: 6
        Coll: 2
    - DelayTime: 0
      Distance: 0.3
      MoveSpeed: 8
      Index: 0
      Offset: {x: 0, y: 0}
      FlipX: 0
      FlipY: 0
      Cells:
      - Row: 6
        Coll: 1
    - DelayTime: 0
      Distance: 0.3
      MoveSpeed: 8
      Index: 0
      Offset: {x: 0, y: 0}
      FlipX: 0
      FlipY: 0
      Cells:
      - Row: 6
        Coll: 0
    - DelayTime: 0
      Distance: 0.3
      MoveSpeed: 8
      Index: 0
      Offset: {x: 0, y: 0}
      FlipX: 0
      FlipY: 0
      Cells:
      - Row: 4
        Coll: 0
    - DelayTime: 0
      Distance: 0.3
      MoveSpeed: 8
      Index: 0
      Offset: {x: 0, y: 0}
      FlipX: 0
      FlipY: 0
      Cells:
      - Row: 5
        Coll: 0
    - DelayTime: 0
      Distance: 0.3
      MoveSpeed: 8
      Index: 0
      Offset: {x: 0, y: 0}
      FlipX: 0
      FlipY: 0
      Cells:
      - Row: 3
        Coll: 0
    - DelayTime: 0
      Distance: 0.3
      MoveSpeed: 8
      Index: 0
      Offset: {x: 0, y: 0}
      FlipX: 0
      FlipY: 0
      Cells:
      - Row: 2
        Coll: 0
    - DelayTime: 0
      Distance: 0.3
      MoveSpeed: 8
      Index: 0
      Offset: {x: 0, y: 0}
      FlipX: 0
      FlipY: 0
      Cells:
      - Row: 1
        Coll: 0
    - DelayTime: 0
      Distance: 0.3
      MoveSpeed: 8
      Index: 0
      Offset: {x: 0, y: 0}
      FlipX: 0
      FlipY: 0
      Cells:
      - Row: 1
        Coll: 1
    - DelayTime: 0
      Distance: 0.3
      MoveSpeed: 8
      Index: 0
      Offset: {x: 0, y: 0}
      FlipX: 0
      FlipY: 0
      Cells:
      - Row: 1
        Coll: 5
    - DelayTime: 0
      Distance: 0.3
      MoveSpeed: 8
      Index: 0
      Offset: {x: 0, y: 0}
      FlipX: 0
      FlipY: 0
      Cells:
      - Row: 5
        Coll: 5
    - DelayTime: 0
      Distance: 0.3
      MoveSpeed: 8
      Index: 0
      Offset: {x: 0, y: 0}
      FlipX: 0
      FlipY: 0
      Cells:
      - Row: 5
        Coll: 1
    Enemies:
    - Rows:
      - EnemyId: 25
        PathId: 0
      - EnemyId: 22
        PathId: 0
      - EnemyId: 27
        PathId: 0
      - EnemyId: 22
        PathId: 0
      - EnemyId: 27
        PathId: 0
      - EnemyId: 22
        PathId: 0
      - EnemyId: 25
        PathId: 0
    - Rows:
      - EnemyId: 27
        PathId: 0
      - EnemyId: 25
        PathId: 0
      - EnemyId: -1
        PathId: 0
      - EnemyId: -1
        PathId: 0
      - EnemyId: -1
        PathId: 0
      - EnemyId: 25
        PathId: 0
      - EnemyId: 27
        PathId: 0
    - Rows:
      - EnemyId: 22
        PathId: 0
      - EnemyId: -1
        PathId: 0
      - EnemyId: 26
        PathId: 0
      - EnemyId: 26
        PathId: 0
      - EnemyId: 26
        PathId: 0
      - EnemyId: -1
        PathId: 0
      - EnemyId: 22
        PathId: 0
    - Rows:
      - EnemyId: 22
        PathId: 0
      - EnemyId: -1
        PathId: 0
      - EnemyId: 26
        PathId: 0
      - EnemyId: -1
        PathId: 0
      - EnemyId: 26
        PathId: 0
      - EnemyId: -1
        PathId: 0
      - EnemyId: 22
        PathId: 0
    - Rows:
      - EnemyId: 22
        PathId: 0
      - EnemyId: -1
        PathId: 0
      - EnemyId: 26
        PathId: 0
      - EnemyId: 26
        PathId: 0
      - EnemyId: 26
        PathId: 0
      - EnemyId: -1
        PathId: 0
      - EnemyId: 22
        PathId: 0
    - Rows:
      - EnemyId: 27
        PathId: 0
      - EnemyId: 25
        PathId: 0
      - EnemyId: -1
        PathId: 0
      - EnemyId: -1
        PathId: 0
      - EnemyId: -1
        PathId: 0
      - EnemyId: 25
        PathId: 0
      - EnemyId: 27
        PathId: 0
    - Rows:
      - EnemyId: 25
        PathId: 0
      - EnemyId: 27
        PathId: 0
      - EnemyId: 27
        PathId: 0
      - EnemyId: 27
        PathId: 0
      - EnemyId: 27
        PathId: 0
      - EnemyId: 27
        PathId: 0
      - EnemyId: 25
        PathId: 0
    GiftBox:
      NumGiftBox: 0
      Duration: 0
      Speed: 0
    NumEnemyAttack: 6
    SpeedMoveAttack: 5
    DistanceTimeAttack: 0.3
    LoopTimeAttack: 2
    CombatDiff:
      TimeFireRate: 4
      FireRateDecrease: 0.1
      TimeEnemyAttack: 3
      EnemyAttackDecease: 0.1
      IsIncreaseNumberFire: 0
      TimeIncreaseNumberFire: 0
    Boss:
      BossIndex: 1
      Hps: []
    Rock:
      StartPosition: {x: 0, y: 0, z: 0}
      EndPosition: {x: 0, y: 0, z: 0}
      Range: 3
      Speed: 3
      NumSmall: 0
      NumNormal: 0
      NumBig: 0
      Duration: 5
    UseWarning: 0
    WarningPositions: []
    IsShow: 1
  - WaveType: 1
    FireRate: 1
    Hp: 1
    Items:
      List: []
      NumEnemiesCanHaveItem: 0
    HasPower: 0
    NoDam: 0
    IsTeam: 1
    DestroyOnFinish: 0
    IdleType: 0
    TimeMove: 1
    Ease: 0
    Paths: []
    Enemies:
    - Rows:
      - EnemyId: -1
        PathId: 0
      - EnemyId: -1
        PathId: 0
      - EnemyId: -1
        PathId: 0
      - EnemyId: -1
        PathId: 0
      - EnemyId: -1
        PathId: 0
      - EnemyId: -1
        PathId: 0
      - EnemyId: -1
        PathId: 0
    - Rows:
      - EnemyId: -1
        PathId: 0
      - EnemyId: -1
        PathId: 0
      - EnemyId: -1
        PathId: 0
      - EnemyId: -1
        PathId: 0
      - EnemyId: -1
        PathId: 0
      - EnemyId: -1
        PathId: 0
      - EnemyId: -1
        PathId: 0
    - Rows:
      - EnemyId: -1
        PathId: 0
      - EnemyId: -1
        PathId: 0
      - EnemyId: -1
        PathId: 0
      - EnemyId: -1
        PathId: 0
      - EnemyId: -1
        PathId: 0
      - EnemyId: -1
        PathId: 0
      - EnemyId: -1
        PathId: 0
    - Rows:
      - EnemyId: -1
        PathId: 0
      - EnemyId: -1
        PathId: 0
      - EnemyId: -1
        PathId: 0
      - EnemyId: -1
        PathId: 0
      - EnemyId: -1
        PathId: 0
      - EnemyId: -1
        PathId: 0
      - EnemyId: -1
        PathId: 0
    - Rows:
      - EnemyId: -1
        PathId: 0
      - EnemyId: -1
        PathId: 0
      - EnemyId: -1
        PathId: 0
      - EnemyId: -1
        PathId: 0
      - EnemyId: -1
        PathId: 0
      - EnemyId: -1
        PathId: 0
      - EnemyId: -1
        PathId: 0
    - Rows:
      - EnemyId: -1
        PathId: 0
      - EnemyId: -1
        PathId: 0
      - EnemyId: -1
        PathId: 0
      - EnemyId: -1
        PathId: 0
      - EnemyId: -1
        PathId: 0
      - EnemyId: -1
        PathId: 0
      - EnemyId: -1
        PathId: 0
    - Rows:
      - EnemyId: -1
        PathId: 0
      - EnemyId: -1
        PathId: 0
      - EnemyId: -1
        PathId: 0
      - EnemyId: -1
        PathId: 0
      - EnemyId: -1
        PathId: 0
      - EnemyId: -1
        PathId: 0
      - EnemyId: -1
        PathId: 0
    GiftBox:
      NumGiftBox: 0
      Duration: 0
      Speed: 0
    NumEnemyAttack: 0
    SpeedMoveAttack: 5
    DistanceTimeAttack: 0.3
    LoopTimeAttack: 2
    CombatDiff:
      TimeFireRate: 0
      FireRateDecrease: 0
      TimeEnemyAttack: 0
      EnemyAttackDecease: 0
      IsIncreaseNumberFire: 0
      TimeIncreaseNumberFire: 0
    Boss:
      BossIndex: 1
      Hps: []
    Rock:
      StartPosition: {x: 0.04584384, y: 7.2894783, z: 0}
      EndPosition: {x: 0.045856476, y: -7.564556, z: 0}
      Range: 3.8252265
      Speed: 4
      NumSmall: 20
      NumNormal: 20
      NumBig: 20
      Duration: 7
    UseWarning: 0
    WarningPositions: []
    IsShow: 1
