%YAML 1.1
%TAG !u! tag:unity3d.com,2011:
--- !u!114 &11400000
MonoBehaviour:
  m_ObjectHideFlags: 0
  m_CorrespondingSourceObject: {fileID: 0}
  m_PrefabInstance: {fileID: 0}
  m_PrefabAsset: {fileID: 0}
  m_GameObject: {fileID: 0}
  m_Enabled: 1
  m_EditorHideFlags: 0
  m_Script: {fileID: 11500000, guid: f1b3b4b945939a54ea0b23d3396115fb, type: 3}
  m_Name: E8_SkeletonData
  m_EditorClassIdentifier: 
  atlasAssets:
  - {fileID: 11400000, guid: 5c18b72c127cb064fb8cf693febf5e10, type: 2}
  scale: 0.009
  skeletonJSON: {fileID: 4900000, guid: 3ec571bcffc85f249a4d777cda1da917, type: 3}
  fromAnimation:
  - Idle
  - Idle
  - Idle
  toAnimation:
  - Attack1
  - Attack2
  - Attack3
  duration:
  - 0
  - 0
  - 0
  defaultMix: 0.2
  controller: {fileID: 0}
