%YAML 1.1
%TAG !u! tag:unity3d.com,2011:
--- !u!114 &11400000
MonoBehaviour:
  m_ObjectHideFlags: 0
  m_CorrespondingSourceObject: {fileID: 0}
  m_PrefabInstance: {fileID: 0}
  m_PrefabAsset: {fileID: 0}
  m_GameObject: {fileID: 0}
  m_Enabled: 1
  m_EditorHideFlags: 0
  m_Script: {fileID: 11500000, guid: bf5d7ed2671cf0d4b825cab5b09dbcb8, type: 3}
  m_Name: Level 53
  m_EditorClassIdentifier: 
  FuelCost: 5
  CoinReward: 5350
  ReFightCoinReward: 2675
  CombatPower: 56770
  EvolveShipNum: 15
  EvolveShipId: 1
  EvolveDroneNum: 15
  EvolveDroneId: 1
  Waves:
  - WaveType: 0
    FireRate: 1
    Hp: 1
    Items:
      List:
      - Type: 1
        Num: 3
      NumEnemiesCanHaveItem: 10
    HasPower: 0
    NoDam: 0
    IsTeam: 1
    DestroyOnFinish: 0
    IdleType: 8
    TimeMove: 2
    Ease: 0
    Paths:
    - DelayTime: 2
      Distance: 0.3
      MoveSpeed: 3
      Index: 7
      Offset: {x: 4, y: 0}
      FlipX: 0
      FlipY: 0
      Cells:
      - Row: 1
        Coll: 1
    - DelayTime: 2
      Distance: 0.3
      MoveSpeed: 3
      Index: 7
      Offset: {x: -4, y: 0}
      FlipX: 0
      FlipY: 0
      Cells:
      - Row: 1
        Coll: 5
    - DelayTime: 0
      Distance: 0.3
      MoveSpeed: 6
      Index: 7
      Offset: {x: 0, y: 0}
      FlipX: 0
      FlipY: 0
      Cells:
      - Row: 0
        Coll: 3
    - DelayTime: 0
      Distance: 0.3
      MoveSpeed: 6
      Index: 7
      Offset: {x: 0, y: 0}
      FlipX: 0
      FlipY: 0
      Cells:
      - Row: 1
        Coll: 3
    - DelayTime: 0
      Distance: 0.3
      MoveSpeed: 6
      Index: 7
      Offset: {x: 0, y: 0}
      FlipX: 0
      FlipY: 0
      Cells:
      - Row: 2
        Coll: 3
    - DelayTime: 0
      Distance: 0.3
      MoveSpeed: 6
      Index: 7
      Offset: {x: 0, y: 0}
      FlipX: 0
      FlipY: 0
      Cells:
      - Row: 3
        Coll: 3
    - DelayTime: 0
      Distance: 0.3
      MoveSpeed: 6
      Index: 7
      Offset: {x: 0, y: 0}
      FlipX: 0
      FlipY: 0
      Cells:
      - Row: 4
        Coll: 3
    - DelayTime: 0
      Distance: 0.3
      MoveSpeed: 6
      Index: 7
      Offset: {x: 0, y: 0}
      FlipX: 0
      FlipY: 0
      Cells:
      - Row: 5
        Coll: 3
    - DelayTime: 0.5
      Distance: 0.3
      MoveSpeed: 6
      Index: 0
      Offset: {x: 0, y: 0}
      FlipX: 0
      FlipY: 0
      Cells:
      - Row: 3
        Coll: 2
    - DelayTime: 0.5
      Distance: 0.3
      MoveSpeed: 6
      Index: 0
      Offset: {x: 0, y: 0}
      FlipX: 0
      FlipY: 0
      Cells:
      - Row: 4
        Coll: 2
    - DelayTime: 0.5
      Distance: 0.3
      MoveSpeed: 6
      Index: 0
      Offset: {x: 0, y: 0}
      FlipX: 0
      FlipY: 0
      Cells:
      - Row: 3
        Coll: 1
    - DelayTime: 0.5
      Distance: 0.3
      MoveSpeed: 6
      Index: 0
      Offset: {x: 0, y: 0}
      FlipX: 0
      FlipY: 0
      Cells:
      - Row: 4
        Coll: 1
    - DelayTime: 0.5
      Distance: 0.3
      MoveSpeed: 6
      Index: 0
      Offset: {x: 0, y: 0}
      FlipX: 0
      FlipY: 0
      Cells:
      - Row: 3
        Coll: 0
    - DelayTime: 0.5
      Distance: 0.3
      MoveSpeed: 6
      Index: 0
      Offset: {x: 0, y: 0}
      FlipX: 0
      FlipY: 0
      Cells:
      - Row: 4
        Coll: 0
    - DelayTime: 0.5
      Distance: 0.3
      MoveSpeed: 6
      Index: 0
      Offset: {x: 0, y: 0}
      FlipX: 0
      FlipY: 0
      Cells:
      - Row: 5
        Coll: 0
    - DelayTime: 0.5
      Distance: 0.3
      MoveSpeed: 6
      Index: 0
      Offset: {x: 0, y: 0}
      FlipX: 0
      FlipY: 0
      Cells:
      - Row: 6
        Coll: 0
    - DelayTime: 0.5
      Distance: 0.3
      MoveSpeed: 6
      Index: 0
      Offset: {x: 0, y: 0}
      FlipX: 1
      FlipY: 0
      Cells:
      - Row: 3
        Coll: 4
    - DelayTime: 0.5
      Distance: 0.3
      MoveSpeed: 6
      Index: 0
      Offset: {x: 0, y: 0}
      FlipX: 1
      FlipY: 0
      Cells:
      - Row: 3
        Coll: 5
    - DelayTime: 0.5
      Distance: 0.3
      MoveSpeed: 6
      Index: 0
      Offset: {x: 0, y: 0}
      FlipX: 1
      FlipY: 0
      Cells:
      - Row: 3
        Coll: 6
    - DelayTime: 0.5
      Distance: 0.3
      MoveSpeed: 6
      Index: 0
      Offset: {x: 0, y: 0}
      FlipX: 1
      FlipY: 0
      Cells:
      - Row: 4
        Coll: 4
    - DelayTime: 0.5
      Distance: 0.3
      MoveSpeed: 6
      Index: 0
      Offset: {x: 0, y: 0}
      FlipX: 1
      FlipY: 0
      Cells:
      - Row: 4
        Coll: 5
    - DelayTime: 0.5
      Distance: 0.3
      MoveSpeed: 6
      Index: 0
      Offset: {x: 0, y: 0}
      FlipX: 1
      FlipY: 0
      Cells:
      - Row: 4
        Coll: 6
    - DelayTime: 0.5
      Distance: 0.3
      MoveSpeed: 6
      Index: 0
      Offset: {x: 0, y: 0}
      FlipX: 1
      FlipY: 0
      Cells:
      - Row: 5
        Coll: 6
    - DelayTime: 0.5
      Distance: 0.3
      MoveSpeed: 6
      Index: 0
      Offset: {x: 0, y: 0}
      FlipX: 1
      FlipY: 0
      Cells:
      - Row: 6
        Coll: 6
    Enemies:
    - Rows:
      - EnemyId: -1
        PathId: 0
      - EnemyId: -1
        PathId: 0
      - EnemyId: -1
        PathId: 0
      - EnemyId: 30
        PathId: 0
      - EnemyId: -1
        PathId: 0
      - EnemyId: -1
        PathId: 0
      - EnemyId: -1
        PathId: 0
    - Rows:
      - EnemyId: -1
        PathId: 0
      - EnemyId: 31
        PathId: 0
      - EnemyId: -1
        PathId: 0
      - EnemyId: 30
        PathId: 0
      - EnemyId: -1
        PathId: 0
      - EnemyId: 31
        PathId: 0
      - EnemyId: -1
        PathId: 0
    - Rows:
      - EnemyId: -1
        PathId: 0
      - EnemyId: -1
        PathId: 0
      - EnemyId: -1
        PathId: 0
      - EnemyId: 30
        PathId: 0
      - EnemyId: -1
        PathId: 0
      - EnemyId: -1
        PathId: 0
      - EnemyId: -1
        PathId: 0
    - Rows:
      - EnemyId: 30
        PathId: 0
      - EnemyId: 29
        PathId: 0
      - EnemyId: 29
        PathId: 0
      - EnemyId: 29
        PathId: 0
      - EnemyId: 29
        PathId: 0
      - EnemyId: 22
        PathId: 0
      - EnemyId: 30
        PathId: 0
    - Rows:
      - EnemyId: 30
        PathId: 0
      - EnemyId: 22
        PathId: 0
      - EnemyId: 22
        PathId: 0
      - EnemyId: 29
        PathId: 0
      - EnemyId: 22
        PathId: 0
      - EnemyId: 22
        PathId: 0
      - EnemyId: 30
        PathId: 0
    - Rows:
      - EnemyId: 22
        PathId: 0
      - EnemyId: -1
        PathId: 0
      - EnemyId: -1
        PathId: 0
      - EnemyId: 29
        PathId: 0
      - EnemyId: -1
        PathId: 0
      - EnemyId: -1
        PathId: 0
      - EnemyId: 30
        PathId: 0
    - Rows:
      - EnemyId: 30
        PathId: 0
      - EnemyId: -1
        PathId: 0
      - EnemyId: -1
        PathId: 0
      - EnemyId: -1
        PathId: 0
      - EnemyId: -1
        PathId: 0
      - EnemyId: -1
        PathId: 0
      - EnemyId: 30
        PathId: 0
    GiftBox:
      NumGiftBox: 0
      Duration: 0
      Speed: 0
    NumEnemyAttack: 1
    SpeedMoveAttack: 5
    DistanceTimeAttack: 0.3
    LoopTimeAttack: 2
    CombatDiff:
      TimeFireRate: 0
      FireRateDecrease: 0
      TimeEnemyAttack: 0
      EnemyAttackDecease: 0
      IsIncreaseNumberFire: 0
      TimeIncreaseNumberFire: 0
    Boss:
      BossIndex: 1
      Hps: []
    Rock:
      StartPosition: {x: 0, y: 0, z: 0}
      EndPosition: {x: 0, y: 0, z: 0}
      Range: 3
      Speed: 3
      NumSmall: 0
      NumNormal: 0
      NumBig: 0
      Duration: 5
    UseWarning: 0
    WarningPositions: []
    IsShow: 1
  - WaveType: 1
    FireRate: 1
    Hp: 1
    Items:
      List: []
      NumEnemiesCanHaveItem: 0
    HasPower: 0
    NoDam: 0
    IsTeam: 1
    DestroyOnFinish: 0
    IdleType: 0
    TimeMove: 1
    Ease: 0
    Paths: []
    Enemies:
    - Rows:
      - EnemyId: -1
        PathId: 0
      - EnemyId: -1
        PathId: 0
      - EnemyId: -1
        PathId: 0
      - EnemyId: -1
        PathId: 0
      - EnemyId: -1
        PathId: 0
      - EnemyId: -1
        PathId: 0
      - EnemyId: -1
        PathId: 0
    - Rows:
      - EnemyId: -1
        PathId: 0
      - EnemyId: -1
        PathId: 0
      - EnemyId: -1
        PathId: 0
      - EnemyId: -1
        PathId: 0
      - EnemyId: -1
        PathId: 0
      - EnemyId: -1
        PathId: 0
      - EnemyId: -1
        PathId: 0
    - Rows:
      - EnemyId: -1
        PathId: 0
      - EnemyId: -1
        PathId: 0
      - EnemyId: -1
        PathId: 0
      - EnemyId: -1
        PathId: 0
      - EnemyId: -1
        PathId: 0
      - EnemyId: -1
        PathId: 0
      - EnemyId: -1
        PathId: 0
    - Rows:
      - EnemyId: -1
        PathId: 0
      - EnemyId: -1
        PathId: 0
      - EnemyId: -1
        PathId: 0
      - EnemyId: -1
        PathId: 0
      - EnemyId: -1
        PathId: 0
      - EnemyId: -1
        PathId: 0
      - EnemyId: -1
        PathId: 0
    - Rows:
      - EnemyId: -1
        PathId: 0
      - EnemyId: -1
        PathId: 0
      - EnemyId: -1
        PathId: 0
      - EnemyId: -1
        PathId: 0
      - EnemyId: -1
        PathId: 0
      - EnemyId: -1
        PathId: 0
      - EnemyId: -1
        PathId: 0
    - Rows:
      - EnemyId: -1
        PathId: 0
      - EnemyId: -1
        PathId: 0
      - EnemyId: -1
        PathId: 0
      - EnemyId: -1
        PathId: 0
      - EnemyId: -1
        PathId: 0
      - EnemyId: -1
        PathId: 0
      - EnemyId: -1
        PathId: 0
    - Rows:
      - EnemyId: -1
        PathId: 0
      - EnemyId: -1
        PathId: 0
      - EnemyId: -1
        PathId: 0
      - EnemyId: -1
        PathId: 0
      - EnemyId: -1
        PathId: 0
      - EnemyId: -1
        PathId: 0
      - EnemyId: -1
        PathId: 0
    GiftBox:
      NumGiftBox: 0
      Duration: 0
      Speed: 0
    NumEnemyAttack: 0
    SpeedMoveAttack: 5
    DistanceTimeAttack: 0.3
    LoopTimeAttack: 2
    CombatDiff:
      TimeFireRate: 0
      FireRateDecrease: 0
      TimeEnemyAttack: 0
      EnemyAttackDecease: 0
      IsIncreaseNumberFire: 0
      TimeIncreaseNumberFire: 0
    Boss:
      BossIndex: 1
      Hps: []
    Rock:
      StartPosition: {x: 1.0160604, y: 7.007311, z: 0}
      EndPosition: {x: -1.6941954, y: -10.000137, z: 0}
      Range: 3.9810257
      Speed: 5
      NumSmall: 15
      NumNormal: 15
      NumBig: 15
      Duration: 5
    UseWarning: 0
    WarningPositions: []
    IsShow: 1
  - WaveType: 0
    FireRate: 1
    Hp: 1
    Items:
      List:
      - Type: 1
        Num: 1
      NumEnemiesCanHaveItem: 12
    HasPower: 0
    NoDam: 0
    IsTeam: 1
    DestroyOnFinish: 0
    IdleType: 10
    TimeMove: 1
    Ease: 0
    Paths:
    - DelayTime: 0
      Distance: 0.3
      MoveSpeed: 8
      Index: 7
      Offset: {x: 0, y: 0}
      FlipX: 0
      FlipY: 0
      Cells:
      - Row: 3
        Coll: 3
    - DelayTime: 0
      Distance: 0.3
      MoveSpeed: 8
      Index: 7
      Offset: {x: 0, y: 0}
      FlipX: 0
      FlipY: 0
      Cells:
      - Row: 2
        Coll: 2
    - DelayTime: 0
      Distance: 0.3
      MoveSpeed: 8
      Index: 7
      Offset: {x: 0, y: 0}
      FlipX: 0
      FlipY: 0
      Cells:
      - Row: 2
        Coll: 3
    - DelayTime: 0
      Distance: 0.3
      MoveSpeed: 8
      Index: 7
      Offset: {x: 0, y: 0}
      FlipX: 0
      FlipY: 0
      Cells:
      - Row: 2
        Coll: 4
    - DelayTime: 0
      Distance: 0.3
      MoveSpeed: 8
      Index: 7
      Offset: {x: 0, y: 0}
      FlipX: 0
      FlipY: 0
      Cells:
      - Row: 3
        Coll: 4
    - DelayTime: 0
      Distance: 0.3
      MoveSpeed: 8
      Index: 7
      Offset: {x: 0, y: 0}
      FlipX: 0
      FlipY: 0
      Cells:
      - Row: 4
        Coll: 4
    - DelayTime: 0
      Distance: 0.3
      MoveSpeed: 8
      Index: 7
      Offset: {x: 0, y: 0}
      FlipX: 0
      FlipY: 0
      Cells:
      - Row: 4
        Coll: 3
    - DelayTime: 0
      Distance: 0.3
      MoveSpeed: 8
      Index: 7
      Offset: {x: 0, y: 0}
      FlipX: 0
      FlipY: 0
      Cells:
      - Row: 4
        Coll: 2
    - DelayTime: 0
      Distance: 0.3
      MoveSpeed: 8
      Index: 7
      Offset: {x: 0, y: 0}
      FlipX: 0
      FlipY: 0
      Cells:
      - Row: 3
        Coll: 2
    - DelayTime: 1
      Distance: 0.3
      MoveSpeed: 8
      Index: 7
      Offset: {x: 0, y: 0}
      FlipX: 0
      FlipY: 0
      Cells:
      - Row: 0
        Coll: 3
    - DelayTime: 1
      Distance: 0.3
      MoveSpeed: 8
      Index: 7
      Offset: {x: 0, y: 0}
      FlipX: 0
      FlipY: 0
      Cells:
      - Row: 6
        Coll: 3
    - DelayTime: 1
      Distance: 0.3
      MoveSpeed: 8
      Index: 15
      Offset: {x: 0, y: 0}
      FlipX: 0
      FlipY: 0
      Cells:
      - Row: 3
        Coll: 6
    - DelayTime: 1
      Distance: 0.3
      MoveSpeed: 8
      Index: 15
      Offset: {x: 0, y: 0}
      FlipX: 1
      FlipY: 0
      Cells:
      - Row: 3
        Coll: 0
    - DelayTime: 1
      Distance: 0.3
      MoveSpeed: 8
      Index: 14
      Offset: {x: 0, y: 0}
      FlipX: 1
      FlipY: 0
      Cells:
      - Row: 0
        Coll: 0
    - DelayTime: 1
      Distance: 0.3
      MoveSpeed: 8
      Index: 14
      Offset: {x: 0, y: 0}
      FlipX: 1
      FlipY: 0
      Cells:
      - Row: 1
        Coll: 1
    - DelayTime: 1
      Distance: 0.3
      MoveSpeed: 8
      Index: 14
      Offset: {x: 0, y: 0}
      FlipX: 1
      FlipY: 0
      Cells:
      - Row: 0
        Coll: 2
    - DelayTime: 1
      Distance: 0.3
      MoveSpeed: 8
      Index: 14
      Offset: {x: 0, y: 0}
      FlipX: 1
      FlipY: 0
      Cells:
      - Row: 2
        Coll: 0
    - DelayTime: 1
      Distance: 0.3
      MoveSpeed: 8
      Index: 14
      Offset: {x: 0, y: 0}
      FlipX: 0
      FlipY: 0
      Cells:
      - Row: 0
        Coll: 4
    - DelayTime: 1
      Distance: 0.3
      MoveSpeed: 8
      Index: 14
      Offset: {x: 0, y: 0}
      FlipX: 0
      FlipY: 0
      Cells:
      - Row: 1
        Coll: 5
    - DelayTime: 1
      Distance: 0.3
      MoveSpeed: 8
      Index: 14
      Offset: {x: 0, y: 0}
      FlipX: 0
      FlipY: 0
      Cells:
      - Row: 2
        Coll: 6
    - DelayTime: 1
      Distance: 0.3
      MoveSpeed: 8
      Index: 14
      Offset: {x: 0, y: 0}
      FlipX: 0
      FlipY: 0
      Cells:
      - Row: 0
        Coll: 6
    - DelayTime: 1
      Distance: 0.3
      MoveSpeed: 8
      Index: 0
      Offset: {x: 0, y: 0}
      FlipX: 1
      FlipY: 0
      Cells:
      - Row: 4
        Coll: 6
    - DelayTime: 1
      Distance: 0.3
      MoveSpeed: 8
      Index: 0
      Offset: {x: 0, y: 0}
      FlipX: 1
      FlipY: 0
      Cells:
      - Row: 5
        Coll: 5
    - DelayTime: 1
      Distance: 0.3
      MoveSpeed: 8
      Index: 0
      Offset: {x: 0, y: 0}
      FlipX: 1
      FlipY: 0
      Cells:
      - Row: 6
        Coll: 4
    - DelayTime: 1
      Distance: 0.3
      MoveSpeed: 8
      Index: 0
      Offset: {x: 0, y: 0}
      FlipX: 1
      FlipY: 0
      Cells:
      - Row: 6
        Coll: 6
    - DelayTime: 1
      Distance: 0.3
      MoveSpeed: 8
      Index: 0
      Offset: {x: 0, y: 0}
      FlipX: 0
      FlipY: 0
      Cells:
      - Row: 4
        Coll: 0
    - DelayTime: 1
      Distance: 0.3
      MoveSpeed: 8
      Index: 0
      Offset: {x: 0, y: 0}
      FlipX: 0
      FlipY: 0
      Cells:
      - Row: 5
        Coll: 1
    - DelayTime: 1
      Distance: 0.3
      MoveSpeed: 8
      Index: 0
      Offset: {x: 0, y: 0}
      FlipX: 0
      FlipY: 0
      Cells:
      - Row: 6
        Coll: 2
    - DelayTime: 1
      Distance: 0.3
      MoveSpeed: 8
      Index: 0
      Offset: {x: 0, y: 0}
      FlipX: 0
      FlipY: 0
      Cells:
      - Row: 6
        Coll: 0
    Enemies:
    - Rows:
      - EnemyId: 22
        PathId: 0
      - EnemyId: -1
        PathId: 0
      - EnemyId: 29
        PathId: 0
      - EnemyId: 29
        PathId: 0
      - EnemyId: 29
        PathId: 0
      - EnemyId: -1
        PathId: 0
      - EnemyId: 22
        PathId: 0
    - Rows:
      - EnemyId: -1
        PathId: 0
      - EnemyId: 29
        PathId: 0
      - EnemyId: -1
        PathId: 0
      - EnemyId: -1
        PathId: 0
      - EnemyId: -1
        PathId: 0
      - EnemyId: 29
        PathId: 0
      - EnemyId: -1
        PathId: 0
    - Rows:
      - EnemyId: 29
        PathId: 0
      - EnemyId: -1
        PathId: 0
      - EnemyId: 30
        PathId: 0
      - EnemyId: 30
        PathId: 0
      - EnemyId: 30
        PathId: 0
      - EnemyId: -1
        PathId: 0
      - EnemyId: 29
        PathId: 0
    - Rows:
      - EnemyId: 29
        PathId: 0
      - EnemyId: -1
        PathId: 0
      - EnemyId: 30
        PathId: 0
      - EnemyId: 22
        PathId: 0
      - EnemyId: 30
        PathId: 0
      - EnemyId: -1
        PathId: 0
      - EnemyId: 29
        PathId: 0
    - Rows:
      - EnemyId: 29
        PathId: 0
      - EnemyId: -1
        PathId: 0
      - EnemyId: 30
        PathId: 0
      - EnemyId: 30
        PathId: 0
      - EnemyId: 30
        PathId: 0
      - EnemyId: -1
        PathId: 0
      - EnemyId: 29
        PathId: 0
    - Rows:
      - EnemyId: -1
        PathId: 0
      - EnemyId: 29
        PathId: 0
      - EnemyId: -1
        PathId: 0
      - EnemyId: -1
        PathId: 0
      - EnemyId: -1
        PathId: 0
      - EnemyId: 29
        PathId: 0
      - EnemyId: -1
        PathId: 0
    - Rows:
      - EnemyId: 22
        PathId: 0
      - EnemyId: -1
        PathId: 0
      - EnemyId: 29
        PathId: 0
      - EnemyId: 29
        PathId: 0
      - EnemyId: 29
        PathId: 0
      - EnemyId: -1
        PathId: 0
      - EnemyId: 22
        PathId: 0
    GiftBox:
      NumGiftBox: 0
      Duration: 0
      Speed: 0
    NumEnemyAttack: 3
    SpeedMoveAttack: 5
    DistanceTimeAttack: 0.3
    LoopTimeAttack: 2
    CombatDiff:
      TimeFireRate: 3
      FireRateDecrease: 0.1
      TimeEnemyAttack: 0
      EnemyAttackDecease: 0
      IsIncreaseNumberFire: 0
      TimeIncreaseNumberFire: 0
    Boss:
      BossIndex: 1
      Hps: []
    Rock:
      StartPosition: {x: 0, y: 0, z: 0}
      EndPosition: {x: 0, y: 0, z: 0}
      Range: 3
      Speed: 3
      NumSmall: 0
      NumNormal: 0
      NumBig: 0
      Duration: 5
    UseWarning: 0
    WarningPositions: []
    IsShow: 1
  - WaveType: 0
    FireRate: 2
    Hp: 1
    Items:
      List:
      - Type: 0
        Num: 1
      NumEnemiesCanHaveItem: 3
    HasPower: 0
    NoDam: 0
    IsTeam: 0
    DestroyOnFinish: 0
    IdleType: 8
    TimeMove: 1
    Ease: 0
    Paths:
    - DelayTime: 0
      Distance: 0.3
      MoveSpeed: 7
      Index: 12
      Offset: {x: 0, y: 0}
      FlipX: 0
      FlipY: 0
      Cells:
      - Row: 0
        Coll: 0
      - Row: 1
        Coll: 0
      - Row: 2
        Coll: 0
      - Row: 3
        Coll: 0
      - Row: 4
        Coll: 0
      - Row: 5
        Coll: 0
      - Row: 6
        Coll: 0
      - Row: 0
        Coll: 1
      - Row: 1
        Coll: 1
      - Row: 2
        Coll: 1
      - Row: 3
        Coll: 1
      - Row: 4
        Coll: 1
      - Row: 5
        Coll: 1
      - Row: 6
        Coll: 1
      - Row: 6
        Coll: 2
      - Row: 5
        Coll: 2
    - DelayTime: 0
      Distance: 0.3
      MoveSpeed: 7
      Index: 12
      Offset: {x: 0, y: 0}
      FlipX: 1
      FlipY: 0
      Cells:
      - Row: 0
        Coll: 6
      - Row: 1
        Coll: 6
      - Row: 2
        Coll: 6
      - Row: 3
        Coll: 6
      - Row: 4
        Coll: 6
      - Row: 5
        Coll: 6
      - Row: 6
        Coll: 6
      - Row: 0
        Coll: 5
      - Row: 1
        Coll: 5
      - Row: 2
        Coll: 5
      - Row: 3
        Coll: 5
      - Row: 4
        Coll: 5
      - Row: 5
        Coll: 5
      - Row: 6
        Coll: 5
      - Row: 6
        Coll: 4
      - Row: 5
        Coll: 4
    Enemies:
    - Rows:
      - EnemyId: 29
        PathId: 0
      - EnemyId: 30
        PathId: 0
      - EnemyId: -1
        PathId: 0
      - EnemyId: -1
        PathId: 0
      - EnemyId: -1
        PathId: 0
      - EnemyId: 30
        PathId: 0
      - EnemyId: 29
        PathId: 0
    - Rows:
      - EnemyId: 29
        PathId: 0
      - EnemyId: 29
        PathId: 0
      - EnemyId: -1
        PathId: 0
      - EnemyId: -1
        PathId: 0
      - EnemyId: -1
        PathId: 0
      - EnemyId: 29
        PathId: 0
      - EnemyId: 29
        PathId: 0
    - Rows:
      - EnemyId: 29
        PathId: 0
      - EnemyId: 29
        PathId: 0
      - EnemyId: -1
        PathId: 0
      - EnemyId: -1
        PathId: 0
      - EnemyId: -1
        PathId: 0
      - EnemyId: 29
        PathId: 0
      - EnemyId: 29
        PathId: 0
    - Rows:
      - EnemyId: 29
        PathId: 0
      - EnemyId: 29
        PathId: 0
      - EnemyId: -1
        PathId: 0
      - EnemyId: -1
        PathId: 0
      - EnemyId: -1
        PathId: 0
      - EnemyId: 29
        PathId: 0
      - EnemyId: 29
        PathId: 0
    - Rows:
      - EnemyId: 30
        PathId: 0
      - EnemyId: 29
        PathId: 0
      - EnemyId: -1
        PathId: 0
      - EnemyId: -1
        PathId: 0
      - EnemyId: -1
        PathId: 0
      - EnemyId: 29
        PathId: 0
      - EnemyId: 30
        PathId: 0
    - Rows:
      - EnemyId: 30
        PathId: 0
      - EnemyId: 22
        PathId: 0
      - EnemyId: 22
        PathId: 0
      - EnemyId: -1
        PathId: 0
      - EnemyId: 22
        PathId: 0
      - EnemyId: 22
        PathId: 0
      - EnemyId: 30
        PathId: 0
    - Rows:
      - EnemyId: 30
        PathId: 0
      - EnemyId: 22
        PathId: 0
      - EnemyId: 22
        PathId: 0
      - EnemyId: -1
        PathId: 0
      - EnemyId: 22
        PathId: 0
      - EnemyId: 22
        PathId: 0
      - EnemyId: 30
        PathId: 0
    GiftBox:
      NumGiftBox: 0
      Duration: 0
      Speed: 0
    NumEnemyAttack: 2
    SpeedMoveAttack: 15
    DistanceTimeAttack: 0.3
    LoopTimeAttack: 2
    CombatDiff:
      TimeFireRate: 0
      FireRateDecrease: 0
      TimeEnemyAttack: 5
      EnemyAttackDecease: 0.2
      IsIncreaseNumberFire: 0
      TimeIncreaseNumberFire: 0
    Boss:
      BossIndex: 1
      Hps: []
    Rock:
      StartPosition: {x: 0, y: 0, z: 0}
      EndPosition: {x: 0, y: 0, z: 0}
      Range: 3
      Speed: 3
      NumSmall: 0
      NumNormal: 0
      NumBig: 0
      Duration: 5
    UseWarning: 0
    WarningPositions: []
    IsShow: 1
  - WaveType: 0
    FireRate: 1
    Hp: 1
    Items:
      List:
      - Type: 1
        Num: 1
      NumEnemiesCanHaveItem: 10
    HasPower: 0
    NoDam: 0
    IsTeam: 1
    DestroyOnFinish: 1
    IdleType: 1
    TimeMove: 1
    Ease: 0
    Paths:
    - DelayTime: 0
      Distance: 0.3
      MoveSpeed: 6
      Index: 0
      Offset: {x: 0, y: 0}
      FlipX: 0
      FlipY: 0
      Cells:
      - Row: 4
        Coll: 0
    - DelayTime: 0
      Distance: 0.3
      MoveSpeed: 6
      Index: 0
      Offset: {x: 0, y: 0}
      FlipX: 0
      FlipY: 0
      Cells:
      - Row: 4
        Coll: 1
    - DelayTime: 0
      Distance: 0.3
      MoveSpeed: 6
      Index: 0
      Offset: {x: 0, y: 0}
      FlipX: 0
      FlipY: 0
      Cells:
      - Row: 5
        Coll: 0
    - DelayTime: 0
      Distance: 0.3
      MoveSpeed: 6
      Index: 0
      Offset: {x: 0, y: 0}
      FlipX: 0
      FlipY: 0
      Cells:
      - Row: 6
        Coll: 1
    - DelayTime: 0
      Distance: 0.3
      MoveSpeed: 6
      Index: 0
      Offset: {x: 0, y: 0}
      FlipX: 0
      FlipY: 0
      Cells:
      - Row: 5
        Coll: 1
    - DelayTime: 0
      Distance: 0.3
      MoveSpeed: 6
      Index: 0
      Offset: {x: 0, y: 0}
      FlipX: 0
      FlipY: 0
      Cells:
      - Row: 6
        Coll: 0
    - DelayTime: 0
      Distance: 0.3
      MoveSpeed: 6
      Index: 0
      Offset: {x: 0, y: 0}
      FlipX: 0
      FlipY: 0
      Cells:
      - Row: 5
        Coll: 2
    - DelayTime: 1
      Distance: 0.3
      MoveSpeed: 6
      Index: 0
      Offset: {x: 0, y: 0}
      FlipX: 1
      FlipY: 0
      Cells:
      - Row: 3
        Coll: 4
    - DelayTime: 1
      Distance: 0.3
      MoveSpeed: 6
      Index: 0
      Offset: {x: 0, y: 0}
      FlipX: 1
      FlipY: 0
      Cells:
      - Row: 3
        Coll: 5
    - DelayTime: 1
      Distance: 0.3
      MoveSpeed: 6
      Index: 0
      Offset: {x: 0, y: 0}
      FlipX: 1
      FlipY: 0
      Cells:
      - Row: 3
        Coll: 6
    - DelayTime: 1
      Distance: 0.3
      MoveSpeed: 6
      Index: 0
      Offset: {x: 0, y: 0}
      FlipX: 1
      FlipY: 0
      Cells:
      - Row: 4
        Coll: 5
    - DelayTime: 1
      Distance: 0.3
      MoveSpeed: 6
      Index: 0
      Offset: {x: 0, y: 0}
      FlipX: 1
      FlipY: 0
      Cells:
      - Row: 4
        Coll: 6
    - DelayTime: 1
      Distance: 0.3
      MoveSpeed: 6
      Index: 0
      Offset: {x: 0, y: 0}
      FlipX: 1
      FlipY: 0
      Cells:
      - Row: 5
        Coll: 4
    - DelayTime: 1
      Distance: 0.3
      MoveSpeed: 6
      Index: 0
      Offset: {x: 0, y: 0}
      FlipX: 1
      FlipY: 0
      Cells:
      - Row: 5
        Coll: 5
    - DelayTime: 1
      Distance: 0.3
      MoveSpeed: 6
      Index: 0
      Offset: {x: 0, y: 0}
      FlipX: 1
      FlipY: 0
      Cells:
      - Row: 5
        Coll: 6
    - DelayTime: 1
      Distance: 0.3
      MoveSpeed: 6
      Index: 0
      Offset: {x: 0, y: 0}
      FlipX: 1
      FlipY: 0
      Cells:
      - Row: 6
        Coll: 5
    - DelayTime: 0
      Distance: 0.3
      MoveSpeed: 6
      Index: 0
      Offset: {x: 0, y: 0}
      FlipX: 1
      FlipY: 0
      Cells:
      - Row: 6
        Coll: 6
    - DelayTime: 0
      Distance: 0.3
      MoveSpeed: 6
      Index: 14
      Offset: {x: 0, y: 0}
      FlipX: 0
      FlipY: 0
      Cells:
      - Row: 0
        Coll: 5
    - DelayTime: 0
      Distance: 0.3
      MoveSpeed: 6
      Index: 14
      Offset: {x: 0, y: 0}
      FlipX: 0
      FlipY: 0
      Cells:
      - Row: 0
        Coll: 6
    - DelayTime: 0
      Distance: 0.3
      MoveSpeed: 6
      Index: 14
      Offset: {x: 0, y: 0}
      FlipX: 0
      FlipY: 0
      Cells:
      - Row: 1
        Coll: 4
    - DelayTime: 0
      Distance: 0.3
      MoveSpeed: 6
      Index: 14
      Offset: {x: 0, y: 0}
      FlipX: 0
      FlipY: 0
      Cells:
      - Row: 1
        Coll: 5
    - DelayTime: 0
      Distance: 0.3
      MoveSpeed: 6
      Index: 14
      Offset: {x: 0, y: 0}
      FlipX: 0
      FlipY: 0
      Cells:
      - Row: 1
        Coll: 6
    - DelayTime: 0
      Distance: 0.3
      MoveSpeed: 6
      Index: 14
      Offset: {x: 0, y: 0}
      FlipX: 0
      FlipY: 0
      Cells:
      - Row: 2
        Coll: 5
    - DelayTime: 0
      Distance: 0.3
      MoveSpeed: 6
      Index: 14
      Offset: {x: 0, y: 0}
      FlipX: 0
      FlipY: 0
      Cells:
      - Row: 2
        Coll: 6
    - DelayTime: 1
      Distance: 0.3
      MoveSpeed: 6
      Index: 14
      Offset: {x: 0, y: 0}
      FlipX: 1
      FlipY: 0
      Cells:
      - Row: 0
        Coll: 1
    - DelayTime: 1
      Distance: 0.3
      MoveSpeed: 6
      Index: 14
      Offset: {x: 0, y: 0}
      FlipX: 1
      FlipY: 0
      Cells:
      - Row: 0
        Coll: 0
    - DelayTime: 1
      Distance: 0.3
      MoveSpeed: 6
      Index: 14
      Offset: {x: 0, y: 0}
      FlipX: 1
      FlipY: 0
      Cells:
      - Row: 1
        Coll: 1
    - DelayTime: 1
      Distance: 0.3
      MoveSpeed: 6
      Index: 14
      Offset: {x: 0, y: 0}
      FlipX: 1
      FlipY: 0
      Cells:
      - Row: 1
        Coll: 0
    - DelayTime: 1
      Distance: 0.3
      MoveSpeed: 6
      Index: 14
      Offset: {x: 0, y: 0}
      FlipX: 1
      FlipY: 0
      Cells:
      - Row: 1
        Coll: 2
    - DelayTime: 1
      Distance: 0.3
      MoveSpeed: 6
      Index: 14
      Offset: {x: 0, y: 0}
      FlipX: 1
      FlipY: 0
      Cells:
      - Row: 2
        Coll: 0
    - DelayTime: 1
      Distance: 0.3
      MoveSpeed: 6
      Index: 14
      Offset: {x: 0, y: 0}
      FlipX: 1
      FlipY: 0
      Cells:
      - Row: 2
        Coll: 1
    - DelayTime: 1
      Distance: 0.3
      MoveSpeed: 6
      Index: 14
      Offset: {x: 0, y: 0}
      FlipX: 1
      FlipY: 0
      Cells:
      - Row: 3
        Coll: 0
    - DelayTime: 1
      Distance: 0.3
      MoveSpeed: 6
      Index: 14
      Offset: {x: 0, y: 0}
      FlipX: 1
      FlipY: 0
      Cells:
      - Row: 3
        Coll: 1
    - DelayTime: 1
      Distance: 0.3
      MoveSpeed: 6
      Index: 14
      Offset: {x: 0, y: 0}
      FlipX: 1
      FlipY: 0
      Cells:
      - Row: 3
        Coll: 2
    Enemies:
    - Rows:
      - EnemyId: 29
        PathId: 0
      - EnemyId: 30
        PathId: 0
      - EnemyId: -1
        PathId: 0
      - EnemyId: -1
        PathId: 0
      - EnemyId: -1
        PathId: 0
      - EnemyId: 30
        PathId: 0
      - EnemyId: 29
        PathId: 0
    - Rows:
      - EnemyId: 29
        PathId: 0
      - EnemyId: 30
        PathId: 0
      - EnemyId: 31
        PathId: 0
      - EnemyId: -1
        PathId: 0
      - EnemyId: 31
        PathId: 0
      - EnemyId: 30
        PathId: 0
      - EnemyId: 29
        PathId: 0
    - Rows:
      - EnemyId: 29
        PathId: 0
      - EnemyId: 30
        PathId: 0
      - EnemyId: -1
        PathId: 0
      - EnemyId: -1
        PathId: 0
      - EnemyId: -1
        PathId: 0
      - EnemyId: 30
        PathId: 0
      - EnemyId: 29
        PathId: 0
    - Rows:
      - EnemyId: 29
        PathId: 0
      - EnemyId: 30
        PathId: 0
      - EnemyId: 31
        PathId: 0
      - EnemyId: -1
        PathId: 0
      - EnemyId: 31
        PathId: 0
      - EnemyId: 30
        PathId: 0
      - EnemyId: 29
        PathId: 0
    - Rows:
      - EnemyId: 29
        PathId: 0
      - EnemyId: 30
        PathId: 0
      - EnemyId: -1
        PathId: 0
      - EnemyId: -1
        PathId: 0
      - EnemyId: -1
        PathId: 0
      - EnemyId: 30
        PathId: 0
      - EnemyId: 29
        PathId: 0
    - Rows:
      - EnemyId: 29
        PathId: 0
      - EnemyId: 30
        PathId: 0
      - EnemyId: 31
        PathId: 0
      - EnemyId: -1
        PathId: 0
      - EnemyId: 31
        PathId: 0
      - EnemyId: 30
        PathId: 0
      - EnemyId: 29
        PathId: 0
    - Rows:
      - EnemyId: 29
        PathId: 0
      - EnemyId: 30
        PathId: 0
      - EnemyId: -1
        PathId: 0
      - EnemyId: -1
        PathId: 0
      - EnemyId: -1
        PathId: 0
      - EnemyId: 30
        PathId: 0
      - EnemyId: 29
        PathId: 0
    GiftBox:
      NumGiftBox: 0
      Duration: 0
      Speed: 0
    NumEnemyAttack: 3
    SpeedMoveAttack: 5
    DistanceTimeAttack: 0.3
    LoopTimeAttack: 2
    CombatDiff:
      TimeFireRate: 5
      FireRateDecrease: 0.1
      TimeEnemyAttack: 0
      EnemyAttackDecease: 0
      IsIncreaseNumberFire: 0
      TimeIncreaseNumberFire: 0
    Boss:
      BossIndex: 1
      Hps: []
    Rock:
      StartPosition: {x: 0, y: 0, z: 0}
      EndPosition: {x: 0, y: 0, z: 0}
      Range: 3
      Speed: 3
      NumSmall: 0
      NumNormal: 0
      NumBig: 0
      Duration: 5
    UseWarning: 0
    WarningPositions: []
    IsShow: 1
  - WaveType: 0
    FireRate: 1
    Hp: 1
    Items:
      List: []
      NumEnemiesCanHaveItem: 0
    HasPower: 0
    NoDam: 0
    IsTeam: 1
    DestroyOnFinish: 0
    IdleType: 8
    TimeMove: 2
    Ease: 0
    Paths:
    - DelayTime: 0
      Distance: 0.5
      MoveSpeed: 7
      Index: 78
      Offset: {x: 0, y: 0}
      FlipX: 0
      FlipY: 0
      Cells:
      - Row: 1
        Coll: 3
      - Row: 1
        Coll: 1
      - Row: 3
        Coll: 1
      - Row: 5
        Coll: 1
    - DelayTime: 0
      Distance: 0.5
      MoveSpeed: 7
      Index: 78
      Offset: {x: 0, y: 0}
      FlipX: 1
      FlipY: 0
      Cells:
      - Row: 1
        Coll: 5
      - Row: 3
        Coll: 5
      - Row: 5
        Coll: 5
      - Row: 5
        Coll: 3
    Enemies:
    - Rows:
      - EnemyId: -1
        PathId: 0
      - EnemyId: -1
        PathId: 0
      - EnemyId: -1
        PathId: 0
      - EnemyId: -1
        PathId: 0
      - EnemyId: -1
        PathId: 0
      - EnemyId: -1
        PathId: 0
      - EnemyId: -1
        PathId: 0
    - Rows:
      - EnemyId: -1
        PathId: 0
      - EnemyId: 31
        PathId: 0
      - EnemyId: -1
        PathId: 0
      - EnemyId: 31
        PathId: 0
      - EnemyId: -1
        PathId: 0
      - EnemyId: 31
        PathId: 0
      - EnemyId: -1
        PathId: 0
    - Rows:
      - EnemyId: -1
        PathId: 0
      - EnemyId: -1
        PathId: 0
      - EnemyId: -1
        PathId: 0
      - EnemyId: -1
        PathId: 0
      - EnemyId: -1
        PathId: 0
      - EnemyId: -1
        PathId: 0
      - EnemyId: -1
        PathId: 0
    - Rows:
      - EnemyId: -1
        PathId: 0
      - EnemyId: 31
        PathId: 0
      - EnemyId: -1
        PathId: 0
      - EnemyId: -1
        PathId: 0
      - EnemyId: -1
        PathId: 0
      - EnemyId: 31
        PathId: 0
      - EnemyId: -1
        PathId: 0
    - Rows:
      - EnemyId: -1
        PathId: 0
      - EnemyId: -1
        PathId: 0
      - EnemyId: -1
        PathId: 0
      - EnemyId: -1
        PathId: 0
      - EnemyId: -1
        PathId: 0
      - EnemyId: -1
        PathId: 0
      - EnemyId: -1
        PathId: 0
    - Rows:
      - EnemyId: -1
        PathId: 0
      - EnemyId: 31
        PathId: 0
      - EnemyId: -1
        PathId: 0
      - EnemyId: 31
        PathId: 0
      - EnemyId: -1
        PathId: 0
      - EnemyId: 31
        PathId: 0
      - EnemyId: -1
        PathId: 0
    - Rows:
      - EnemyId: -1
        PathId: 0
      - EnemyId: -1
        PathId: 0
      - EnemyId: -1
        PathId: 0
      - EnemyId: -1
        PathId: 0
      - EnemyId: -1
        PathId: 0
      - EnemyId: -1
        PathId: 0
      - EnemyId: -1
        PathId: 0
    GiftBox:
      NumGiftBox: 0
      Duration: 0
      Speed: 0
    NumEnemyAttack: 0
    SpeedMoveAttack: 5
    DistanceTimeAttack: 0.3
    LoopTimeAttack: 2
    CombatDiff:
      TimeFireRate: 5
      FireRateDecrease: 0.3
      TimeEnemyAttack: 0
      EnemyAttackDecease: 0
      IsIncreaseNumberFire: 0
      TimeIncreaseNumberFire: 0
    Boss:
      BossIndex: 1
      Hps: []
    Rock:
      StartPosition: {x: 0, y: 0, z: 0}
      EndPosition: {x: 0, y: 0, z: 0}
      Range: 3
      Speed: 3
      NumSmall: 0
      NumNormal: 0
      NumBig: 0
      Duration: 5
    UseWarning: 0
    WarningPositions: []
    IsShow: 1
  - WaveType: 0
    FireRate: 1
    Hp: 1
    Items:
      List:
      - Type: 0
        Num: 1
      - Type: 1
        Num: 1
      NumEnemiesCanHaveItem: 5
    HasPower: 0
    NoDam: 0
    IsTeam: 1
    DestroyOnFinish: 0
    IdleType: 1
    TimeMove: 1
    Ease: 0
    Paths:
    - DelayTime: 0
      Distance: 0.3
      MoveSpeed: 7
      Index: 8
      Offset: {x: 0, y: 0}
      FlipX: 0
      FlipY: 0
      Cells:
      - Row: 0
        Coll: 0
      - Row: 1
        Coll: 0
      - Row: 2
        Coll: 0
      - Row: 3
        Coll: 0
      - Row: 4
        Coll: 0
      - Row: 5
        Coll: 0
      - Row: 6
        Coll: 0
      - Row: 0
        Coll: 1
      - Row: 1
        Coll: 1
      - Row: 2
        Coll: 1
      - Row: 3
        Coll: 1
      - Row: 4
        Coll: 1
      - Row: 5
        Coll: 1
      - Row: 6
        Coll: 1
    - DelayTime: 0
      Distance: 0.3
      MoveSpeed: 7
      Index: 8
      Offset: {x: 0, y: 0}
      FlipX: 1
      FlipY: 0
      Cells:
      - Row: 0
        Coll: 6
      - Row: 1
        Coll: 6
      - Row: 2
        Coll: 6
      - Row: 3
        Coll: 6
      - Row: 4
        Coll: 6
      - Row: 5
        Coll: 6
      - Row: 6
        Coll: 6
      - Row: 0
        Coll: 5
      - Row: 1
        Coll: 5
      - Row: 2
        Coll: 5
      - Row: 3
        Coll: 5
      - Row: 4
        Coll: 5
      - Row: 5
        Coll: 5
      - Row: 6
        Coll: 5
    Enemies:
    - Rows:
      - EnemyId: 30
        PathId: 0
      - EnemyId: 30
        PathId: 0
      - EnemyId: -1
        PathId: 0
      - EnemyId: -1
        PathId: 0
      - EnemyId: -1
        PathId: 0
      - EnemyId: 30
        PathId: 0
      - EnemyId: 30
        PathId: 0
    - Rows:
      - EnemyId: 30
        PathId: 0
      - EnemyId: 29
        PathId: 0
      - EnemyId: -1
        PathId: 0
      - EnemyId: -1
        PathId: 0
      - EnemyId: -1
        PathId: 0
      - EnemyId: 29
        PathId: 0
      - EnemyId: 30
        PathId: 0
    - Rows:
      - EnemyId: 30
        PathId: 0
      - EnemyId: 30
        PathId: 0
      - EnemyId: -1
        PathId: 0
      - EnemyId: -1
        PathId: 0
      - EnemyId: -1
        PathId: 0
      - EnemyId: 30
        PathId: 0
      - EnemyId: 30
        PathId: 0
    - Rows:
      - EnemyId: 22
        PathId: 0
      - EnemyId: 22
        PathId: 0
      - EnemyId: -1
        PathId: 0
      - EnemyId: -1
        PathId: 0
      - EnemyId: -1
        PathId: 0
      - EnemyId: 22
        PathId: 0
      - EnemyId: 22
        PathId: 0
    - Rows:
      - EnemyId: 30
        PathId: 0
      - EnemyId: 30
        PathId: 0
      - EnemyId: -1
        PathId: 0
      - EnemyId: -1
        PathId: 0
      - EnemyId: -1
        PathId: 0
      - EnemyId: 30
        PathId: 0
      - EnemyId: 30
        PathId: 0
    - Rows:
      - EnemyId: 30
        PathId: 0
      - EnemyId: 29
        PathId: 0
      - EnemyId: -1
        PathId: 0
      - EnemyId: -1
        PathId: 0
      - EnemyId: -1
        PathId: 0
      - EnemyId: 29
        PathId: 0
      - EnemyId: 30
        PathId: 0
    - Rows:
      - EnemyId: 30
        PathId: 0
      - EnemyId: 30
        PathId: 0
      - EnemyId: -1
        PathId: 0
      - EnemyId: -1
        PathId: 0
      - EnemyId: -1
        PathId: 0
      - EnemyId: 30
        PathId: 0
      - EnemyId: 30
        PathId: 0
    GiftBox:
      NumGiftBox: 0
      Duration: 0
      Speed: 0
    NumEnemyAttack: 3
    SpeedMoveAttack: 20
    DistanceTimeAttack: 0.3
    LoopTimeAttack: 2
    CombatDiff:
      TimeFireRate: 5
      FireRateDecrease: 0.2
      TimeEnemyAttack: 4
      EnemyAttackDecease: 0.2
      IsIncreaseNumberFire: 0
      TimeIncreaseNumberFire: 0
    Boss:
      BossIndex: 1
      Hps: []
    Rock:
      StartPosition: {x: 0, y: 0, z: 0}
      EndPosition: {x: 0, y: 0, z: 0}
      Range: 3
      Speed: 3
      NumSmall: 0
      NumNormal: 0
      NumBig: 0
      Duration: 5
    UseWarning: 0
    WarningPositions: []
    IsShow: 1
  - WaveType: 1
    FireRate: 1
    Hp: 1
    Items:
      List: []
      NumEnemiesCanHaveItem: 0
    HasPower: 0
    NoDam: 0
    IsTeam: 1
    DestroyOnFinish: 0
    IdleType: 0
    TimeMove: 1
    Ease: 0
    Paths: []
    Enemies:
    - Rows:
      - EnemyId: -1
        PathId: 0
      - EnemyId: -1
        PathId: 0
      - EnemyId: -1
        PathId: 0
      - EnemyId: -1
        PathId: 0
      - EnemyId: -1
        PathId: 0
      - EnemyId: -1
        PathId: 0
      - EnemyId: -1
        PathId: 0
    - Rows:
      - EnemyId: -1
        PathId: 0
      - EnemyId: -1
        PathId: 0
      - EnemyId: -1
        PathId: 0
      - EnemyId: -1
        PathId: 0
      - EnemyId: -1
        PathId: 0
      - EnemyId: -1
        PathId: 0
      - EnemyId: -1
        PathId: 0
    - Rows:
      - EnemyId: -1
        PathId: 0
      - EnemyId: -1
        PathId: 0
      - EnemyId: -1
        PathId: 0
      - EnemyId: -1
        PathId: 0
      - EnemyId: -1
        PathId: 0
      - EnemyId: -1
        PathId: 0
      - EnemyId: -1
        PathId: 0
    - Rows:
      - EnemyId: -1
        PathId: 0
      - EnemyId: -1
        PathId: 0
      - EnemyId: -1
        PathId: 0
      - EnemyId: -1
        PathId: 0
      - EnemyId: -1
        PathId: 0
      - EnemyId: -1
        PathId: 0
      - EnemyId: -1
        PathId: 0
    - Rows:
      - EnemyId: -1
        PathId: 0
      - EnemyId: -1
        PathId: 0
      - EnemyId: -1
        PathId: 0
      - EnemyId: -1
        PathId: 0
      - EnemyId: -1
        PathId: 0
      - EnemyId: -1
        PathId: 0
      - EnemyId: -1
        PathId: 0
    - Rows:
      - EnemyId: -1
        PathId: 0
      - EnemyId: -1
        PathId: 0
      - EnemyId: -1
        PathId: 0
      - EnemyId: -1
        PathId: 0
      - EnemyId: -1
        PathId: 0
      - EnemyId: -1
        PathId: 0
      - EnemyId: -1
        PathId: 0
    - Rows:
      - EnemyId: -1
        PathId: 0
      - EnemyId: -1
        PathId: 0
      - EnemyId: -1
        PathId: 0
      - EnemyId: -1
        PathId: 0
      - EnemyId: -1
        PathId: 0
      - EnemyId: -1
        PathId: 0
      - EnemyId: -1
        PathId: 0
    GiftBox:
      NumGiftBox: 0
      Duration: 0
      Speed: 0
    NumEnemyAttack: 0
    SpeedMoveAttack: 5
    DistanceTimeAttack: 0.3
    LoopTimeAttack: 2
    CombatDiff:
      TimeFireRate: 0
      FireRateDecrease: 0
      TimeEnemyAttack: 0
      EnemyAttackDecease: 0
      IsIncreaseNumberFire: 0
      TimeIncreaseNumberFire: 0
    Boss:
      BossIndex: 1
      Hps: []
    Rock:
      StartPosition: {x: -0.8408767, y: 6.937237, z: 0}
      EndPosition: {x: 1.5632917, y: -8.368713, z: 0}
      Range: 3.9810243
      Speed: 5
      NumSmall: 15
      NumNormal: 15
      NumBig: 15
      Duration: 5
    UseWarning: 0
    WarningPositions:
    - {x: 0, y: 0, z: 0}
    IsShow: 1
  - WaveType: 0
    FireRate: 0.1
    Hp: 1
    Items:
      List:
      - Type: 1
        Num: 1
      NumEnemiesCanHaveItem: 4
    HasPower: 0
    NoDam: 0
    IsTeam: 1
    DestroyOnFinish: 0
    IdleType: 0
    TimeMove: 1
    Ease: 0
    Paths:
    - DelayTime: 0
      Distance: 0.3
      MoveSpeed: 4
      Index: 7
      Offset: {x: 0, y: 0}
      FlipX: 0
      FlipY: 0
      Cells:
      - Row: 0
        Coll: 3
    - DelayTime: 6
      Distance: 0.3
      MoveSpeed: 4
      Index: 7
      Offset: {x: 0, y: 0}
      FlipX: 0
      FlipY: 0
      Cells:
      - Row: 2
        Coll: 3
    - DelayTime: 12
      Distance: 0.3
      MoveSpeed: 4
      Index: 15
      Offset: {x: 0, y: 0}
      FlipX: 0
      FlipY: 0
      Cells:
      - Row: 2
        Coll: 1
    - DelayTime: 12
      Distance: 0.3
      MoveSpeed: 4
      Index: 15
      Offset: {x: 0, y: 0}
      FlipX: 1
      FlipY: 0
      Cells:
      - Row: 2
        Coll: 5
    Enemies:
    - Rows:
      - EnemyId: -1
        PathId: 0
      - EnemyId: -1
        PathId: 0
      - EnemyId: -1
        PathId: 0
      - EnemyId: 31
        PathId: 0
      - EnemyId: -1
        PathId: 0
      - EnemyId: -1
        PathId: 0
      - EnemyId: -1
        PathId: 0
    - Rows:
      - EnemyId: -1
        PathId: 0
      - EnemyId: -1
        PathId: 0
      - EnemyId: -1
        PathId: 0
      - EnemyId: -1
        PathId: 0
      - EnemyId: -1
        PathId: 0
      - EnemyId: -1
        PathId: 0
      - EnemyId: -1
        PathId: 0
    - Rows:
      - EnemyId: -1
        PathId: 0
      - EnemyId: 31
        PathId: 0
      - EnemyId: -1
        PathId: 0
      - EnemyId: 31
        PathId: 0
      - EnemyId: -1
        PathId: 0
      - EnemyId: 31
        PathId: 0
      - EnemyId: -1
        PathId: 0
    - Rows:
      - EnemyId: -1
        PathId: 0
      - EnemyId: -1
        PathId: 0
      - EnemyId: -1
        PathId: 0
      - EnemyId: -1
        PathId: 0
      - EnemyId: -1
        PathId: 0
      - EnemyId: -1
        PathId: 0
      - EnemyId: -1
        PathId: 0
    - Rows:
      - EnemyId: -1
        PathId: 0
      - EnemyId: -1
        PathId: 0
      - EnemyId: -1
        PathId: 0
      - EnemyId: -1
        PathId: 0
      - EnemyId: -1
        PathId: 0
      - EnemyId: -1
        PathId: 0
      - EnemyId: -1
        PathId: 0
    - Rows:
      - EnemyId: -1
        PathId: 0
      - EnemyId: -1
        PathId: 0
      - EnemyId: -1
        PathId: 0
      - EnemyId: -1
        PathId: 0
      - EnemyId: -1
        PathId: 0
      - EnemyId: -1
        PathId: 0
      - EnemyId: -1
        PathId: 0
    - Rows:
      - EnemyId: -1
        PathId: 0
      - EnemyId: -1
        PathId: 0
      - EnemyId: -1
        PathId: 0
      - EnemyId: -1
        PathId: 0
      - EnemyId: -1
        PathId: 0
      - EnemyId: -1
        PathId: 0
      - EnemyId: -1
        PathId: 0
    GiftBox:
      NumGiftBox: 0
      Duration: 0
      Speed: 0
    NumEnemyAttack: 0
    SpeedMoveAttack: 5
    DistanceTimeAttack: 0.3
    LoopTimeAttack: 2
    CombatDiff:
      TimeFireRate: 0
      FireRateDecrease: 0
      TimeEnemyAttack: 0
      EnemyAttackDecease: 0
      IsIncreaseNumberFire: 0
      TimeIncreaseNumberFire: 0
    Boss:
      BossIndex: 1
      Hps: []
    Rock:
      StartPosition: {x: 0, y: 0, z: 0}
      EndPosition: {x: 0, y: 0, z: 0}
      Range: 3
      Speed: 3
      NumSmall: 0
      NumNormal: 0
      NumBig: 0
      Duration: 5
    UseWarning: 0
    WarningPositions: []
    IsShow: 1
  - WaveType: 0
    FireRate: 1
    Hp: 1
    Items:
      List:
      - Type: 0
        Num: 1
      NumEnemiesCanHaveItem: 2
    HasPower: 0
    NoDam: 0
    IsTeam: 0
    DestroyOnFinish: 0
    IdleType: 0
    TimeMove: 1
    Ease: 0
    Paths:
    - DelayTime: 0
      Distance: 0.3
      MoveSpeed: 4
      Index: 35
      Offset: {x: 0, y: 0}
      FlipX: 0
      FlipY: 0
      Cells:
      - Row: 0
        Coll: 0
      - Row: 0
        Coll: 1
      - Row: 0
        Coll: 2
      - Row: 0
        Coll: 3
      - Row: 0
        Coll: 4
      - Row: 0
        Coll: 5
      - Row: 0
        Coll: 6
      - Row: 1
        Coll: 6
      - Row: 1
        Coll: 5
      - Row: 1
        Coll: 4
      - Row: 1
        Coll: 3
      - Row: 1
        Coll: 2
      - Row: 1
        Coll: 1
      - Row: 1
        Coll: 0
      - Row: 2
        Coll: 0
      - Row: 2
        Coll: 1
      - Row: 2
        Coll: 2
      - Row: 2
        Coll: 3
      - Row: 2
        Coll: 4
      - Row: 2
        Coll: 5
      - Row: 2
        Coll: 6
      - Row: 3
        Coll: 6
      - Row: 3
        Coll: 5
      - Row: 3
        Coll: 4
      - Row: 3
        Coll: 3
    Enemies:
    - Rows:
      - EnemyId: 29
        PathId: 0
      - EnemyId: 29
        PathId: 0
      - EnemyId: 29
        PathId: 0
      - EnemyId: 30
        PathId: 0
      - EnemyId: 30
        PathId: 0
      - EnemyId: 30
        PathId: 0
      - EnemyId: 30
        PathId: 0
    - Rows:
      - EnemyId: 15
        PathId: 0
      - EnemyId: 15
        PathId: 0
      - EnemyId: 22
        PathId: 0
      - EnemyId: 22
        PathId: 0
      - EnemyId: 22
        PathId: 0
      - EnemyId: 22
        PathId: 0
      - EnemyId: 30
        PathId: 0
    - Rows:
      - EnemyId: 15
        PathId: 0
      - EnemyId: 15
        PathId: 0
      - EnemyId: 15
        PathId: 0
      - EnemyId: 15
        PathId: 0
      - EnemyId: 29
        PathId: 0
      - EnemyId: 29
        PathId: 0
      - EnemyId: 29
        PathId: 0
    - Rows:
      - EnemyId: -1
        PathId: 0
      - EnemyId: -1
        PathId: 0
      - EnemyId: -1
        PathId: 0
      - EnemyId: 30
        PathId: 0
      - EnemyId: 30
        PathId: 0
      - EnemyId: 30
        PathId: 0
      - EnemyId: 29
        PathId: 0
    - Rows:
      - EnemyId: -1
        PathId: 0
      - EnemyId: -1
        PathId: 0
      - EnemyId: -1
        PathId: 0
      - EnemyId: -1
        PathId: 0
      - EnemyId: -1
        PathId: 0
      - EnemyId: -1
        PathId: 0
      - EnemyId: -1
        PathId: 0
    - Rows:
      - EnemyId: -1
        PathId: 0
      - EnemyId: -1
        PathId: 0
      - EnemyId: -1
        PathId: 0
      - EnemyId: -1
        PathId: 0
      - EnemyId: -1
        PathId: 0
      - EnemyId: -1
        PathId: 0
      - EnemyId: -1
        PathId: 0
    - Rows:
      - EnemyId: -1
        PathId: 0
      - EnemyId: -1
        PathId: 0
      - EnemyId: -1
        PathId: 0
      - EnemyId: -1
        PathId: 0
      - EnemyId: -1
        PathId: 0
      - EnemyId: -1
        PathId: 0
      - EnemyId: -1
        PathId: 0
    GiftBox:
      NumGiftBox: 0
      Duration: 0
      Speed: 0
    NumEnemyAttack: 0
    SpeedMoveAttack: 5
    DistanceTimeAttack: 0.3
    LoopTimeAttack: 2
    CombatDiff:
      TimeFireRate: 3
      FireRateDecrease: 0.3
      TimeEnemyAttack: 0
      EnemyAttackDecease: 0
      IsIncreaseNumberFire: 0
      TimeIncreaseNumberFire: 0
    Boss:
      BossIndex: 1
      Hps: []
    Rock:
      StartPosition: {x: 0, y: 0, z: 0}
      EndPosition: {x: 0, y: 0, z: 0}
      Range: 3
      Speed: 3
      NumSmall: 0
      NumNormal: 0
      NumBig: 0
      Duration: 5
    UseWarning: 0
    WarningPositions: []
    IsShow: 1
