%YAML 1.1
%TAG !u! tag:unity3d.com,2011:
--- !u!114 &11400000
MonoBehaviour:
  m_ObjectHideFlags: 0
  m_CorrespondingSourceObject: {fileID: 0}
  m_PrefabInstance: {fileID: 0}
  m_PrefabAsset: {fileID: 0}
  m_GameObject: {fileID: 0}
  m_Enabled: 1
  m_EditorHideFlags: 0
  m_Script: {fileID: 11500000, guid: 1c0c2fddf41e21e4c97fc3e877486253, type: 3}
  m_Name: BulletsData
  m_EditorClassIdentifier: 
  bullets:
  - {fileID: 2168051787478147071, guid: 2b71fc5acdd26674890ddf45fb8d333f, type: 3}
  - {fileID: 1154302882481729657, guid: d75d526da648d33499ba2487c932dcaa, type: 3}
  - {fileID: 8120262759007283939, guid: 9adb7c60b71260946bd672cfc3881a6a, type: 3}
  - {fileID: 3426129813574668213, guid: 584de7b7ecece8c45a20463278ebdf61, type: 3}
  - {fileID: 7564757294629236304, guid: 7662998c3298db14e852dceea44f9e51, type: 3}
  - {fileID: 6422985130060149223, guid: b929bbfe20833ee428f6f3c47c6d4c0e, type: 3}
  - {fileID: 4877972527669912175, guid: a441d97cd912c7d47baf9f9f9b6b5619, type: 3}
  - {fileID: 183972197302036795, guid: a839413b06ee6654bac3fe3bea04285e, type: 3}
  - {fileID: 4828491251702594225, guid: 5e7d3299f30b65a4dbb2337f90adc75d, type: 3}
  - {fileID: 9095744365502635547, guid: 894f7138c9ed3614ea6c2eb4d09b0e99, type: 3}
  - {fileID: 7617463902393119541, guid: 0154903b8da140741bdfe783f66567cb, type: 3}
  - {fileID: 1243234856717417287, guid: f49f5a28685e98a4db45acbf065f474f, type: 3}
  - {fileID: 247939897877919308, guid: f4427997c97f6e74ebcbe05a21c23ec2, type: 3}
  - {fileID: 2719290576298017594, guid: f3fbe78612b9e5948a18299e533762b1, type: 3}
  - {fileID: 642085445926429237, guid: 0505b22dc75a7844fabef0ff6666b758, type: 3}
  - {fileID: 968157080096591691, guid: b445823de8bf18143a4dcd1225fd7a7f, type: 3}
  - {fileID: 6278937632791779963, guid: febbddf20c5077d4cba88cb3eb6cb35f, type: 3}
  - {fileID: 547019100504885615, guid: 2a6ad8f916bcfc145b5104dcd973f663, type: 3}
  - {fileID: 2970759419959107698, guid: f56e0c6ec7015d74f8e8a0a9d49a0059, type: 3}
  - {fileID: 7583100156138629818, guid: 18df1c62884b98f4d988b26dbf5cb206, type: 3}
  - {fileID: 1696688765932633011, guid: 6ff62b6b07f81664c891147e01a003d5, type: 3}
  - {fileID: 8482315473680673802, guid: cfba3e1597f015c41a6df309ce0e39ef, type: 3}
  - {fileID: 4275439017235406472, guid: 469e0fc966d56834189c5ea468ea4b28, type: 3}
