<?xml version="1.0" encoding="UTF-8"?>
<svg xmlns="http://www.w3.org/2000/svg" xmlns:xlink="http://www.w3.org/1999/xlink" width="29pt" height="29pt" viewBox="0 0 29 29" version="1.1">
<g id="surface1">
<path style=" stroke:none;fill-rule:nonzero;fill:rgb(100%,100%,100%);fill-opacity:1;" d="M 27.300781 0.960938 L 7.816406 0.960938 C 6.878906 0.960938 6.117188 1.726562 6.117188 2.660156 L 6.117188 5.371094 L 0.96875 0.222656 C 0.746094 0 0.386719 0 0.164062 0.222656 C -0.0546875 0.445312 -0.0546875 0.800781 0.164062 1.023438 L 6.835938 7.695312 L 3.3125 11.21875 L 0.96875 8.875 C 0.746094 8.652344 0.386719 8.652344 0.164062 8.875 C -0.0546875 9.09375 -0.0546875 9.453125 0.164062 9.675781 L 4.875 14.382812 L 4.875 14.894531 C 4.871094 16.195312 5.320312 17.472656 6.117188 18.492188 L 6.117188 22.148438 C 6.117188 23.082031 6.878906 23.847656 7.816406 23.847656 L 27.300781 23.847656 C 28.238281 23.847656 29 23.082031 29 22.148438 L 29 9.230469 C 29 8.917969 28.746094 8.664062 28.433594 8.664062 C 28.121094 8.664062 27.867188 8.917969 27.867188 9.230469 L 27.867188 22.148438 C 27.867188 22.457031 27.613281 22.714844 27.300781 22.714844 L 15.476562 22.714844 C 15.5 22.691406 15.523438 22.671875 15.546875 22.648438 C 15.691406 22.503906 15.800781 22.335938 15.882812 22.160156 C 16.105469 22.269531 16.355469 22.332031 16.613281 22.332031 C 17.050781 22.332031 17.460938 22.160156 17.769531 21.851562 C 18.078125 21.542969 18.246094 21.132812 18.246094 20.695312 C 18.246094 20.4375 18.1875 20.191406 18.074219 19.964844 C 18.253906 19.886719 18.421875 19.773438 18.5625 19.628906 C 18.871094 19.320312 19.042969 18.910156 19.042969 18.472656 C 19.042969 18.035156 18.871094 17.625 18.5625 17.316406 L 16.613281 15.367188 C 17.214844 15.410156 17.820312 15.152344 18.199219 14.632812 L 18.21875 14.609375 C 18.8125 13.796875 18.640625 12.648438 17.835938 12.050781 C 17.328125 11.675781 16.640625 11.164062 15.792969 10.527344 C 14.605469 9.636719 13.132812 9.148438 11.644531 9.148438 C 11.644531 9.148438 11.640625 9.148438 11.636719 9.148438 L 9.894531 9.148438 L 7.25 6.503906 L 7.25 2.660156 C 7.25 2.351562 7.503906 2.09375 7.816406 2.09375 L 13.730469 2.09375 L 13.730469 7.871094 C 13.730469 8.101562 13.867188 8.308594 14.078125 8.394531 C 14.289062 8.484375 14.535156 8.433594 14.695312 8.273438 L 15.925781 7.042969 L 17.15625 8.273438 C 17.378906 8.492188 17.738281 8.492188 17.960938 8.273438 L 19.191406 7.042969 L 20.421875 8.273438 C 20.527344 8.378906 20.675781 8.4375 20.820312 8.4375 C 20.894531 8.4375 20.96875 8.425781 21.039062 8.394531 C 21.25 8.308594 21.386719 8.101562 21.386719 7.871094 L 21.386719 2.09375 L 27.300781 2.09375 C 27.613281 2.09375 27.867188 2.351562 27.867188 2.660156 L 27.867188 4.699219 C 27.867188 5.011719 28.121094 5.265625 28.433594 5.265625 C 28.746094 5.265625 29 5.011719 29 4.699219 L 29 2.660156 C 29 1.726562 28.238281 0.960938 27.300781 0.960938 Z M 7.25 22.148438 L 7.25 19.683594 L 10.28125 22.714844 L 7.816406 22.714844 C 7.503906 22.714844 7.25 22.457031 7.25 22.148438 Z M 11.640625 10.28125 L 11.644531 10.28125 C 12.886719 10.28125 14.121094 10.691406 15.113281 11.433594 C 15.964844 12.070312 16.652344 12.582031 17.160156 12.960938 C 17.46875 13.191406 17.53125 13.628906 17.304688 13.9375 L 17.285156 13.964844 C 17.078125 14.25 16.683594 14.324219 16.386719 14.132812 L 14.210938 12.730469 C 13.929688 12.546875 13.554688 12.609375 13.34375 12.871094 C 13.132812 13.132812 13.152344 13.507812 13.390625 13.746094 L 17.761719 18.117188 C 17.859375 18.210938 17.910156 18.339844 17.910156 18.472656 C 17.910156 18.605469 17.859375 18.734375 17.761719 18.828125 C 17.667969 18.921875 17.542969 18.976562 17.40625 18.976562 C 17.292969 18.976562 17.183594 18.9375 17.097656 18.867188 L 14.902344 16.671875 C 14.886719 16.660156 14.871094 16.644531 14.855469 16.632812 L 14.632812 16.40625 C 14.410156 16.1875 14.050781 16.1875 13.832031 16.40625 C 13.609375 16.628906 13.609375 16.988281 13.832031 17.207031 L 16.25 19.628906 C 16.277344 19.652344 16.300781 19.679688 16.328125 19.703125 L 16.96875 20.339844 C 17.0625 20.433594 17.113281 20.5625 17.113281 20.695312 C 17.113281 20.828125 17.0625 20.957031 16.96875 21.050781 C 16.871094 21.144531 16.746094 21.199219 16.613281 21.199219 C 16.476562 21.199219 16.351562 21.144531 16.257812 21.050781 L 15.617188 20.410156 C 15.59375 20.386719 15.570312 20.359375 15.546875 20.335938 L 13.394531 18.183594 C 13.378906 18.167969 13.363281 18.152344 13.347656 18.140625 L 13.121094 17.917969 C 12.902344 17.695312 12.542969 17.695312 12.320312 17.917969 C 12.101562 18.136719 12.101562 18.496094 12.320312 18.71875 L 14.785156 21.179688 C 14.9375 21.378906 14.925781 21.664062 14.746094 21.847656 C 14.546875 22.042969 14.230469 22.042969 14.035156 21.847656 L 13.320312 21.132812 C 13.296875 21.105469 13.273438 21.078125 13.246094 21.054688 L 11.882812 19.691406 C 11.871094 19.675781 11.851562 19.664062 11.835938 19.648438 L 11.613281 19.425781 C 11.390625 19.203125 11.03125 19.203125 10.8125 19.425781 C 10.589844 19.648438 10.589844 20.003906 10.8125 20.226562 L 12.484375 21.898438 C 12.554688 21.988281 12.59375 22.097656 12.59375 22.210938 C 12.59375 22.34375 12.539062 22.472656 12.445312 22.566406 C 12.351562 22.660156 12.222656 22.714844 12.089844 22.714844 C 11.957031 22.714844 11.828125 22.660156 11.734375 22.566406 L 8.769531 19.597656 C 8.769531 19.597656 8.765625 19.597656 8.765625 19.597656 L 7.375 18.207031 C 6.503906 17.335938 6.003906 16.128906 6.007812 14.894531 L 6.007812 14.074219 L 9.796875 10.28125 Z M 5.285156 13.191406 L 4.113281 12.019531 L 7.636719 8.496094 L 8.808594 9.667969 Z M 20.253906 6.503906 L 19.589844 5.839844 C 19.367188 5.617188 19.011719 5.617188 18.789062 5.839844 L 17.558594 7.070312 L 16.328125 5.839844 C 16.21875 5.730469 16.070312 5.675781 15.925781 5.675781 C 15.78125 5.675781 15.636719 5.730469 15.527344 5.839844 L 14.863281 6.503906 L 14.863281 2.09375 L 20.253906 2.09375 Z M 20.253906 6.503906 "/>
<path style=" stroke:none;fill-rule:nonzero;fill:rgb(100%,100%,100%);fill-opacity:1;" d="M 25.375 17 L 21.75 17 C 21.4375 17 21.183594 17.253906 21.183594 17.566406 C 21.183594 17.878906 21.4375 18.132812 21.75 18.132812 L 25.375 18.132812 C 25.6875 18.132812 25.941406 17.878906 25.941406 17.566406 C 25.941406 17.253906 25.6875 17 25.375 17 Z M 25.375 17 "/>
<path style=" stroke:none;fill-rule:nonzero;fill:rgb(100%,100%,100%);fill-opacity:1;" d="M 25.375 19.335938 L 22.921875 19.335938 C 22.609375 19.335938 22.355469 19.589844 22.355469 19.902344 C 22.355469 20.214844 22.609375 20.46875 22.921875 20.46875 L 25.375 20.46875 C 25.6875 20.46875 25.941406 20.214844 25.941406 19.902344 C 25.941406 19.589844 25.6875 19.335938 25.375 19.335938 Z M 25.375 19.335938 "/>
<path style=" stroke:none;fill-rule:nonzero;fill:rgb(100%,100%,100%);fill-opacity:1;" d="M 20.65625 19.335938 C 20.503906 19.335938 20.359375 19.398438 20.253906 19.503906 C 20.148438 19.609375 20.089844 19.753906 20.089844 19.902344 C 20.089844 20.050781 20.148438 20.199219 20.253906 20.304688 C 20.359375 20.410156 20.507812 20.46875 20.65625 20.46875 C 20.804688 20.46875 20.949219 20.410156 21.054688 20.304688 C 21.160156 20.199219 21.222656 20.050781 21.222656 19.902344 C 21.222656 19.753906 21.160156 19.609375 21.054688 19.503906 C 20.949219 19.398438 20.804688 19.335938 20.65625 19.335938 Z M 20.65625 19.335938 "/>
<path style=" stroke:none;fill-rule:nonzero;fill:rgb(100%,100%,100%);fill-opacity:1;" d="M 28.433594 6.398438 C 28.285156 6.398438 28.136719 6.460938 28.03125 6.566406 C 27.929688 6.671875 27.867188 6.816406 27.867188 6.964844 C 27.867188 7.117188 27.929688 7.261719 28.03125 7.367188 C 28.136719 7.472656 28.285156 7.53125 28.433594 7.53125 C 28.582031 7.53125 28.730469 7.472656 28.835938 7.367188 C 28.9375 7.261719 29 7.117188 29 6.964844 C 29 6.816406 28.9375 6.671875 28.835938 6.566406 C 28.730469 6.460938 28.582031 6.398438 28.433594 6.398438 Z M 28.433594 6.398438 "/>
</g>
</svg>
