CdPt	Bitmap
0020	0000000000
0021	0000fa0000
0022	00c000c000
0023	28fe28fe28
0024	2454fe5448
0025	644810244c
0026	6c929a640a
0027	0000c00000
0028	00007c8200
0029	00827c0000
002a	28107c1028
002b	10107c1010
002c	000a0c0000
002d	1010101010
002e	0006060000
002f	000638c000
0030	7c8a92a27c
0031	0042fe0200
0032	42868a9262
0033	448292926c
0034	182848fe08
0035	e4a2a2a29c
0036	3c5292920c
0037	80808eb0c0
0038	6c9292926c
0039	6092929478
003a	006c6c0000
003b	006a6c0000
003c	0010284400
003d	0028282800
003e	0044281000
003f	40808a9060
0040	7c92aaaa78
0041	7e9090907e
0042	fe9292926c
0043	7c82828244
0044	fe8282827c
0045	fe92929282
0046	fe90909080
0047	7c8282925c
0048	fe101010fe
0049	0082fe8200
004a	040282fc80
004b	fe10284482
004c	fe02020202
004d	fe403040fe
004e	fe403804fe
004f	7c8282827c
0050	fe90909060
0051	7c828a847a
0052	fe90989462
0053	649292924c
0054	8080fe8080
0055	fc020202fc
0056	f00c020cf0
0057	fc027c02fc
0058	c6281028c6
0059	c0300e30c0
005a	868a92a2c2
005b	0000fe8200
005c	00c0380600
005d	0082fe0000
005e	0040804000
005f	0202020202
0060	0000804000
0061	042a2a2a1e
0062	fe1222221c
0063	1c22222214
0064	1c222212fe
0065	1c2a2a2a18
0066	00107e9040
0067	102a2a2a3c
0068	fe1020201e
0069	0022be0200
006a	040222bc00
006b	00fe081422
006c	0082fe0200
006d	3e203e201e
006e	3e1020201e
006f	1c2222221c
0070	3e28282810
0071	102828283e
0072	3e10202010
0073	102a2a2a04
0074	20fc220204
0075	3c0202043e
0076	300c020c30
0077	3c020c023c
0078	2214081422
0079	300a0a0a3c
007a	22262a3222
007b	00106c8200
007c	0000fe0000
007d	00826c1000
007e	1020100810
007f	1038541010
0080	00fe442810
0081	00fe7c3810
0082	fe0a12120c
0083	00f8283e00
0084	6c6c106c6c
0085	fe14fe1418
0086	fefe00fefe
0087	1010541010
0088	102844fe00
0089	10387cfe00
008a	0606fe4020
008b	0cfc80467e
008c	081c2a08f8
008d	10207c2010
008e	10087c0810
008f	1010543810
0090	0878fc7808
0091	30783c7830
0092	387c7c7c38
0093	7c7c7c7c7c
0094	4438283844
0095	2266ee6622
0096	0000ee0000
0097	88cceecc88
0098	04127c9040
0099	282c386828
009a	0222528a02
009b	028a522202
009c	3c0c142440
009d	7860504804
009e	4024140c3c
009f	0448506078
00a0	7c4454447c
00a1	0000be0000
00a2	3844c64428
00a3	127e929242
00a4	287caa8244
00a5	a8683e68a8
00a6	24d252d24c
00a7	52aaaaaa94
00a8	10aa6aaa04
00a9	7cc6bad67c
00aa	10a8a87800
00ab	1028542844
00ac	101010101c
00ad	0010101000
00ae	7c82aed27c
00af	8080808080
00b0	e0a0e00000
00b1	2222fa2222
00b2	4898a84800
00b3	5088a85000
00b4	46ca52e242
00b5	3e08040438
00b6	60f0fe80fe
00b7	0000100000
00b8	22a66ab222
00b9	48f8080000
00ba	6090906000
00bb	4428542810
00bc	1c223e2a22
00bd	1c221c2a18
00be	20900e9020
00bf	0c12a20204
00c0	9ea828281e
00c1	1e2828a89e
00c2	0e5494540e
00c3	5ea8a8689e
00c4	1ea828a81e
00c5	1e28a8281e
00c6	1e283e2a22
00c7	7a84848448
00c8	beaa2a2a22
00c9	3e2a2aaaa2
00ca	beaa2aaaa2
00cb	3eaa2aaa22
00cc	80a23e2200
00cd	00223ea280
00ce	80a23ea280
00cf	00a23ea200
00d0	10fe92827c
00d1	be904844be
00d2	9ca222221c
00d3	1c2222a29c
00d4	9ca222a29c
00d5	5ca262629c
00d6	1ca222a21c
00d7	4428102844
00d8	7c8e92e27c
00d9	bc8202023c
00da	3c020282bc
00db	bc820282bc
00dc	3c8202823c
00dd	20104e9020
00de	fe28282810
00df	7e8092926c
00e0	04aa6a2a1e
00e1	042a6aaa1e
00e2	84aa2aaa9e
00e3	44aaaa6a9e
00e4	04aa2aaa1e
00e5	042aaa2a1e
00e6	042a1e2a18
00e7	3a44444428
00e8	1caa6a2a18
00e9	1c2a6aaa18
00ea	9caa2aaa98
00eb	1caa2aaa18
00ec	00925e0200
00ed	00125e8200
00ee	00529e4200
00ef	00a23e8200
00f0	048aaa4abc
00f1	5e8890508e
00f2	0c9252120c
00f3	0c1252920c
00f4	0c5292520c
00f5	0c5252520c
00f6	0c5212520c
00f7	1010541010
00f8	1c262a321c
00f9	3c8242043e
00fa	3c0242843e
00fb	bc820284be
00fc	3c8202843e
00fd	300a4a8a3c
00fe	3e14141408
00ff	308a0a8a3c
02c6	0040804000
02c7	0080408000
02c8	00c0000000
02c9	0040404000
02ca	0000408000
02cb	0080400000
02cc	0006000000
02cd	0002020200
02ce	0004020000
02cf	0000020400
0370	0000000000
0371	0000000000
0372	0000000000
0373	0000000000
0374	0000000000
0375	0000000000
0376	0000000000
0377	0000000000
0378	0000000000
0379	0000000000
037a	0000000000
037b	0000000000
037c	0000000000
037d	0000000000
037e	0000000000
037f	1a2660a61a
0380	0000000000
0381	0000000000
0382	0000000000
0383	0000000000
0384	0000000000
0385	0000000000
0386	c0007e907e
0387	0000000000
0388	c000fe9292
0389	c000fe10fe
038a	c00082fe82
038b	0000000000
038c	c0007c827c
038d	0000000000
038e	c000f00ef0
038f	c07a86867a
0390	4000dc0240
0391	7e9090907e
0392	fe9292926c
0393	fe80808080
0394	0e32c2320e
0395	fe92929282
0396	868a92a2c2
0397	fe101010fe
0398	7c9292927c
0399	0082fe8200
039a	fe10284482
039b	0e7080700e
039c	fe403040fe
039d	fe403804fe
039e	8292929282
039f	7c8282827c
03a0	fe808080fe
03a1	fe90909060
03a2	0000000000
03a3	c6aa928282
03a4	8080fe8080
03a5	c0300e30c0
03a6	3844fe4438
03a7	c6281028c6
03a8	7008fe0870
03a9	7a8680867a
03aa	00a23ea200
03ab	20900e9020
03ac	0c12529c02
03ad	142a6aa214
03ae	1c08509608
03af	00005c8200
03b0	5c02c2124c
03b1	1c22223c02
03b2	7e8092926c
03b3	20100e1020
03b4	0c52a2120c
03b5	142a2a2214
03b6	8090a8ca84
03b7	3c10202618
03b8	3c5252523c
03b9	00003c0200
03ba	3e08142200
03bb	8698601806
03bc	3e08040438
03bd	300c022418
03be	a854545442
03bf	1c2222221c
03c0	2638203e24
03c1	1e24242418
03c2	1824242412
03c3	1c22223c20
03c4	00203c2200
03c5	3c02022418
03c6	08143e1408
03c7	22241c1222
03c8	18043e0418
03c9	1c220c221c
03ca	00803c8200
03cb	3c8202a418
03cc	0c1252920c
03cd	1c0242920c
03ce	0c1244920c
0401	3eaa2aaa22
0404	7c92928244
0406	0082fe8200
0407	00a23ea200
0410	7e9090907e
0411	fe9292928c
0412	fe9292926c
0413	fe80808080
0414	067c84fc06
0415	fe92929282
0416	ee10fe10ee
0417	828292926c
0418	fe043840fe
0419	3e8448903e
041a	fe10284482
041b	02fc8080fe
041c	fe403040fe
041d	fe101010fe
041e	7c8282827c
041f	fe808080fe
0420	fe90909060
0421	7c82828244
0422	8080fe8080
0423	e0121212fc
0424	3844fe4438
0425	c6281028c6
0426	fc0404fc06
0427	e0101010fe
0428	fe02fe02fe
0429	fc04fc04fe
042a	80fe12120c
042b	fe120c00fe
042c	fe1212120c
042d	448292927c
042e	fe107c827c
042f	62949890fe
0430	042a2a2a1e
0431	7c92a2a29c
0432	3e2a2a2a14
0433	003e202020
0434	061c243c06
0435	1c2a2a2a18
0436	36083e0836
0437	22222a2a14
0438	3e0408103e
0439	0e4224480e
043a	3e08142200
043b	023c20203e
043c	3e1008103e
043d	3e0808083e
043e	1c2222221c
043f	3e2020203e
0440	3e28282810
0441	1c22222214
0442	20203e2020
0443	300a0a0a3c
0444	08143e1408
0445	2214081422
0446	3c04043c06
0447	300808083e
0448	3e023e023e
0449	3c043c043e
044a	203e0a0a04
044b	3e0a04003e
044c	3e0a0a0a04
044d	14222a2a1c
044e	3e081c221c
044f	122a2c283e
0451	1caa2aaa18
0454	1c2a2a2214
0456	0022be0200
0457	00a23e8200
0462	40fe52520c
0463	20fe2a2a04
0472	7c9292927c
0473	3c5252523c
0474	f00c027c80
0475	3804021c20
0490	7e404040c0
0491	3e202020e0
05d0	2618080c32
05d1	2222221e02
05d2	2224180600
05d3	2020203e20
05d4	2e2020201e
05d5	00003e0000
05d6	00203e2000
05d7	3e2020201e
05d8	3c0222221c
05d9	0000300000
05da	2020201c02
05db	222222221c
05dc	e020222438
05dd	3e2222221e
05de	2e1020221e
05df	00203c0200
05e0	0022221e00
05e1	1c2222221c
05e2	320a0a0438
05e3	382820201e
05e4	3a2a2a221c
05e5	2018060830
05e6	22120a0a36
05e7	2e20242830
05e8	202020201e
05e9	3c0a32023c
05ea	223e20201e
2160	0082fe8200
2161	82fe82fe82
2162	82fe82fe82
2163	fe00fc02fc
2164	f00c020cf0
2165	fc02fc00fe
2648	60807e8060
2649	dc222222dc
264a	82fe82fe82
264b	6492ee924c
264c	6890848a72
264d	f840fa847e
264e	6a9a829a6a
264f	f840f8807e
2650	0204b8c0e0
2651	f840fa1408
2652	2448244824
2653	927c107c92
2e86	fe808082fe
2e87	02fc80fe02
2e8e	82fc80fe82
2e90	424cf04e42
2e92	fc929292f6
2e93	365a921206
2e95	92929292fe
2e99	22f4487442
2e9d	02fca8aafe
2e9f	f8e8bafe28
2ea0	feaaa8beea
2ebe	40e040e040
2ebf	40e040e040
2ec4	befaa2fabe
2ec5	f284b886f2
2ec6	beacbcecbe
2ec9	f284b884f2
2ecb	54f45e5454
2ed1	feb2e8a4aa
2ed3	feb2e8a4aa
2ed4	be008082fe
2ed8	6e6cec6c6e
2ed9	5454fe5456
2eda	baa4e8a4ba
2edb	feacb4ccfe
2edc	8080fc122a
2edd	205eba5a20
2ee2	b4d494b2de
2ee3	30eeb4ee30
2ee4	7254fe5672
2ee5	baa8bae8ba
2ee6	7aca684a6e
2ee7	3e36eab6be
2ee8	545aea5c5a
2ee9	52fc5cfc52
2eea	d8d8fcdada
2eeb	527cd47e50
2eec	527cd07e50
2ef0	46f844de4a
2f00	1010101010
2f01	0000fe0000
2f02	0020100800
2f03	02020408f0
2f04	848a92a2c6
2f05	0002fe0000
2f06	0444444404
2f07	1010301010
2f08	020cf00c02
2f09	02fc00fe02
2f0a	028cf00c02
2f0b	0ef000f00e
2f0c	fe808082fe
2f0d	3020202030
2f0e	0042442800
2f0f	02fc80fe02
2f10	fe020202fe
2f11	828cf082fe
2f12	424cf0427e
2f13	20c040427e
2f14	fc22222226
2f15	fe82828282
2f16	80fc828282
2f17	1010fe1010
2f18	00fe201008
2f19	fe809088f0
2f1a	06f8808080
2f1b	0e34c41806
2f1c	a2948894e2
2f1d	7c4444447c
2f1e	fe828282fe
2f1f	0222fe2202
2f20	2022fe2220
2f21	22d4485462
2f23	30e2524c70
2f24	222cf02c22
2f25	42f4487442
2f26	9092bed090
2f27	3020602030
2f28	504842fe40
2f29	3802fe0038
2f2a	424cf04e42
2f2b	02fca0a0e0
2f2c	7808fe0878
2f2d	3e02fe023e
2f2f	8282fe8282
2f30	9c929292f6
2f31	7c40fe407c
2f32	9090fe9090
2f33	365a921206
2f34	027c40c040
2f35	92b4da0202
2f36	12fc10fe10
2f37	40f048c442
2f38	b8aaaaaaee
2f39	92929292fe
2f3a	2a2a54a800
2f3b	28285e90a0
2f3c	70fc720270
2f3d	42f448d442
2f3e	027ca8a8b8
2f3f	a8aafea8a8
2f40	425af45a42
2f41	021af45a42
2f42	4274c87442
2f43	a45404fe04
2f44	027c909e90
2f45	427cd0525e
2f46	929cf09e92
2f47	fe929292fe
2f48	7c5454447c
2f49	02fca8aafe
2f4a	4478fe7844
2f4b	22c4784462
2f4c	1e02fe1212
2f4d	90f2aaa4b8
2f4e	22da94fa22
2f4f	fafcaafe28
2f50	fe12fc1226
2f51	68687caaaa
2f52	7e52789492
2f53	d454545456
2f54	243afe1824
2f55	7204f80472
2f56	027c407c82
2f57	4294089442
2f58	22aa44aa22
2f59	02ec2828fe
2f5a	02fc2828ee
2f5b	b2d49afe90
2f5c	e848fe4848
2f5d	222cf02ca2
2f5e	4276da5246
2f5f	9292fe9296
2f60	027c407c82
2f61	bce4acbc82
2f62	40fe4afe40
2f63	ea4afe4a4a
2f64	fea8fea8fe
2f65	fe92fe92fe
2f66	8c82fe92d2
2f67	2a7c40c040
2f68	a0c000c0a0
2f69	3e6aaa2a3e
2f6a	7e48fa4c6a
2f6b	02fefefe02
2f6c	feaaaaaafe
2f6d	94dabed098
2f6e	d254785452
2f6f	9ee09e929e
2f70	28a2bea028
2f71	7e58e85a7e
2f72	54587e9894
2f73	624cc04c62
2f74	425ec25e42
2f75	20fe40fe40
2f76	5410fe1054
2f77	2a78ae282a
2f78	d6527e5256
2f79	feb880bafe
2f7a	54d47ed454
2f7b	a4aafcaafc
2f7c	52f45e7652
2f7d	bebee0bebe
2f7e	2a6cfe6c2a
2f7f	84fcb4fe84
2f80	5474fe7424
2f81	7e54e8547e
2f82	feaaeeaaba
2f83	7e5ada5a7e
2f84	82b6deb682
2f85	7e920292fe
2f86	aeaafaaaae
2f87	d24c70fe24
2f88	127cd27e10
2f89	feaaa4ea00
2f8a	beaabaeaba
2f8b	78fe78fe78
2f8c	3e28fcaab2
2f8d	7256fa5276
2f8e	027efe7e02
2f8f	5ea000a2bc
2f90	507eda444a
2f91	befca4fcbe
2f92	facca89efa
2f93	beacbcecbe
2f94	4056d65640
2f95	50ae0aae50
2f96	baaeaaaeba
2f97	94d4aa9e94
2f98	5474a8f2ae
2f99	facca89cfa
2f9a	2a7ce27e28
2f9b	2e62fe6a22
2f9c	eea2beaaea
2f9d	0478ca7e10
2f9e	54f45e5454
2f9f	5474de7454
2fa0	fedcdad49a
2fa1	5652aeaaa2
2fa2	feaabaaafa
2fa3	bef2a6f2be
2fa4	6a48fe88aa
2fa5	f2d6feb6f2
2fa6	2a6ebe6e2a
2fa7	feb2e8a4aa
2fa8	fee000e2fe
2fa9	7c6cee6c6c
2faa	5472fe7024
2fab	40fe5afe5a
2fac	beb4feb4be
2fad	6e6cec6c6e
2fae	54fe00fe54
2faf	bebeeabebe
2fb0	44ec7eec44
2fb1	646cfe6c24
2fb2	aafe02feaa
2fb3	5676d67656
2fb4	baa4e8a4ba
2fb5	feacb4ccfe
2fb6	8080fc122a
2fb7	205eba5a20
2fb8	5eda7ed65e
2fb9	6876feb6a8
2fba	f490f4929e
2fbb	30eeb4ee30
2fbc	5e70d4725e
2fbd	feaa0052ac
2fbe	fea000a2fe
2fbf	eeb256baea
2fc0	bee8bceabe
2fc1	7254fe5672
2fc2	baa8bae8ba
2fc3	7cd86c5a7e
2fc4	3e36eab6be
2fc5	7e7cd27c52
2fc6	545aea5c5a
2fc7	7e7ed47e54
2fc8	52fc5cfc52
2fc9	7462fea0b4
2fca	eab8fab8ea
2fcc	d8d8fcdada
2fcd	76f49ef476
2fd1	527cd47e50
2fd3	46f844de4a
3001	0008040200
3002	040a040000
3005	20c8445a60
3007	3844444438
300c	0000f88080
300d	02023e0000
3021	0000fe0000
3022	007c00fe00
3023	7c003800fe
3024	c6281028c6
3025	6c9292126c
3026	1010701010
3027	1014741410
3028	222aea2a22
3029	22d4485462
3041	143a141a14
3042	4cfe545a4c
3043	1c0202100c
3044	fc0202c038
3045	082a2a2a04
3046	20a2a2a21c
3047	0a2a2c2a2a
3048	22a4a8b622
3049	143e182a14
304a	4cfe50124c
304b	42fc423e70
304c	227ca23eb8
304d	5452fa5252
304f	1028448200
3050	0814942280
3051	fe0022fc20
3052	7e00a27ca0
3053	0c82828282
3054	2422a22292
3055	44c262524a
3056	2462b22aa2
3057	fc0202020c
3058	fc02c202cc
3059	405a5afc40
305a	405afcc0c0
305b	40fc42fa40
305c	207ca27aa0
305d	949ab2d292
305e	5054da72d2
305f	5ee054524a
3060	2e70aa2aaa
3061	40fa52524c
3062	207aaa2aa4
3063	101212120c
3064	202222221c
3065	2022a2229c
3066	809ca2c282
3067	202cb222a2
3068	1c22e22222
3069	1ce222a2a2
306a	44f8461e44
306b	fe00848242
306c	3cc678c63e
306d	48fe20463e
306e	7884f8827c
306f	fe004efe48
3070	7e00ae7ea8
3072	bcc202fc80
3073	5c62823ca0
3074	5c6242bc60
3075	bc82bc80bc
3076	2c22ac20ac
3077	2c226ca06c
3078	106080700e
3079	3040b00c82
307a	304070ac42
307b	fe00a6fea4
307c	7e00d67ed4
307e	5656fe5454
307f	98a4f812fc
3080	58fc42024c
3081	3cc678c23c
3082	50fc525254
3083	103e103418
3084	20f826c070
3085	1c083e141c
3086	7c1078c638
3087	04021e080a
3088	0c12fc504c
3089	ba8a92524c
308a	f20a0204f8
308b	96a6a2d28c
308c	48fe207e04
308d	90a2a2d28c
308e	143e10120c
308f	48fe20423c
3090	9cbee42a1c
3091	baacbaecb2
3092	547ad25a52
3093	0618ec020c
3094	082aaa2a84
3095	123c121e18
3096	3e00123c10
3099	c000c00000
309a	40a0400000
309b	c000c00000
309c	40a0400000
309d	0020121408
309e	0020921488
309f	fe4852524c
30a1	12121c1418
30a2	8284b890e0
30a3	04040e0810
30a4	08103ec000
30a5	1812321418
30a6	7042c24478
30a7	12121e1212
30a8	42427e4242
30a9	12141a3e10
30aa	484852fe40
30ab	424cf0427e
30ac	222478a2be
30ad	4848fe4848
30ae	287ea80080
30af	30c0424c70
30b0	1062a224b8
30b1	30c2427c40
30b2	1062a23ca0
30b3	424242427e
30b4	2222a222be
30b5	40f244f840
30b6	103a923c90
30b7	a252040830
30b8	52528408b0
30b9	828cb0cc82
30ba	4244c854e2
30bb	20fc424272
30bc	107ca222b2
30bd	c0320408f0
30be	300a8204b8
30bf	30e2524c70
30c0	0872aa24b8
30c1	52527c9090
30c2	1a1abc28a8
30c3	18021a021c
30c4	f002f204f8
30c5	3002b204b8
30c6	20a2bca020
30c7	2a2aac28a8
30c8	00fe201008
30c9	fe20900880
30ca	2222fc2020
30cb	0444444404
30cc	4264585864
30cd	4848de5068
30ce	02020408f0
30cf	0ef000f00e
30d0	0638803886
30d2	fc22222222
30d3	fc22a222a2
30d4	fc1252b252
30d5	80828498e0
30d6	2022a224b8
30d7	101252b458
30d8	106080700e
30d9	3040b00c82
30da	304070ac42
30db	2c22fe202c
30dc	1412be1094
30dd	14127eb054
30de	8088849ae0
30df	a4a4a45252
30e0	0e34c41806
30e1	02241818e4
30e2	1090fc9212
30e3	103e101418
30e4	10e0384670
30e5	0212121e02
30e6	4242427e02
30e7	2a2a2a2a3e
30e8	92929292fe
30e9	20a2a2a438
30ea	fa020204f8
30eb	02fc00fe08
30ec	fe02040810
30ed	fe828282fe
30ee	382222223c
30ef	f0828284f8
30f0	083828fe28
30f1	44445c6444
30f2	a0a2a4b8e0
30f3	4222040830
30f4	1812b21498
30f5	121438121e
30f6	0832121c10
30fb	0000100000
30fc	1010101010
30fd	0020100800
30fe	0020900880
30ff	80808080fe
3105	40c042427c
3106	42e4585864
3107	fe808080fe
3108	fe82828282
3109	42cc72427c
310a	262af22c26
310b	8090b2d21c
310c	42cc72c27c
310d	1028d628c6
310e	80b0d2929c
310f	06f8808080
3110	fc040810fe
3111	1028448200
3112	8080fe8080
3113	fa0afe0afa
3114	28285e90a0
3115	02bca0a0e0
3116	fe82ba82fe
3117	80fe8088f8
3118	5070d25458
3119	0e34c41806
311a	80403e4080
311b	4c52724244
311c	4c52f24244
311d	40fc42fa40
311e	b2d4b8d29c
311f	106080700e
3120	365a921206
3121	4264585864
3122	b0d090b2dc
3123	709010121c
3124	424cf04e42
3125	061ae20202
3126	02fc00fe02
3127	1010101010
3128	02241818e4
3129	fe020202fe
312a	82fc90929e
312b	82fc80fe82
312c	067840c040
312d	bca0fea0bc
312e	242aba2224
312f	809eb0d21e
3131	202020203e
3132	20203e203e
3133	203e063806
3134	3e02020202
3135	3e02263826
3136	3e02143a14
3137	3e22222222
3138	3e223e2222
3139	2e2a2a2a3a
313a	2e2a3a203e
313b	2e2a3e223e
313c	2e2a3e0a3e
313d	2e3a063806
313e	2e2a3e2a2a
313f	2e3a223e22
3140	2e3a143a14
3141	3e2222223e
3142	3e1212123e
3143	3e123e123e
3144	3e123e3806
3145	0204380402
3146	0638063806
3147	1c2222221c
3148	2224382422
3149	2638263826
314a	1214381412
314b	282828283e
314c	3e2a2a2a2a
314d	223e223e22
314e	141a3a1a14
314f	0000fe1000
3150	00fe10fe00
3151	0000fe2800
3152	00fe28fe00
3153	0010fe0000
3154	0010fe00fe
3155	0028fe0000
3156	0028fe00fe
3157	0808380808
3158	083808fe10
3159	083808fefe
315a	083808fe00
315b	0838083808
315c	10101c1010
315d	101e1004fe
315e	101e14fefe
315f	101e10fe00
3160	101c101c10
3161	1010101010
3162	04040404fe
3163	0000fe0000
31a0	44ca46427c
31a1	848afe80f8
31a2	f808142afe
31a3	38c638c606
31a4	20fc424272
31a5	20fc424676
31a6	98a4c28488
31a7	98a4ca9488
31a8	c6281038d6
31a9	844a3e4888
31aa	1010385030
31ab	c628142ac6
31ac	fe80fe80fe
31ad	82fcfefe82
31ae	b6d6b8d29c
31af	365a921606
31b0	9e503e509e
31b1	bebce2acbe
31b2	44447c4444
31b3	040afe0808
31b4	180a0a0c00
31b5	1a0c0a0a0c
31b6	203a2a2c00
31b7	021c101010
31b8	4c54545464
31b9	3010101010
31ba	1010381010
31bb	040a040a00
31bc	2254881422
31bd	a2d48894a2
31be	d0381638d0
31bf	0ef000f00e
362f	247aecaaee
4e00	1010101010
4e01	8082fe8080
4e03	20fc222222
4e07	82fc90929e
4e08	425448f442
4e09	4454545444
4e0a	0202fe2222
4e0b	8080fe9088
4e0d	8890bed088
4e10	b888f8aaae
4e11	92fe92fe12
4e19	bea8f0aabe
4e28	0000fe0000
4e2a	20409e4020
4e2b	80403e4080
4e2d	7848fe4878
4e30	5454fe5454
4e36	0020100800
4e38	42fc487e02
4e39	12fc92fe10
4e3b	5454fc5454
4e3d	bea8bea8be
4e3f	02020408f0
4e43	82fc80b2de
4e45	22c4485462
4e48	264a922442
4e49	6214c81462
4e4b	4244ca5262
4e59	848a92a2c6
4e5d	42fc407e02
4e5e	56da5a5256
4e5f	fc42fa4276
4e60	84a4a882fe
4e61	729c00fed8
4e66	50fe507498
4e85	0002fe0000
4e86	8082bec080
4e88	90d2bed098
4e8c	0444444404
4e8e	9092fe9090
4e8f	a0b8a8aaae
4e91	a6baa2aca6
4e92	82faaabe82
4e94	a2fea2be82
4e95	2afc28fe28
4e9c	bafeaafeba
4e9e	baee82eeba
4ea0	1010301010
4ea1	407cc24242
4ea2	425cd05e42
4ea5	5274da7442
4eac	4678ee7846
4eba	020cf00c02
4ebf	7e800e92e2
4ec0	7e8010fe10
4ec1	7e80242424
4ec3	7e80427e40
4eca	2848aa4c28
4ecb	225c805e20
4ed1	205c8a4a20
4ed3	205e925a24
4ee3	7e8020fca2
4ee4	5094b49a50
4ee5	fe2406f806
4efb	7e80527e92
4f1a	4aaeaaaa46
4f1d	7e80565a56
4f1f	7e8054fe56
4f55	7e9028bafe
4f60	7e80d27e50
4f86	5a4cfe4c5a
4f96	205c8a4a20
4fee	7e80d46a54
5009	205e925a24
500b	20409e4020
5049	7e8054fe56
50b3	7e80565a56
5104	7e800e92e2
513f	02fc00fe02
5140	82fc80fe82
5144	f29c909ef2
5146	2afc00fe2a
5149	521cf01e52
514b	5a5cf85e5a
515a	e254d856e2
5165	028cf00c02
516b	0ef000f00e
516d	4658c05846
5170	2aea2aea2a
5171	4afc48fc4a
5173	aa6c386caa
5176	4afc78fc4a
5178	0a7cf87c0a
5182	fe808082fe
5186	fe90f092fe
5196	3020202030
51ab	0042442800
51ac	28d25a5268
51e0	02fc80fe02
51e1	02fc90fe02
51f5	fe020202fe
51fa	ee22fe22ee
5200	828cf082fe
5201	88889082fe
5203	a29cf082fe
529b	424cf0427e
52a0	58e27e447c
52b3	ea4cd84aee
52b4	ea4cd84aee
52c7	b6bcf4b6b6
52dd	fefeac7aae
52de	ea4cd84aee
52f9	20c040427e
52fa	20d048427e
5315	fc22222226
5317	22fe00fe22
531a	fe82828282
5338	80fc828282
533a	fe82aa92aa
5340	fe82aa92aa
5341	1010fe1010
5343	50507e9090
5348	28c87e4848
534e	54fc5efc54
5357	5e5cf65c5e
535c	00fe201008
535d	40e000e040
5364	3e36eab6be
5369	fe809088f0
536f	f2fc00fef0
5382	06f8808080
539f	feb4f2beb4
53a1	feb4f2beb4
53b6	0e34c41806
53bb	565af25452
53bf	3af8deb8fa
53c8	a2948894e2
53c9	a294a894e2
53cb	4678da545a
53d1	ce70da54da
53e3	7c4444447c
53ef	b8a8bafe80
53f0	6eaa2a4a2e
53f2	7254fa5272
53f8	acacac82fe
5408	2056965620
5411	7e40d8427e
5415	eeaaaaaaee
541b	a8beeaaaee
543e	d0f6d6f690
5442	eeaabaaaee
544a	d056f65650
547d	2c4ca04e2c
548c	547e943c3c
554f	fee00ce2fe
5584	54fe76fe54
55b6	e656de56e6
56d7	fe828282fe
56da	fe8ab28afe
56db	fef282f2fe
56de	fe82ba82fe
5706	fe90f092fe
5713	fe90f092fe
571f	0222fe2202
5728	507eca5e4a
5730	227cfe4266
573a	247aecaaee
5742	24787ea4ba
57fa	54fa76fa54
5800	2478fed2d6
5834	247aecaaee
5872	247aecaaee
58eb	2022fe2220
58ec	50527e9290
58f0	5e54fc545c
5902	22d4485462
5904	32cc72027a
590d	da5a5c5a5a
590f	babef4beba
5915	30e2524c70
591a	24d86c4a6c
591c	507eda545a
5927	222cf02c22
5929	9294f89492
5973	42f4487442
5a01	7e5a54fe4a
5b50	9092bed090
5b51	8892bed0a0
5b53	a092bed088
5b58	507ed45e54
5b66	e054de54e0
5b78	e054de54e0
5b80	3020602030
5b83	605cca5260
5b89	d2ba94bad2
5b8f	6256fa5266
5b98	605ed65660
5b9d	7a5ade5a7e
5b9e	6456fc5664
5b9f	6456fc5664
5ba0	625cf05e6a
5ba4	625aee5a62
5bab	6656de5666
5bae	6656de5666
5bb6	6458d25e6c
5bc5	625cdc5c62
5be6	6456fc5664
5bf5	625cf05e6a
5bf6	7a5ade5a7e
5bf8	504842fe40
5c0f	3802fe0038
5c11	620afa0468
5c14	28c27e4068
5c22	424cf04e42
5c38	02fca0a0e0
5c39	aafca8f820
5c3c	02fcbeaaea
5c3d	18e2aab2e8
5c3e	fea8beaaea
5c6e	7808fe0878
5c71	3e02fe023e
5ddd	fe00fe00fe
5de5	8282fe8282
5df1	9c929292f6
5df2	bc929292f6
5df3	fc929292f6
5df4	fe92f292f6
5df7	54f856fa54
5dfe	7c40fe407c
5e03	5c68de484c
5e1c	78fefa88fa
5e5f	78fefa88fa
5e72	9090fe9090
5e73	a888fe88a8
5e74	5cd47e5454
5e78	287cee7c28
5e7a	365a921206
5e7f	027c40c040
5e83	027c4ed246
5e86	027c52fc52
5e93	027c54fe54
5e9a	7e5afc5a52
5eab	027c54fe54
5ee0	027c40c040
5ee3	027c4ed246
5ef4	92b4da0202
5efe	12fc10fe10
5eff	40fe42fe40
5f0b	40f048c442
5f13	b8aaaaaaee
5f25	baeed27e50
5f4c	baeed27e50
5f50	92929292fe
5f61	2a2a54a800
5f65	5e70d47a54
5f66	5e70d47a54
5f73	28285e90a0
5fa9	da5a5c5a5a
5fc3	70fc720270
5fd7	4254f25644
5fd8	4274d25654
601d	f2d4f2b6f4
6069	f2b4d2b6f4
606d	54f25ef454
6075	5a5cfa5e5c
6085	78fef658f6
60e0	5a5cfa5e5c
6176	027c52fc52
6208	42f448d442
620a	7e40fa44ca
620c	7e48fa44ca
6210	7e5458fe4a
6211	aafe24fe2a
6236	027ca8a8b8
6237	027c50d070
6238	02bca8a8b8
6240	7ea87e909e
624b	a8aafea8a8
624d	484852fe40
652f	425af45a42
6534	021af45a42
6535	22f4487442
653f	fe10fa447a
6587	4274c87442
6589	527cd47e50
6597	a45404fe04
65a4	027c909e90
65b9	427cd0525e
65bd	fe00de7a5a
65e0	929cf09e92
65e5	fe929292fe
65e9	f4d4feb4f4
65f6	fefe50f65e
6625	687eee7e68
662d	fe00aecaee
663c	1aeeaebeea
6642	fefe50f65e
665d	1aeeaebeea
667a	d066566660
66a2	7cfeecaaee
66dc	fefeaafeea
66f0	7c5454447c
66f8	50fe507498
6703	4aaeaaaa46
6708	02fca8aafe
6728	4478fe7844
672a	1458fe5814
672c	5064fe6450
6731	d458fe5854
6751	fe48202afe
6765	5a4cfe4c5a
677e	fe48669a66
67d0	4afc5efc4a
6804	e254fe54e2
6881	aa0cbeccea
6885	fe48d85a5e
68ee	4c7eec7e4c
69ae	e254fe54e2
6b20	22c4784462
6b62	1e02fe1212
6b63	9e82fe9292
6b79	90f2aaa4b8
6bb3	22da94fa22
6bc5	da5eda94da
6bcb	fafcaafe28
6bcd	f8e8bafe28
6bd4	fe12fc1226
6bdb	68687caaaa
6c0f	7e52789492
6c11	feaaa8beea
6c14	d454545456
6c23	d45e54525e
6c34	243afe1824
6c49	ae00ee90ee
6c61	ae00baaaae
6cb3	ae10a8bafe
6cbb	ae006eaa6e
6cbc	ae00aecaee
6cbf	ae00ee8aee
6cd5	ae0056fa56
6d3d	ae40aeae40
6d41	ae005eec5a
6d69	ae00d6fa56
6d77	ae00d85a5e
6df8	ae006eec6e
6e05	ae006eec6e
6e2f	ae50fefa52
6f22	ae00ee90ee
706b	7204f80472
70b9	1ef456541e
7121	929cf09e92
71df	e656de56e6
722a	027c407c82
7236	4294089442
723b	22aa44aa22
723e	28c27e4068
723f	02ec2828fe
7247	02fc2828ee
7259	b2d49afe90
725b	e848fe4848
72ac	222cf02ca2
7384	4276da5246
7389	9292fe9296
738b	9292fe9292
74dc	027c407c82
74e6	bce4acbc82
7518	40fe4afe40
751f	ea4afe4a4a
7528	fea8fea8fe
7530	fe92fe92fe
7531	7c54fc547c
7532	f8a8fea8f8
7533	7c54fe547c
753b	bebad6babe
7545	7cfeecaaee
756b	bebad6babe
758b	8c82fe92d2
7592	2a7c40c040
7676	a0c000c0a0
7678	aada1cdaaa
767c	ce70da54da
767d	3e6aaa2a3e
767e	beaaeaaabe
7687	0a6aee6a0a
76ae	7e48fa4c6a
76bf	02fefefe02
76e1	18e2aab2e8
76ee	feaaaaaafe
76f4	425ef25e42
770c	3af8deb8fa
771e	447efc7e44
771f	447efc7e44
77db	94dabed098
77e2	d254785452
77e5	d27c527c7c
77f3	9ee09e929e
793a	28a2bea028
796d	54b23eb054
79b8	7e58e85a7e
79be	54587e9894
79c1	547e943ece
79cb	547e967c12
7a74	624cc04c62
7a7a	6a5aee5a6a
7acb	425ec25e42
7ae5	6a6aee6a6a
7af9	20fe40fe40
7bc4	54fe54de5a
7c50	5ede74de74
7c73	5410fe1054
7cf8	2a78ae282a
7d00	5aaa189ef2
7d30	5aa81afefe
7dad	5aaa7efe4a
7db2	feb880bafe
7e23	3af8deb8fa
7eaa	5aaa189ef2
7ec6	5aa81afefe
7ef4	5aaa7efe4a
7f36	d6527e5256
7f51	feb880bafe
7f8a	54d47ed454
7f8e	54f67cf654
7f94	4ac87ac84a
7fa9	6214c81462
7fbd	a4aafcaafc
7fd2	a6d6ee96e6
7fe0	94dcf69cd4
8001	52f45e7652
800c	bebee0bebe
8012	2a6cfe6c2a
8033	84fcb4fe84
8072	5e54fc545c
807f	5474fe7424
8089	7e54e8547e
80dc	fefeac7aae
81e3	feaaeeaaba
81ea	7e5ada5a7e
81f3	82b6deb682
81fa	6eaa2a4a2e
81fc	7e920292fe
820c	aeaafaaaae
821b	d24c70fe24
821f	127cd27e10
826e	feaaa4ea00
8272	beaabaeaba
8278	78fe78fe78
8279	40e040e040
82b1	50fe48fe52
8349	44f47ef444
8363	e254fe54e2
83ca	74de54d25e
83ef	54fc5efc54
8425	e656de56e6
842c	82fc90929e
85e4	5ede74de74
862d	2aea2aea2a
864d	3e28fcaab2
8655	32cc72027a
8667	a0b8a8aaae
866b	7256fa5276
87f2	7256fa5276
8840	027efe7e02
884c	5ea000a2bc
8863	507eda444a
8907	da5a5c5a5a
897e	befca4fcbe
897f	befaa2fabe
8986	da5a5c5a5a
898b	facca89efa
89c1	f284b886f2
89d2	beacbcecbe
8a00	4056d65640
8a69	d65650fa5e
8a9e	be00d6f696
8ad6	be005c8a52
8b20	be02b69ab6
8b21	be02b69ab6
8b58	be04fa88fa
8bba	be005c8a52
8bc6	be04fa88fa
8bed	be00d6f696
8c37	50ae0aae50
8c46	baaeaaaeba
8c4a	5454fe5454
8c50	5454fe5454
8c55	94d4aa9e94
8c78	5474a8f2ae
8c9d	facca89cfa
8d1d	f284b884f2
8d64	2a7ce27e28
8d70	2e62fe6a22
8d8a	52fc527a4a
8db3	eea2beaaea
8eab	0478ca7e10
8eca	54f45e5454
8ee2	54fe565a56
8f49	54fe565a56
8f66	54f45e5454
8f6c	54fe565a56
8f9b	5474de7454
8fb0	fedcdad49a
8fb1	feb4b4aeb6
8fb5	5652aeaaa2
8fbe	be024af24a
8fc7	be0256fa42
8fd1	be027aa2ba
9001	be02d67ad6
900f	be02baf6ba
9020	be02d2f652
904e	be0256fa42
9053	be02de6ade
9054	be024af24a
9091	feaabaaafa
9093	645864fed8
90f7	729c00fed8
9109	729c00fed8
9115	729c00fed8
9127	645864fed8
9149	bef2a6f2be
9152	ae00befabe
91c6	6a48fe88aa
91cc	f2d6feb6f2
91cd	427a7eba82
91d1	2a6ebe6e2a
9577	feb2e8a4aa
957f	feb2e8a4aa
9580	fee000e2fe
95a2	aa6c386caa
95d7	aa6c386caa
95dc	aa6c386caa
95e8	be008082fe
95ee	be008c82fe
961c	7c6cee6c6c
9633	fed8fe92fe
9634	fedafcaafe
964d	fed854ee54
9670	fed856ba56
967d	fed804eaee
9686	fed85aee5a
96b6	5472fe7024
96b9	40fe5afe5a
96c4	4ef24efe4a
96e3	6e506efe4a
96e8	beb4feb4be
96ea	eacaeacee4
9751	6e6cec6c6e
9752	6e6cec6c6e
975e	54fe00fe54
9762	bebeeabebe
9769	44ec7eec44
97cb	646cfe6c24
97e6	5454fe5456
97ed	aafe02feaa
97f3	5676d67656
9801	baa4e8a4ba
9808	52acbee4be
9875	baa4e8a4ba
987b	52acbee4be
98a8	feacb4ccfe
98ce	feacb4ccfe
98db	8080fc122a
98de	8080fc122a
98df	205eba5a20
9996	5eda7ed65e
9999	6876feb6a8
99ac	f490f4929e
99b1	faee22fc22
99c4	faee22fc22
9a6c	b4d494b2de
9a6e	faee22fc22
9aa8	30eeb4ee30
9ad8	5e70d4725e
9adf	feaa0052ac
9b25	fea000a2fe
9b2f	eeb256baea
9b32	bee8bceabe
9b3c	7254fe5672
9b54	7e52ec6e52
9b5a	baa8bae8ba
9bc9	5afa5afef2
9c7c	baa8bae8ba
9ca4	5afa5afef2
9ce5	7cd86c5a7e
9e1f	7aca684a6e
9e75	3e36eab6be
9e7f	7e7cd27c52
9e97	bea8bea8be
9ea5	545aea5c5a
9ea6	545aea5c5a
9ebb	7e7ed47e54
9ec3	52fc5cfc52
9ec4	52fc5cfc52
9ecd	7462fea0b4
9ed1	eab8fab8ea
9ed2	eab8fab8ea
9ede	1ef456541e
9ee8	e254d856e2
9efd	d8d8fcdada
9efe	d8d8fcdada
9f0e	76f49ef476
9f4a	527cd47e50
9f50	527cd07e50
9f8d	46f844de4a
9f99	46f844de4a
f902	54f45e5454
f90a	2a6ebe6e2a
f91f	2aea2aea2a
f92d	5a4cfe4c5a
f92f	ea4cd84aee
f934	52f45e7652
f940	7e7cd27c52
f941	be005c8a52
f95e	12fc92fe10
f963	22fe00fe22
f966	da5a5c5a5a
f967	8890bed088
f971	fedcdad49a
f97a	aa0cbeccea
f980	eeaabaaaee
f981	42f4487442
f988	bea8bea8be
f98a	424cf0427e
f98e	5cd47e5454
f9a8	5094b49a50
f9ba	8082bec080
f9c4	46f844de4a
f9ca	ae005eec5a
f9d1	4658c05846
f9dc	fed85aee5a
f9e9	f2d6feb6f2
f9f7	425ec25e42
f9fc	be04fa88fa
f9fd	7e8010fe10
fa08	5ea000a2bc
fa09	fed854ee54
fa0a	facca89efa
fa0c	82fc80fe82
fa1e	a4aafcaafc
fa3c	7808fe0878
fa44	fe48d85a5e
fa45	ae00d85a5e
fa47	ae00ee90ee
fa5d	40e000e040
fa5e	40e040e040
fa68	6e506efe4a
fa6b	5a5cfa5e5c
fa76	b6bcf4b6b6
fa77	20d048427e
fa95	90f2aaa4b8
fa97	ae005eec5a
fa9a	ae00ee90ee
faa3	bebad6babe
faa8	425ef25e42
fab4	54fc5efc54
fab7	da5a5c5a5a
fac7	6e506efe4a
ff61	00040a0400
ff62	f880800000
ff63	000002023e
ff64	0004020000
ff65	0000100000
ff66	90929294f8
ff67	12121c1418
ff68	04040e0810
ff69	181232121c
ff6a	12121e1212
ff6b	12141a3e10
ff6c	103c12141c
ff6d	0212121e02
ff6e	2a2a2a2a3e
ff6f	18021a021c
ff70	1010101010
ff71	8284b890e0
ff72	08103e4080
ff73	7842c24478
ff74	42427e4242
ff75	484852fe40
ff76	424cf0427e
ff77	4848fe4848
ff78	30c2424c70
ff79	30c2427c40
ff7a	424242427e
ff7b	40f244f840
ff7c	a252040830
ff7d	828cb0cc82
ff7e	20fc424272
ff7f	c0320408f0
ff80	30e2524c70
ff81	52527c9090
ff82	f002f408f0
ff83	a2a2bca0a0
ff84	00fe201008
ff85	2222fc2020
ff86	0444444404
ff87	4264585864
ff88	4848de5068
ff89	02020408f0
ff8a	0ef000f00e
ff8b	fc22222222
ff8c	80828284f8
ff8d	106080700e
ff8e	2c22fe202c
ff8f	40484c5260
ff90	a4a4a45252
ff91	0e34c41806
ff92	02241818e4
ff93	9090fc9292
ff94	10e0384670
ff95	4242427e02
ff96	92929292fe
ff97	a2a2a2a4b8
ff98	fa020204f8
ff99	02fc00fe04
ff9a	fe02040810
ff9b	fe828282fe
ff9c	f8828284f8
ff9d	4222040830
ff9e	c000c00000
ff9f	40a0400000
ffa1	202020203e
ffa2	20203e203e
ffa3	203e063806
ffa4	3e02020202
ffa5	3e02263826
ffa6	3e02143a14
ffa7	3e22222222
ffa8	3e223e2222
ffa9	2e2a2a2a3a
ffaa	2e2a3a203e
ffab	2e2a3e223e
ffac	2e2a3e0a3e
ffad	2e3a063806
ffae	2e2a3e2a2a
ffaf	2e3a223e22
ffb0	2e3a143a14
ffb1	3e2222223e
ffb2	3e1212123e
ffb3	3e123e123e
ffb4	3e123e3806
ffb5	0204380402
ffb6	0638063806
ffb7	1c2222221c
ffb8	2224382422
ffb9	2638263826
ffba	1214381412
ffbb	282828283e
ffbc	3e2a2a2a2a
ffbd	223e223e22
ffbe	141a3a1a14
ffbf	0000000000
ffc0	0000000000
ffc1	0000000000
ffc2	0000fe1000
ffc3	00fe10fe00
ffc4	0000fe2800
ffc5	00fe28fe00
ffc6	0010fe0000
ffc7	0010fe00fe
ffc8	0000000000
ffc9	0000000000
ffca	0028fe0000
ffcb	0028fe00fe
ffcc	0808380808
ffcd	083808fe10
ffce	083808fefe
ffcf	083808fe00
ffd0	0000000000
ffd1	0000000000
ffd2	0838083808
ffd3	10101c1010
ffd4	101e1004fe
ffd5	101e14fefe
ffd6	101e10fe00
ffd7	101c101c10
ffd8	0000000000
ffd9	0000000000
ffda	1010101010
ffdb	04040404fe
ffdc	0000fe0000