ID	Name
AnalogT9	AnalogT9 Kit
BackPdMW	Back Pad MW
BlyDance	BellyDanceKt
FulGrand	FullGrandPno
PolyTrnc	Poly Trance
PWM Perc	PWM Percuss.
ScrtchKt	ScratchesKit
SinglOsc	Single Osci.
Spec.SFX	Special SFX
SynPopKt	SynthPopKit
TranceBa	Trance Bass
TrncMelo	Trance Melo
Wave Pan	Wave Panner