TEST-NAME,IDS-TIME(MS),IDUBS-TIME(MS)
,10503,9037
home,11528,11040
tabelas-oficiais,7083,6918
tabelas-corporativas,7073,7071
transacoes,7071,7088
recup-st,6907,6966
obrigacoes,7253,6778
relatorios,7063,6988
processos,7147,6949
processos-customizados,8268,7887
download,8785,8602
collapse-menu,7042,6781
modules-menu,8004,7990
tabelas-oficiais->tabelas-oficiais/fiscais,11441,12494
tabelas-oficiais->tabelas-oficiais/mercadorias,8521,8361
tabelas-oficiais->tabelas-oficiais/tributacao,8915,8112
tabelas-corporativas->tabelas-corporativas/fiscais,8631,8377
tabelas-corporativas->tabelas-corporativas/mercadorias,8688,9281
transacoes->transacoes/manutencao-dof,8342,7847
transacoes->transacoes/manutencao-cupom-fiscal,8230,8047
transacoes->transacoes/lancamento-saldo-inicial,8365,7790
recup-st->recup-st/dof-st,8733,8798
recup-st->recup-st/cfiscal-merc,8706,8438
recup-st->recup-st/ajuste-saldo,8919,8583
recup-st->recup-st/parametrizacao-controle-st,8594,8509
obrigacoes->obrigacoes/propriedades,13214,12641
obrigacoes->obrigacoes/solicitacao-resultado,12848,14448
obrigacoes->obrigacoes/obrigacoes-executadas,12841,12667
obrigacoes->obrigacoes/periodicidade,13047,12790
obrigacoes->obrigacoes/estabelecimento,12818,12567
obrigacoes->obrigacoes/diretorio,13502,12640
relatorios->relatorios/dof,14282,12438
relatorios->relatorios/cadastro-mercadoria,13592,12544
relatorios->relatorios/posicao-estoque,13348,12525
relatorios->relatorios/controle-ressarcimento,12987,12566
relatorios->relatorios/controle-saldo,13079,12583
relatorios->relatorios/criticas,13211,12593
relatorios->relatorios/controle-baixa,14050,12549
processos->processos/carga-inicial-mercadorias,12782,12610
processos->processos/carga-inicial-dof,12873,12684
processos->processos/carga-mensal-dof,13103,12642
processos->processos/icms-st,12802,12435
processos->processos/dados-sintegra-mg,12863,12612
processos->processos/apagar-dados-mercadorias,12894,12589
processos->processos/apagar-dados-recup-st,12973,12870
download->638705563-power-search-button,13137,7000
download->638705563-download,11332,8836
download->638705563-detalhes,9568,6772
download->638705563-excluir,9484,7084
tabelas-oficiais->tabelas-oficiais/mercadorias->tabelas-oficiais/mercadorias/ncm,13092,13019
tabelas-oficiais->tabelas-oficiais/mercadorias->tabelas-oficiais/mercadorias/cest,9780,9287
tabelas-oficiais->tabelas-oficiais/mercadorias->tabelas-oficiais/mercadorias/unimed,9455,9357
tabelas-oficiais->tabelas-oficiais/tributacao->tabelas-oficiais/tributacao/icms-padrao,9782,9477
tabelas-oficiais->tabelas-oficiais/tributacao->tabelas-oficiais/tributacao/icms-especifica,9483,9397
tabelas-oficiais->tabelas-oficiais/tributacao->tabelas-oficiais/tributacao/icms-base-calculo,9421,9329
tabelas-oficiais->tabelas-oficiais/tributacao->tabelas-oficiais/tributacao/mva-cest,9674,9216
tabelas-oficiais->tabelas-oficiais/tributacao->tabelas-oficiais/tributacao/mva-mer-cnae,9565,9103
tabelas-corporativas->tabelas-corporativas/fiscais->tabelas-corporativas/fiscais/nop,9626,9332
tabelas-corporativas->tabelas-corporativas/mercadorias->tabelas-corporativas/mercadorias/cadastro,9679,9279
tabelas-corporativas->tabelas-corporativas/mercadorias->tabelas-corporativas/mercadorias/fornecedor,9620,9190
recup-st->recup-st/dof-st->1171267882-novo documento,11107,6852
recup-st->recup-st/dof-st->1171267882-power-search-button,10898,6796
recup-st->recup-st/cfiscal-merc->1321884977-power-search-button,11238,7071
recup-st->recup-st/cfiscal-merc->1321884977-visualizar/editar,10590,6037
recup-st->recup-st/cfiscal-merc->1321884977-excluir,11002,7023
recup-st->recup-st/ajuste-saldo->2374057292-power-search-button,11032,6985
recup-st->recup-st/parametrizacao-controle-st->1509515468-novo,10246,5847
recup-st->recup-st/parametrizacao-controle-st->1509515468-power-search-button,11043,6938
recup-st->recup-st/parametrizacao-controle-st->1509515468-visualizar/editar,9832,5947
recup-st->recup-st/parametrizacao-controle-st->1509515468-excluir,10883,6849
obrigacoes->obrigacoes/propriedades->2844032748-power-search-button,15121,7009
obrigacoes->obrigacoes/propriedades->2844032748-gerenciar labels,15122,6966
obrigacoes->obrigacoes/propriedades->2844032748-visualizar parâmetros,18555,6739
obrigacoes->obrigacoes/propriedades->2844032748-visualizar/editar,18626,6562
obrigacoes->obrigacoes/solicitacao-resultado->4051203067-ir para todas as obrigações,16561,6535
obrigacoes->obrigacoes/solicitacao-resultado->4051203067-ajuda,14316,5888
obrigacoes->obrigacoes/solicitacao-resultado->4051203067-nova solicitação,15454,7051
obrigacoes->obrigacoes/solicitacao-resultado->4051203067-agendamentos,18605,6615
obrigacoes->obrigacoes/solicitacao-resultado->4051203067-atualizar,14270,5783
obrigacoes->obrigacoes/solicitacao-resultado->4051203067-gerar obrigação,15187,6854
obrigacoes->obrigacoes/solicitacao-resultado->4051203067-ajustar parâmetros da geração,18423,6619
obrigacoes->obrigacoes/solicitacao-resultado->4051203067-visualizar resultado da geração,15164,6713
obrigacoes->obrigacoes/solicitacao-resultado->4051203067-protocolo transmissão,18601,6627
obrigacoes->obrigacoes/solicitacao-resultado->4051203067-excluir geração,15698,6977
obrigacoes->obrigacoes/obrigacoes-executadas->1101762724-power-search-button,15719,7013
obrigacoes->obrigacoes/obrigacoes-executadas->1101762724-visualização,15431,7036
obrigacoes->obrigacoes/obrigacoes-executadas->1101762724-abrir visualização,14904,6894
obrigacoes->obrigacoes/obrigacoes-executadas->1101762724-visualizar,15342,6972
obrigacoes->obrigacoes/periodicidade->4174090780-novo,15329,6818
obrigacoes->obrigacoes/periodicidade->4174090780-power-search-button,15364,7020
obrigacoes->obrigacoes/periodicidade->4174090780-editar,15907,6832
obrigacoes->obrigacoes/periodicidade->4174090780-excluir,15491,6859
obrigacoes->obrigacoes/estabelecimento->4074389884-novo,15515,7492
obrigacoes->obrigacoes/estabelecimento->4074389884-power-search-button,14327,7201
obrigacoes->obrigacoes/estabelecimento->4074389884-excluir,15457,6978
obrigacoes->obrigacoes/diretorio->4125557054-power-search-button,15533,7109
obrigacoes->obrigacoes/diretorio->4125557054-gerar arquivo,15288,6734
obrigacoes->obrigacoes/diretorio->4125557054-excluir,15338,6833
rigacoes->obrigacoes/diretorio->4125557054-power-search-input and submit,12993,12814
relatorios->relatorios/dof->1121647418-power-search-button,20820,13409
relatorios->relatorios/dof->1121647418-ajuda contextualizada,15430,6971
relatorios->relatorios/dof->1121647418-visualização,15165,6853
latorios->relatorios/dof->1121647418-power-search-input and submit,13267,12585
relatorios->relatorios/cadastro-mercadoria->3200271866-executar,15430,7270
relatorios->relatorios/cadastro-mercadoria->3200271866-agendamentos,14244,6761
relatorios->relatorios/cadastro-mercadoria->3200271866-power-search-button,15285,6885
relatorios->relatorios/cadastro-mercadoria->3200271866-ajuda contextualizada,15373,6806
relatorios->relatorios/cadastro-mercadoria->3200271866-visualização,15455,7156
relatorios->relatorios/posicao-estoque->568761414-executar,15513,6885
relatorios->relatorios/posicao-estoque->568761414-agendamentos,18562,6597
relatorios->relatorios/posicao-estoque->568761414-power-search-button,15189,7047
relatorios->relatorios/posicao-estoque->568761414-ajuda contextualizada,15306,6900
relatorios->relatorios/posicao-estoque->568761414-visualização,15446,7072
relatorios->relatorios/posicao-estoque->568761414-regerar,15339,6948
relatorios->relatorios/posicao-estoque->568761414-detalhes,15472,6837
relatorios->relatorios/posicao-estoque->568761414-abrir visualização,15461,7009
relatorios->relatorios/posicao-estoque->568761414-excluir,15637,6859
relatorios->relatorios/controle-ressarcimento->1811188643-executar,15763,6917
relatorios->relatorios/controle-ressarcimento->1811188643-agendamentos,18475,6636
relatorios->relatorios/controle-ressarcimento->1811188643-power-search-button,15136,6796
relatorios->relatorios/controle-ressarcimento->1811188643-ajuda contextualizada,15614,6991
relatorios->relatorios/controle-ressarcimento->1811188643-visualização,15316,8109
relatorios->relatorios/controle-ressarcimento->1811188643-regerar,15337,7034
relatorios->relatorios/controle-ressarcimento->1811188643-detalhes,15753,7074
relatorios->relatorios/controle-ressarcimento->1811188643-abrir visualização,15573,6804
relatorios->relatorios/controle-ressarcimento->1811188643-excluir,15390,7066
relatorios->relatorios/controle-saldo->656091685-executar,15224,7048
relatorios->relatorios/controle-saldo->656091685-agendamentos,18925,6576
relatorios->relatorios/controle-saldo->656091685-power-search-button,15768,6852
relatorios->relatorios/controle-saldo->656091685-ajuda contextualizada,15417,7029
relatorios->relatorios/controle-saldo->656091685-visualização,15248,6937
relatorios->relatorios/controle-saldo->656091685-regerar,15284,6806
relatorios->relatorios/controle-saldo->656091685-detalhes,15156,6782
relatorios->relatorios/controle-saldo->656091685-abrir visualização,15508,6872
relatorios->relatorios/controle-saldo->656091685-excluir,15877,6910
relatorios->relatorios/criticas->1799809287-executar,15349,7138
relatorios->relatorios/criticas->1799809287-agendamentos,19057,6676
relatorios->relatorios/criticas->1799809287-power-search-button,14352,6873
relatorios->relatorios/criticas->1799809287-visualização,15095,6867
relatorios->relatorios/criticas->1799809287-regerar,15096,6864
relatorios->relatorios/criticas->1799809287-detalhes,15711,7048
relatorios->relatorios/criticas->1799809287-abrir visualização,15783,6887
relatorios->relatorios/criticas->1799809287-excluir,15407,7086
relatorios->relatorios/controle-baixa->640389551-exibir dados,15453,7060
processos->processos/carga-inicial-mercadorias->1625609257-executar,15327,6879
processos->processos/carga-inicial-mercadorias->1625609257-agendamentos,18913,6713
processos->processos/carga-inicial-mercadorias->1625609257-power-search-button,14254,6803
processos->processos/carga-inicial-mercadorias->1625609257-ajuda contextualizada,15546,6795
processos->processos/carga-inicial-mercadorias->1625609257-visualização,15743,6898
processos->processos/carga-inicial-mercadorias->1625609257-regerar,27977,11773
processos->processos/carga-inicial-mercadorias->1625609257-detalhes,15439,7163
processos->processos/carga-inicial-mercadorias->1625609257-excluir,15764,7097
processos->processos/carga-inicial-dof->2154116344-executar,15506,7008
processos->processos/carga-inicial-dof->2154116344-agendamentos,20006,6672
processos->processos/carga-inicial-dof->2154116344-power-search-button,15284,6999
processos->processos/carga-inicial-dof->2154116344-ajuda contextualizada,15448,7062
processos->processos/carga-inicial-dof->2154116344-visualização,15763,6892
processos->processos/carga-mensal-dof->974703873-executar,15248,7091
processos->processos/carga-mensal-dof->974703873-agendamentos,19113,6705
processos->processos/carga-mensal-dof->974703873-power-search-button,14290,6719
processos->processos/carga-mensal-dof->974703873-visualização,15474,7009
processos->processos/carga-mensal-dof->974703873-regerar,15416,7009
processos->processos/carga-mensal-dof->974703873-detalhes,15252,7004
processos->processos/carga-mensal-dof->974703873-abrir visualização,15080,6912
processos->processos/carga-mensal-dof->974703873-excluir,15326,7055
processos->processos/icms-st->3570614338-executar,15468,7027
processos->processos/icms-st->3570614338-agendamentos,18604,6566
processos->processos/icms-st->3570614338-power-search-button,15055,7067
processos->processos/icms-st->3570614338-ajuda contextualizada,15213,6968
processos->processos/icms-st->3570614338-visualização,15467,7034
processos->processos/icms-st->3570614338-regerar,15094,6872
processos->processos/icms-st->3570614338-detalhes,15223,6848
processos->processos/icms-st->3570614338-abrir visualização,15377,6816
processos->processos/icms-st->3570614338-excluir,15312,6803
processos->processos/dados-sintegra-mg->3373103500-executar,14714,7029
processos->processos/dados-sintegra-mg->3373103500-agendamentos,19013,6631
processos->processos/dados-sintegra-mg->3373103500-power-search-button,15565,6887
processos->processos/dados-sintegra-mg->3373103500-ajuda contextualizada,16739,7063
processos->processos/dados-sintegra-mg->3373103500-visualização,15308,7018
processos->processos/apagar-dados-mercadorias->589853967-executar,15149,6916
processos->processos/apagar-dados-mercadorias->589853967-agendamentos,18755,6629
processos->processos/apagar-dados-mercadorias->589853967-power-search-button,15184,6793
processos->processos/apagar-dados-mercadorias->589853967-ajuda contextualizada,15350,6996
processos->processos/apagar-dados-mercadorias->589853967-visualização,15887,7020
processos->processos/apagar-dados-recup-st->1307678592-executar,11364,7074
processos->processos/apagar-dados-recup-st->1307678592-agendamentos,18263,6694
processos->processos/apagar-dados-recup-st->1307678592-power-search-button,15362,6806
processos->processos/apagar-dados-recup-st->1307678592-ajuda contextualizada,16463,6912
processos->processos/apagar-dados-recup-st->1307678592-visualização,15713,6925
processos->processos/apagar-dados-recup-st->1307678592-regerar,15354,6951
processos->processos/apagar-dados-recup-st->1307678592-detalhes,15673,6958
processos->processos/apagar-dados-recup-st->1307678592-abrir visualização,15282,7015
processos->processos/apagar-dados-recup-st->1307678592-excluir,15261,7008
recup-st->recup-st/dof-st->1171267882-novo documento->1171267882-item-,18189,11644
recup-st->recup-st/cfiscal-merc->1321884977-visualizar/editar->1380780575-remover item,16569,
recup-st->recup-st/cfiscal-merc->1321884977-visualizar/editar->1380780575-salvar,11301,
recup-st->recup-st/cfiscal-merc->1321884977-visualizar/editar->1380780575-voltar,11406,
cup-st->recup-st/cfiscal-merc->1321884977-visualizar/editar->1380780575-powerselect-ncmCodigo-1380780575-powerselect-cestCodigo-1380780575-powerselect-indAlteracaoCargaTributaria-1380780575-powerselect-dfltUniCodigoEntrada-1380780575-powerselect-dfltUniCodigoSaida and submit,10241,6374
recup-st->recup-st/parametrizacao-controle-st->1509515468-novo->701054877-salvar,12451,6963
recup-st->recup-st/parametrizacao-controle-st->1509515468-novo->701054877-voltar,11421,6070
cup-st->recup-st/parametrizacao-controle-st->1509515468-novo->701054877-powerselect-ufCodigo-701054877-powerselect-cfopCodigo-701054877-powerselect-nopCodigo-701054877-powerselect-mercCodigo-701054877-powerselect-ncmCodigo-701054877-powerselect-cestCodigo-701054877-checkbox-indResIcmsSt-701054877-checkbox-indResIcmsProprio and submit,32749,29226
recup-st->recup-st/parametrizacao-controle-st->1509515468-visualizar/editar->2168276900-remover item,12105,6747
recup-st->recup-st/parametrizacao-controle-st->1509515468-visualizar/editar->2168276900-salvar,11515,5886
recup-st->recup-st/parametrizacao-controle-st->1509515468-visualizar/editar->2168276900-voltar,11244,6012
cup-st->recup-st/parametrizacao-controle-st->1509515468-visualizar/editar->2168276900-checkbox-indResIcmsSt-2168276900-checkbox-indResIcmsProprio and submit,10591,6238
obrigacoes->obrigacoes/propriedades->2844032748-gerenciar labels->2844032748-fechar,16721,6852
obrigacoes->obrigacoes/propriedades->2844032748-visualizar/editar->3650852489-salvar,23123,9056
obrigacoes->obrigacoes/propriedades->2844032748-visualizar/editar->3650852489-voltar,24489,6617
obrigacoes->obrigacoes/solicitacao-resultado->4051203067-ir para todas as obrigações->4051203067-voltar às obrigações do módulo,16828,8136
obrigacoes->obrigacoes/solicitacao-resultado->4051203067-nova solicitação->4051203067-salvar,20110,10196
obrigacoes->obrigacoes/solicitacao-resultado->4051203067-nova solicitação->4051203067-cancelar,17097,8188
obrigacoes->obrigacoes/solicitacao-resultado->4051203067-agendamentos->1101762724-power-search-button,21283,6905
obrigacoes->obrigacoes/solicitacao-resultado->4051203067-agendamentos->1101762724-visualização,21597,7034
obrigacoes->obrigacoes/solicitacao-resultado->4051203067-agendamentos->1101762724-abrir visualização,21020,7052
obrigacoes->obrigacoes/solicitacao-resultado->4051203067-agendamentos->1101762724-visualizar,21484,7087
obrigacoes->obrigacoes/solicitacao-resultado->4051203067-ajustar parâmetros da geração->1644760300-rightoutlined,19991,5869
obrigacoes->obrigacoes/solicitacao-resultado->4051203067-ajustar parâmetros da geração->1644760300-habilitar edição,21012,6978
obrigacoes->obrigacoes/solicitacao-resultado->4051203067-ajustar parâmetros da geração->1644760300-abrir janela de edição,21194,7093
obrigacoes->obrigacoes/solicitacao-resultado->4051203067-visualizar resultado da geração->4051203067-aumentar o zoom,16851,8344
obrigacoes->obrigacoes/solicitacao-resultado->4051203067-visualizar resultado da geração->4051203067-diminuir o zoom,16712,8255
obrigacoes->obrigacoes/solicitacao-resultado->4051203067-visualizar resultado da geração->4051203067-expandir,17023,8211
obrigacoes->obrigacoes/solicitacao-resultado->4051203067-visualizar resultado da geração->4051203067-download,16774,8130
obrigacoes->obrigacoes/solicitacao-resultado->4051203067-protocolo transmissão->1706279188-editar,21476,6830
rigacoes->obrigacoes/obrigacoes-executadas->1101762724-visualização->1101762724-item- and submit,18038,7208
obrigacoes->obrigacoes/obrigacoes-executadas->1101762724-abrir visualização->1101762724-aumentar o zoom,17158,8088
obrigacoes->obrigacoes/obrigacoes-executadas->1101762724-abrir visualização->1101762724-diminuir o zoom,16809,8355
obrigacoes->obrigacoes/obrigacoes-executadas->1101762724-abrir visualização->1101762724-expandir,11337,8089
obrigacoes->obrigacoes/obrigacoes-executadas->1101762724-abrir visualização->1101762724-download,19348,8276
obrigacoes->obrigacoes/obrigacoes-executadas->1101762724-visualizar->1101762724-dados disponíveis para impressão,16447,7112
obrigacoes->obrigacoes/periodicidade->4174090780-novo->4174090780-criar,17932,10300
obrigacoes->obrigacoes/periodicidade->4174090780-novo->4174090780-cancelar,15599,7284
rigacoes->obrigacoes/periodicidade->4174090780-novo->4174090780-input-number-ano and submit,15675,6993
obrigacoes->obrigacoes/periodicidade->4174090780-editar->4174090780-remover item,16595,8162
obrigacoes->obrigacoes/periodicidade->4174090780-editar->4174090780-salvar,15787,7204
obrigacoes->obrigacoes/estabelecimento->4074389884-novo->4074389884-cancelar,16765,8343
relatorios->relatorios/dof->1121647418-visualização->1121647418-salvar configuração,15411,6583
relatorios->relatorios/cadastro-mercadoria->3200271866-executar->3200271866-múltipla seleção,15682,7359
relatorios->relatorios/cadastro-mercadoria->3200271866-executar->3200271866-agendar,18036,10413
relatorios->relatorios/cadastro-mercadoria->3200271866-agendamentos->3200271866-voltar,24404,
latorios->relatorios/cadastro-mercadoria->3200271866-visualização->3200271866-item- and submit,15516,7029
relatorios->relatorios/posicao-estoque->568761414-executar->568761414-múltipla seleção,15914,7180
relatorios->relatorios/posicao-estoque->568761414-executar->568761414-agendar,17825,10282
relatorios->relatorios/posicao-estoque->568761414-agendamentos->568761414-voltar,24775,
latorios->relatorios/posicao-estoque->568761414-visualização->568761414-item- and submit,24791,13226
relatorios->relatorios/posicao-estoque->568761414-detalhes->568761414-dados disponíveis para impressão,15989,7321
relatorios->relatorios/posicao-estoque->568761414-abrir visualização->568761414-aumentar o zoom,17446,8329
relatorios->relatorios/posicao-estoque->568761414-abrir visualização->568761414-diminuir o zoom,16861,8165
relatorios->relatorios/posicao-estoque->568761414-abrir visualização->568761414-expandir,16692,8163
relatorios->relatorios/posicao-estoque->568761414-abrir visualização->568761414-download,16672,8379
relatorios->relatorios/controle-ressarcimento->1811188643-executar->1811188643-múltipla seleção,16788,7186
relatorios->relatorios/controle-ressarcimento->1811188643-executar->1811188643-agendar,19260,10226
relatorios->relatorios/controle-ressarcimento->1811188643-agendamentos->1811188643-voltar,24609,
latorios->relatorios/controle-ressarcimento->1811188643-visualização->1811188643-item- and submit,15668,7173
relatorios->relatorios/controle-ressarcimento->1811188643-detalhes->1811188643-dados disponíveis para impressão,15717,7269
relatorios->relatorios/controle-ressarcimento->1811188643-abrir visualização->1811188643-aumentar o zoom,16654,8184
relatorios->relatorios/controle-ressarcimento->1811188643-abrir visualização->1811188643-diminuir o zoom,16861,8167
relatorios->relatorios/controle-ressarcimento->1811188643-abrir visualização->1811188643-expandir,17244,8229
relatorios->relatorios/controle-ressarcimento->1811188643-abrir visualização->1811188643-download,16889,9149
relatorios->relatorios/controle-saldo->656091685-executar->656091685-múltipla seleção,15970,7336
relatorios->relatorios/controle-saldo->656091685-executar->656091685-agendar,17773,10251
relatorios->relatorios/controle-saldo->656091685-agendamentos->656091685-voltar,19251,
latorios->relatorios/controle-saldo->656091685-visualização->656091685-item- and submit,15837,6983
relatorios->relatorios/controle-saldo->656091685-detalhes->656091685-dados disponíveis para impressão,15889,7193
relatorios->relatorios/controle-saldo->656091685-abrir visualização->656091685-aumentar o zoom,16985,8394
relatorios->relatorios/controle-saldo->656091685-abrir visualização->656091685-diminuir o zoom,18937,8148
relatorios->relatorios/controle-saldo->656091685-abrir visualização->656091685-expandir,16938,8204
relatorios->relatorios/controle-saldo->656091685-abrir visualização->656091685-download,17295,8355
relatorios->relatorios/criticas->1799809287-executar->1799809287-múltipla seleção,15886,7159
relatorios->relatorios/criticas->1799809287-executar->1799809287-agendar,18989,10107
relatorios->relatorios/criticas->1799809287-agendamentos->1799809287-voltar,24221,
latorios->relatorios/criticas->1799809287-visualização->1799809287-item- and submit,11250,6795
relatorios->relatorios/criticas->1799809287-detalhes->1799809287-dados disponíveis para impressão,16148,7285
relatorios->relatorios/criticas->1799809287-abrir visualização->1799809287-aumentar o zoom,16670,8525
relatorios->relatorios/criticas->1799809287-abrir visualização->1799809287-diminuir o zoom,16723,8169
relatorios->relatorios/criticas->1799809287-abrir visualização->1799809287-expandir,17019,8160
relatorios->relatorios/criticas->1799809287-abrir visualização->1799809287-download,16658,8260
processos->processos/carga-inicial-mercadorias->1625609257-executar->1625609257-múltipla seleção,15684,7234
processos->processos/carga-inicial-mercadorias->1625609257-executar->1625609257-agendar,16136,7184
ocessos->processos/carga-inicial-mercadorias->1625609257-executar->1625609257-input-CODIGO_NCM-1625609257-input-CODIGO_MERCADORIA and submit,15803,7141
processos->processos/carga-inicial-mercadorias->1625609257-agendamentos->1625609257-voltar,24688,
ocessos->processos/carga-inicial-mercadorias->1625609257-visualização->1625609257-item- and submit,15941,7191
processos->processos/carga-inicial-mercadorias->1625609257-detalhes->1625609257-não há dados disponíveis para impressão,16038,7285
processos->processos/carga-inicial-dof->2154116344-executar->2154116344-múltipla seleção,16372,7308
processos->processos/carga-inicial-dof->2154116344-executar->2154116344-requisitos de preenchimento,17210,8405
processos->processos/carga-inicial-dof->2154116344-executar->2154116344-agendar,18967,10372
ocessos->processos/carga-inicial-dof->2154116344-executar->2154116344-input-MERCADORIA and submit,15800,7098
processos->processos/carga-inicial-dof->2154116344-agendamentos->2154116344-voltar,24771,
ocessos->processos/carga-inicial-dof->2154116344-visualização->2154116344-item- and submit,11312,7134
processos->processos/carga-mensal-dof->974703873-executar->974703873-múltipla seleção,16135,7161
processos->processos/carga-mensal-dof->974703873-executar->974703873-agendar,18872,7843
processos->processos/carga-mensal-dof->974703873-agendamentos->974703873-voltar,24536,
ocessos->processos/carga-mensal-dof->974703873-visualização->974703873-item- and submit,15324,6997
processos->processos/carga-mensal-dof->974703873-detalhes->974703873-dados disponíveis para impressão,15786,7449
processos->processos/carga-mensal-dof->974703873-abrir visualização->974703873-aumentar o zoom,16492,12103
processos->processos/carga-mensal-dof->974703873-abrir visualização->974703873-diminuir o zoom,16369,8274
processos->processos/carga-mensal-dof->974703873-abrir visualização->974703873-expandir,17083,8064
processos->processos/carga-mensal-dof->974703873-abrir visualização->974703873-download,17012,8076
processos->processos/icms-st->3570614338-executar->3570614338-múltipla seleção,15725,7091
processos->processos/icms-st->3570614338-executar->3570614338-agendar,18716,10101
processos->processos/icms-st->3570614338-agendamentos->3570614338-voltar,24393,
ocessos->processos/icms-st->3570614338-visualização->3570614338-item- and submit,15547,7244
processos->processos/icms-st->3570614338-detalhes->3570614338-dados disponíveis para impressão,15852,7155
processos->processos/icms-st->3570614338-abrir visualização->3570614338-aumentar o zoom,19042,8350
processos->processos/icms-st->3570614338-abrir visualização->3570614338-diminuir o zoom,17006,8371
processos->processos/icms-st->3570614338-abrir visualização->3570614338-expandir,16905,8165
processos->processos/icms-st->3570614338-abrir visualização->3570614338-download,16728,8137
processos->processos/dados-sintegra-mg->3373103500-executar->3373103500-múltipla seleção,15808,7288
processos->processos/dados-sintegra-mg->3373103500-executar->3373103500-agendar,17630,10372
processos->processos/dados-sintegra-mg->3373103500-agendamentos->3373103500-voltar,24654,
ocessos->processos/dados-sintegra-mg->3373103500-visualização->3373103500-item- and submit,15212,7093
processos->processos/apagar-dados-mercadorias->589853967-executar->589853967-múltipla seleção,15782,7369
processos->processos/apagar-dados-mercadorias->589853967-executar->589853967-agendar,15869,7279
ocessos->processos/apagar-dados-mercadorias->589853967-executar->589853967-input-CODIGO_NCM-589853967-input-CODIGO_MERCADORIA and submit,15754,6931
processos->processos/apagar-dados-mercadorias->589853967-agendamentos->589853967-voltar,24467,
ocessos->processos/apagar-dados-mercadorias->589853967-visualização->589853967-item- and submit,15573,7027
processos->processos/apagar-dados-recup-st->1307678592-agendamentos->1307678592-voltar,24549,
ocessos->processos/apagar-dados-recup-st->1307678592-visualização->1307678592-item- and submit,15867,7153
processos->processos/apagar-dados-recup-st->1307678592-detalhes->1307678592-dados disponíveis para impressão,15977,7524
processos->processos/apagar-dados-recup-st->1307678592-abrir visualização->1307678592-aumentar o zoom,16807,8287
processos->processos/apagar-dados-recup-st->1307678592-abrir visualização->1307678592-diminuir o zoom,16850,8223
processos->processos/apagar-dados-recup-st->1307678592-abrir visualização->1307678592-expandir,16709,8141
processos->processos/apagar-dados-recup-st->1307678592-abrir visualização->1307678592-download,16897,8363
rigacoes->obrigacoes/solicitacao-resultado->4051203067-agendamentos->1101762724-visualização->1101762724-item- and submit,27802,14095
obrigacoes->obrigacoes/solicitacao-resultado->4051203067-agendamentos->1101762724-abrir visualização->1101762724-aumentar o zoom,22877,8210
obrigacoes->obrigacoes/solicitacao-resultado->4051203067-agendamentos->1101762724-abrir visualização->1101762724-diminuir o zoom,22801,8262
obrigacoes->obrigacoes/solicitacao-resultado->4051203067-agendamentos->1101762724-abrir visualização->1101762724-expandir,22950,8200
obrigacoes->obrigacoes/solicitacao-resultado->4051203067-agendamentos->1101762724-abrir visualização->1101762724-download,22757,8250
obrigacoes->obrigacoes/solicitacao-resultado->4051203067-agendamentos->1101762724-visualizar->1101762724-dados disponíveis para impressão,21426,7264
obrigacoes->obrigacoes/solicitacao-resultado->4051203067-ajustar parâmetros da geração->1644760300-rightoutlined->1644760300-downoutlined,21846,7276
obrigacoes->obrigacoes/solicitacao-resultado->4051203067-ajustar parâmetros da geração->1644760300-habilitar edição->1644760300-confirmar  edição,22749,8264
obrigacoes->obrigacoes/solicitacao-resultado->4051203067-ajustar parâmetros da geração->1644760300-abrir janela de edição->1644760300-power-search-button,22692,8307
obrigacoes->obrigacoes/solicitacao-resultado->4051203067-visualizar resultado da geração->4051203067-expandir->4051203067-diminuir,18279,9606
obrigacoes->obrigacoes/solicitacao-resultado->4051203067-protocolo transmissão->1706279188-editar->1706279188-salvar,21596,7248
obrigacoes->obrigacoes/solicitacao-resultado->4051203067-protocolo transmissão->1706279188-editar->1706279188-cancelar,22313,7212
relatorios->relatorios/cadastro-mercadoria->3200271866-executar->3200271866-múltipla seleção->3200271866-cancelar,17154,8463
relatorios->relatorios/posicao-estoque->568761414-executar->568761414-múltipla seleção->568761414-cancelar,16703,8361
relatorios->relatorios/posicao-estoque->568761414-abrir visualização->568761414-expandir->568761414-diminuir,18147,9497
relatorios->relatorios/controle-ressarcimento->1811188643-executar->1811188643-múltipla seleção->1811188643-cancelar,17457,8487
relatorios->relatorios/controle-ressarcimento->1811188643-abrir visualização->1811188643-expandir->1811188643-diminuir,17898,9284
relatorios->relatorios/controle-saldo->656091685-executar->656091685-múltipla seleção->656091685-cancelar,17691,8703
relatorios->relatorios/controle-saldo->656091685-abrir visualização->656091685-expandir->656091685-diminuir,18312,9745
relatorios->relatorios/criticas->1799809287-executar->1799809287-múltipla seleção->1799809287-cancelar,17185,8432
relatorios->relatorios/criticas->1799809287-abrir visualização->1799809287-expandir->1799809287-diminuir,17930,9520
processos->processos/carga-inicial-mercadorias->1625609257-executar->1625609257-múltipla seleção->1625609257-este parâmetro possui mais de 100 valores. clique aqui para carregar todos.,17699,8588
processos->processos/carga-inicial-mercadorias->1625609257-executar->1625609257-múltipla seleção->1625609257-próximo,17456,8645
processos->processos/carga-inicial-mercadorias->1625609257-executar->1625609257-múltipla seleção->1625609257-cancelar,17279,9017
processos->processos/carga-inicial-dof->2154116344-executar->2154116344-múltipla seleção->2154116344-cancelar,17341,11444
processos->processos/carga-mensal-dof->974703873-executar->974703873-múltipla seleção->974703873-cancelar,17279,8626
processos->processos/carga-mensal-dof->974703873-abrir visualização->974703873-expandir->974703873-diminuir,18508,9609
processos->processos/icms-st->3570614338-executar->3570614338-múltipla seleção->3570614338-cancelar,20126,8443
processos->processos/icms-st->3570614338-abrir visualização->3570614338-expandir->3570614338-diminuir,18182,9413
processos->processos/dados-sintegra-mg->3373103500-executar->3373103500-múltipla seleção->3373103500-cancelar,17080,8582
processos->processos/apagar-dados-mercadorias->589853967-executar->589853967-múltipla seleção->589853967-este parâmetro possui mais de 100 valores. clique aqui para carregar todos.,17013,8420
processos->processos/apagar-dados-mercadorias->589853967-executar->589853967-múltipla seleção->589853967-próximo,17740,8615
processos->processos/apagar-dados-mercadorias->589853967-executar->589853967-múltipla seleção->589853967-cancelar,17366,8580
processos->processos/apagar-dados-recup-st->1307678592-abrir visualização->1307678592-expandir->1307678592-diminuir,18238,9665
obrigacoes->obrigacoes/solicitacao-resultado->4051203067-agendamentos->1101762724-abrir visualização->1101762724-expandir->1101762724-diminuir,27133,16256
