STATE,IDS-OCCURRENCE,IDUBS-OCCURRENCE
root,157,30
home,1,1
parametros-gerais,2,2
lancamentos,16,4
operacoes,6,3
obrigacoes,48,6
relatorios,65,7
processos,10,2
processos-customizados,1,1
downloads,5,5
collapse-menu,1,1
modules-menu,1,1
parametros-gerais/codigos-receita-agenda-recolhimento,1,1
lancamentos/lancamento-debitos-analiticos,6,3
lancamentos/lancamento-debitos-consolidados,5,5
lancamentos/lancamento-creditos,4,4
operacoes/conciliacao-pagamento-darf,2,2
operacoes/importacao-debitos-creditos,3,2
obrigacoes/configuracao,8,6
obrigacoes/solicitacoes,12,11
obrigacoes/obrigacoes-executadas,12,12
obrigacoes/periodicidade,10,10
obrigacoes/configuracao-estabelecimento,5,5
relatorios/agenda-recolhimento,9,9
relatorios/pagamento-multa-juros,9,9
relatorios/lancamentos-de-debitos-analiticos-por-sistema-de-origem,9,9
relatorios/lancamentos-de-debitos-consolidados,19,19
relatorios/lancamentos-de-creditos,9,9
relatorios/lancamentos-de-creditos-do-tipo-pagamento-em-atraso,9,9
processos/consolidacao-lancamentos-de-debitos,9,9
421757132-power-search-button,1,1
421757132-download,1,1
421757132-detalhes,1,1
421757132-excluir,1,1
741543100-novo,4,3
741543100-power-search-button,1,1
144024936-agenda,3,3
144024936-power-search-button,1,1
3993712770-novo,2,2
3993712770-power-search-button,1,1
92414607-power-search-button,1,1
1315386227-pesquisar,1,1
678895530-power-search-button,1,1
678895530-gerenciar labels,2,2
678895530-visualizar parâmetros,1,1
678895530-visualizar/editar,3,3
3223976761-ir para todas as obrigações,2,2
3223976761-ajuda,1,1
3223976761-nova solicitação,1,1
3223976761-agendamentos,1,1
3223976761-atualizar,1,1
3223976761-gerar obrigação,1,1
3223976761-ajustar parâmetros da geração,1,1
3223976761-visualizar resultado da geração,1,1
3223976761-protocolo transmissão,1,1
3223976761-excluir geração,1,1
3371290466-power-search-button,1,1
3371290466-visualização,2,2
3371290466-abrir visualização,6,6
3371290466-visualizar,2,2
2148651226-novo,4,4
2148651226-power-search-button,1,1
2148651226-editar,3,3
2148651226-excluir,1,1
829132674-novo,2,2
829132674-power-search-button,1,1
829132674-excluir,1,1
4010788594-executar,4,4
4010788594-agendamentos,1,1
4010788594-power-search-button,1,1
4010788594-visualização,2,2
1436609750-executar,4,4
1436609750-agendamentos,1,1
1436609750-power-search-button,1,1
1436609750-visualização,2,2
2549579271-executar,4,4
2549579271-agendamentos,1,1
2549579271-power-search-button,1,1
2549579271-visualização,2,2
772074419-executar,4,4
772074419-agendamentos,1,1
772074419-power-search-button,1,1
772074419-visualização,2,2
772074419-regerar,1,1
772074419-detalhes,2,2
772074419-excluir,1,1
772074419-abrir visualização,6,6
2580041027-executar,4,4
2580041027-agendamentos,1,1
2580041027-power-search-button,1,1
2580041027-visualização,2,2
3415243707-executar,4,4
3415243707-agendamentos,1,1
3415243707-power-search-button,1,1
3415243707-visualização,2,2
4238912785-executar,4,4
4238912785-agendamentos,1,1
4238912785-power-search-button,1,1
4238912785-visualização,2,2
963479981-salvar,1,1
963479981-voltar,1,1
144024936-pesquisar,1,1
144024936-powerselect-estCodigo,1,1
3993712770-item-,1,1
678895530-fechar,1,1
1585736775-salvar,1,1
1585736775-voltar,1,1
3223976761-voltar às obrigações do módulo,1,1
3371290466-item-,1,1
3371290466-aumentar o zoom,1,1
3371290466-diminuir o zoom,1,1
3371290466-expandir,2,2
3371290466-download,1,1
3371290466-dados disponíveis para impressão,1,1
2148651226-criar,1,1
2148651226-cancelar,1,1
2148651226-input-number-ano,1,1
2148651226-remover item,1,1
2148651226-salvar,1,1
829132674-cancelar,1,1
4010788594-múltipla seleção,2,2
4010788594-agendar,1,1
4010788594-item-,1,1
1436609750-múltipla seleção,2,2
1436609750-agendar,1,1
1436609750-item-,1,1
2549579271-múltipla seleção,2,2
2549579271-agendar,1,1
2549579271-item-,1,1
772074419-múltipla seleção,2,2
772074419-agendar,1,1
772074419-item-,1,1
772074419-não há dados disponíveis para impressão,1,1
772074419-aumentar o zoom,1,1
772074419-diminuir o zoom,1,1
772074419-expandir,2,2
772074419-download,1,1
2580041027-múltipla seleção,2,2
2580041027-agendar,1,1
2580041027-item-,1,1
3415243707-múltipla seleção,2,2
3415243707-agendar,1,1
3415243707-item-,1,1
4238912785-múltipla seleção,2,2
4238912785-agendar,1,1
4238912785-item-,1,1
3371290466-diminuir,1,1
4010788594-cancelar,1,1
1436609750-cancelar,1,1
2549579271-cancelar,1,1
772074419-cancelar,1,1
772074419-diminuir,1,1
2580041027-cancelar,1,1
3415243707-cancelar,1,1
4238912785-cancelar,1,1
1315386227-powerselect-estCodigo-1315386227-powerselect-origDebCred-1315386227-powerselect-codReceita-1315386227-powerselect-grisEstab-1315386227-powerselect-indManAuto,0,1
963479981-powerselect-estCodigo-963479981-powerselect-ccriCodigo-963479981-input-tributo-963479981-input-descricao-963479981-input-monetary-vlDebito,0,1
