yarn run v1.22.19
$ bash collectCPU.sh > executionMetrics.txt & NODE_ENV=generation EXECUTION_MODE=production node --max-old-space-size=12288 entrypoint.js
EXECUTION_MODE=production
NODE_ENV=generation
BASE_URL=http://system-A20
BASE_URL_API=http://system-A20-api
USER_LOGIN=xxxxxxxx
USER_PASSWORD=xxxxxxxxx
LOGIN_URL=http://system-A20login
E2E_FOLDER=../e2e/exploratory/A20/administrador
ERROR_MESSAGE=Ocorreu um erro,ACESSO NEGADO,ERRO INESPERADO,Access is denied,Acesso Negado
CHECK_400=true
CHECK_500=true
ALLOWABLE_CODE_ERROR=422
[1;92mWelcome to Cytestion![0;0m Version: 1.6. A tool for automated GUI testing of web applications, using the cypress framework
[1;92mINFO:[0;0m Verifying existence of cypress config file and set environment variables
[1;92mINFO:[0;0m Checks if the tests have already been generated, inform it will be replaced.
[1;92mINFO:[0;0m Important! File with exploratory tests was found. After this execution it will be replaced.
[1;92mINFO:[0;0m Generating tests
[1;92mINFO:[0;0m Total test cases: 1
[1;92mINFO:[0;0m Total test cases without skip: 1
[1;92mINFO:[0;0m Batched file created: ../e2e/exploratory/A20/administrador/batched/cytestion_1.cy.js. Total tests in batched file: 1
$ ./node_modules/.bin/cypress run -s '../e2e/exploratory/A20/administrador/batched/**/*.cy.js'
It looks like this is your first time using Cypress: 13.6.2

[STARTED] Task without title.
[TITLE]  Verified Cypress!       /home/lsi/.cache/Cypress/13.6.2/Cypress
[SUCCESS]  Verified Cypress!       /home/lsi/.cache/Cypress/13.6.2/Cypress

Opening Cypress...

================================================================================

  (Run Starting)

  ┌────────────────────────────────────────────────────────────────────────────────────────────────┐
  │ Cypress:        13.6.2                                                                         │
  │ Browser:        Electron 114 (headless)                                                        │
  │ Node Version:   v16.20.0 (/home/lsi/.nvm/versions/node/v16.20.0/bin/node)                      │
  │ Specs:          1 found (cytestion_1.cy.js)                                                    │
  │ Searched:       /home/lsi/tcc/tce/cytestion-utilization/e2e/exploratory/A20/administrad │
  │                 or/batched/**/*.cy.js                                                          │
  │ Experiments:    experimentalMemoryManagement=true                                              │
  └────────────────────────────────────────────────────────────────────────────────────────────────┘


────────────────────────────────────────────────────────────────────────────────────────────────────
                                                                                                    
  Running:  cytestion_1.cy.js                                                               (1 of 1)


  Cytestion
    ✓ Visits index page (12823ms)


  1 passing (13s)


  (Results)

  ┌────────────────────────────────────────────────────────────────────────────────────────────────┐
  │ Tests:        1                                                                                │
  │ Passing:      1                                                                                │
  │ Failing:      0                                                                                │
  │ Pending:      0                                                                                │
  │ Skipped:      0                                                                                │
  │ Screenshots:  0                                                                                │
  │ Video:        false                                                                            │
  │ Duration:     12 seconds                                                                       │
  │ Spec Ran:     cytestion_1.cy.js                                                                │
  └────────────────────────────────────────────────────────────────────────────────────────────────┘


================================================================================

  (Run Finished)


       Spec                                              Tests  Passing  Failing  Pending  Skipped  
  ┌────────────────────────────────────────────────────────────────────────────────────────────────┐
  │ ✔  cytestion_1.cy.js                        00:12        1        1        -        -        - │
  └────────────────────────────────────────────────────────────────────────────────────────────────┘
    ✔  All specs passed!                        00:12        1        1        -        -        -  

[1;92mINFO:[0;0m Generating tests
[1;92mINFO:[0;0m Total test cases: 25
[1;92mINFO:[0;0m Total test cases without skip: 24
[1;92mINFO:[0;0m Batched file created: ../e2e/exploratory/A20/administrador/batched/cytestion_1.cy.js. Total tests in batched file: 24
$ ./node_modules/.bin/cypress run -s '../e2e/exploratory/A20/administrador/batched/**/*.cy.js'

================================================================================

  (Run Starting)

  ┌────────────────────────────────────────────────────────────────────────────────────────────────┐
  │ Cypress:        13.6.2                                                                         │
  │ Browser:        Electron 114 (headless)                                                        │
  │ Node Version:   v16.20.0 (/home/lsi/.nvm/versions/node/v16.20.0/bin/node)                      │
  │ Specs:          1 found (cytestion_1.cy.js)                                                    │
  │ Searched:       /home/lsi/tcc/tce/cytestion-utilization/e2e/exploratory/A20/administrad │
  │                 or/batched/**/*.cy.js                                                          │
  │ Experiments:    experimentalMemoryManagement=true                                              │
  └────────────────────────────────────────────────────────────────────────────────────────────────┘


────────────────────────────────────────────────────────────────────────────────────────────────────
                                                                                                    
  Running:  cytestion_1.cy.js                                                               (1 of 1)


  Cytestion
    ✓ Click on element tce-logo-button (12766ms)
    ✓ Click on element collapse-menu-button (11297ms)
    ✓ Click on element entity-button (12035ms)
    ✓ Click on element scale-plus-button (11486ms)
    ✓ Click on element scale-standard-button (11916ms)
    ✓ Click on element scale-minus-button (10825ms)
    ✓ Click on element layout-button (11298ms)
    ✓ Click on element notification-button (11356ms)
    ✓ Click on element profile-button (12453ms)
    ✓ Click on element catalogo de produtos (12110ms)
    ✓ Click on element termo de referencia (12139ms)
    ✓ Click on element cadastros e consultas (10664ms)
    ✓ Click on element auditoria (11132ms)
    ✓ Click on element alertas (11810ms)
    ✓ Click on element administracao (11304ms)
    ✓ Click on element seguranca (11096ms)
    ✓ Click on element obras (10892ms)
    ✓ Click on element 2147483695-3 nova(s) no ultimo ano (10967ms)
    ✓ Click on element 2147483695-5 nova(s) no ultimo ano (11205ms)
    ✓ Click on element 2147483695-2 nova(s) no ultimo ano (11179ms)
    ✓ Click on element 2147483695-10 novo(s) no ultimo ano (11494ms)
    ✓ Click on element 2147483695-15 novo(s) no ultimo ano (11454ms)
    ✓ Click on element 2147483695-exibir todos os alertas... (10969ms)
    ✓ Click on element 2147483695-visualizar (11534ms)


  24 passing (5m)


  (Results)

  ┌────────────────────────────────────────────────────────────────────────────────────────────────┐
  │ Tests:        24                                                                               │
  │ Passing:      24                                                                               │
  │ Failing:      0                                                                                │
  │ Pending:      0                                                                                │
  │ Skipped:      0                                                                                │
  │ Screenshots:  0                                                                                │
  │ Video:        false                                                                            │
  │ Duration:     4 minutes, 36 seconds                                                            │
  │ Spec Ran:     cytestion_1.cy.js                                                                │
  └────────────────────────────────────────────────────────────────────────────────────────────────┘


================================================================================

  (Run Finished)


       Spec                                              Tests  Passing  Failing  Pending  Skipped  
  ┌────────────────────────────────────────────────────────────────────────────────────────────────┐
  │ ✔  cytestion_1.cy.js                        04:36       24       24        -        -        - │
  └────────────────────────────────────────────────────────────────────────────────────────────────┘
    ✔  All specs passed!                        04:36       24       24        -        -        -  

[1;92mINFO:[0;0m Generating tests
[1;92mINFO:[0;0m Total test cases: 78
[1;92mINFO:[0;0m Total test cases without skip: 53
[1;92mINFO:[0;0m Batched file created: ../e2e/exploratory/A20/administrador/batched/cytestion_1.cy.js. Total tests in batched file: 50
[1;92mINFO:[0;0m Batched file created: ../e2e/exploratory/A20/administrador/batched/cytestion_2.cy.js. Total tests in batched file: 3
$ ./node_modules/.bin/cypress run -s '../e2e/exploratory/A20/administrador/batched/**/*.cy.js'

================================================================================

  (Run Starting)

  ┌────────────────────────────────────────────────────────────────────────────────────────────────┐
  │ Cypress:        13.6.2                                                                         │
  │ Browser:        Electron 114 (headless)                                                        │
  │ Node Version:   v16.20.0 (/home/lsi/.nvm/versions/node/v16.20.0/bin/node)                      │
  │ Specs:          2 found (cytestion_1.cy.js, cytestion_2.cy.js)                                 │
  │ Searched:       /home/lsi/tcc/tce/cytestion-utilization/e2e/exploratory/A20/administrad │
  │                 or/batched/**/*.cy.js                                                          │
  │ Experiments:    experimentalMemoryManagement=true                                              │
  └────────────────────────────────────────────────────────────────────────────────────────────────┘


────────────────────────────────────────────────────────────────────────────────────────────────────
                                                                                                    
  Running:  cytestion_1.cy.js                                                               (1 of 2)


  Cytestion
    ✓ Click on element entity-button->2147483695-cancelar (14512ms)
    ✓ Click on element profile-button->recarregar-permissoes-button (14372ms)
    ✓ Click on element profile-button->configuracoes-button (13235ms)
    ✓ Click on element profile-button->sobre-button (12559ms)
    ✓ Click on element catalogo de produtos->4245688225-pi pi-search (11623ms)
    ✓ Click on element catalogo de produtos->4245688225-filtros (12236ms)
    ✓ Click on element catalogo de produtos->4245688225-pi pi-times (13033ms)
    ✓ Click on element termo de referencia->secoes (12877ms)
    ✓ Click on element termo de referencia->gerenciamento de termos (13130ms)
    ✓ Click on element cadastros e consultas->licitacao (16175ms)
    ✓ Click on element cadastros e consultas->adesao/carona (14083ms)
    ✓ Click on element cadastros e consultas->dispensa (12157ms)
    ✓ Click on element cadastros e consultas->inexigibilidade (12382ms)
    ✓ Click on element cadastros e consultas->contrato/aditivo (14609ms)
    ✓ Click on element cadastros e consultas->comissao (12675ms)
    ✓ Click on element cadastros e consultas->requisicoes de modificacao (13550ms)
    ✓ Click on element cadastros e consultas->consultar processos (16081ms)
    ✓ Click on element auditoria->alertas dafo (13120ms)
    ✓ Click on element auditoria->analisar processos (12911ms)
    ✓ Click on element auditoria->secoes checklist (13004ms)
    ✓ Click on element auditoria->checklist de verificacao (13240ms)
    ✓ Click on element auditoria->analise automatica (12814ms)
    ✓ Click on element auditoria->historico processos (13266ms)
    ✓ Click on element auditoria->analise de editais (12078ms)
    ✓ Click on element auditoria->monitoramento atos diario oficial (12860ms)
    ✓ Click on element auditoria->mapeamento de atos com licitacoes (13141ms)
    ✓ Click on element alertas->1537469311-pi pi-search (12256ms)
    ✓ Click on element alertas->1537469311-filtros (12812ms)
    ✓ Click on element alertas->1537469311-detalhes do processo (16175ms)
    ✓ Click on element alertas->1537469311-visualizar alerta (12632ms)
    ✓ Click on element alertas->1537469311-arquivar alerta (12361ms)
    ✓ Click on element alertas->1537469311-pi pi-times (12732ms)
    ✓ Click on element administracao->elementos de despesa (13657ms)
    ✓ Click on element administracao->falhas (12801ms)
    ✓ Click on element administracao->feriados (13083ms)
    ✓ Click on element administracao->fontes de recurso (13171ms)
    ✓ Click on element administracao->formas de licitacao (13623ms)
    ✓ Click on element administracao->formas de publicacao (12945ms)
    ✓ Click on element administracao->fundamentacao legal (12521ms)
    ✓ Click on element administracao->licitantes (13021ms)
    ✓ Click on element administracao->modalidades da licitacao (13003ms)
    ✓ Click on element administracao->criterios de julgamento (13199ms)
    ✓ Click on element administracao->gerador de links (12300ms)
    ✓ Click on element administracao->variaveis de controle (12443ms)
    ✓ Click on element administracao->parametrizacao dos arquivos (12659ms)
    ✓ Click on element administracao->entidade externa (13279ms)
    ✓ Click on element administracao->responsavel ente (12183ms)
    ✓ Click on element seguranca->grupos (13135ms)
    ✓ Click on element seguranca->usuarios (13558ms)
    ✓ Click on element seguranca->auditores atribuidores (12477ms)


  50 passing (11m)


  (Results)

  ┌────────────────────────────────────────────────────────────────────────────────────────────────┐
  │ Tests:        50                                                                               │
  │ Passing:      50                                                                               │
  │ Failing:      0                                                                                │
  │ Pending:      0                                                                                │
  │ Skipped:      0                                                                                │
  │ Screenshots:  0                                                                                │
  │ Video:        false                                                                            │
  │ Duration:     11 minutes, 0 seconds                                                            │
  │ Spec Ran:     cytestion_1.cy.js                                                                │
  └────────────────────────────────────────────────────────────────────────────────────────────────┘


────────────────────────────────────────────────────────────────────────────────────────────────────
                                                                                                    
  Running:  cytestion_2.cy.js                                                               (2 of 2)


  Cytestion
    ✓ Click on element seguranca->funcoes de risco (14161ms)
    ✓ Click on element seguranca->configuracoes (12983ms)
    ✓ Click on element obras->medicao (12943ms)


  3 passing (40s)


  (Results)

  ┌────────────────────────────────────────────────────────────────────────────────────────────────┐
  │ Tests:        3                                                                                │
  │ Passing:      3                                                                                │
  │ Failing:      0                                                                                │
  │ Pending:      0                                                                                │
  │ Skipped:      0                                                                                │
  │ Screenshots:  0                                                                                │
  │ Video:        false                                                                            │
  │ Duration:     40 seconds                                                                       │
  │ Spec Ran:     cytestion_2.cy.js                                                                │
  └────────────────────────────────────────────────────────────────────────────────────────────────┘


================================================================================

  (Run Finished)


       Spec                                              Tests  Passing  Failing  Pending  Skipped  
  ┌────────────────────────────────────────────────────────────────────────────────────────────────┐
  │ ✔  cytestion_1.cy.js                        11:00       50       50        -        -        - │
  ├────────────────────────────────────────────────────────────────────────────────────────────────┤
  │ ✔  cytestion_2.cy.js                        00:40        3        3        -        -        - │
  └────────────────────────────────────────────────────────────────────────────────────────────────┘
    ✔  All specs passed!                        11:40       53       53        -        -        -  

[1;92mINFO:[0;0m Generating tests
[1;92mINFO:[0;0m Total test cases: 356
[1;92mINFO:[0;0m Total test cases without skip: 278
[1;92mINFO:[0;0m Batched file created: ../e2e/exploratory/A20/administrador/batched/cytestion_1.cy.js. Total tests in batched file: 50
[1;92mINFO:[0;0m Batched file created: ../e2e/exploratory/A20/administrador/batched/cytestion_2.cy.js. Total tests in batched file: 50
[1;92mINFO:[0;0m Batched file created: ../e2e/exploratory/A20/administrador/batched/cytestion_3.cy.js. Total tests in batched file: 50
[1;92mINFO:[0;0m Batched file created: ../e2e/exploratory/A20/administrador/batched/cytestion_4.cy.js. Total tests in batched file: 50
[1;92mINFO:[0;0m Batched file created: ../e2e/exploratory/A20/administrador/batched/cytestion_5.cy.js. Total tests in batched file: 50
[1;92mINFO:[0;0m Batched file created: ../e2e/exploratory/A20/administrador/batched/cytestion_6.cy.js. Total tests in batched file: 28
$ ./node_modules/.bin/cypress run -s '../e2e/exploratory/A20/administrador/batched/**/*.cy.js'

================================================================================

  (Run Starting)

  ┌────────────────────────────────────────────────────────────────────────────────────────────────┐
  │ Cypress:        13.6.2                                                                         │
  │ Browser:        Electron 114 (headless)                                                        │
  │ Node Version:   v16.20.0 (/home/lsi/.nvm/versions/node/v16.20.0/bin/node)                      │
  │ Specs:          6 found (cytestion_1.cy.js, cytestion_2.cy.js, cytestion_3.cy.js, cytestion_4. │
  │                 cy.js, cytestion_5.cy.js, cytestion_6.cy.js)                                   │
  │ Searched:       /home/lsi/tcc/tce/cytestion-utilization/e2e/exploratory/A20/administrad │
  │                 or/batched/**/*.cy.js                                                          │
  │ Experiments:    experimentalMemoryManagement=true                                              │
  └────────────────────────────────────────────────────────────────────────────────────────────────┘


────────────────────────────────────────────────────────────────────────────────────────────────────
                                                                                                    
  Running:  cytestion_1.cy.js                                                               (1 of 6)


  Cytestion
    ✓ Click on element termo de referencia->secoes->2718408923-pi pi-search (14332ms)
    ✓ Click on element termo de referencia->secoes->2718408923-pi pi-filter-slash (13107ms)
    ✓ Click on element termo de referencia->secoes->2718408923-filtros (12832ms)
    ✓ Click on element termo de referencia->secoes->2718408923-novo (12517ms)
    ✓ Click on element termo de referencia->secoes->2718408923-pi pi-pencil (12522ms)
    ✓ Click on element termo de referencia->secoes->2718408923-pi pi-trash (12065ms)
    ✓ Click on element termo de referencia->secoes->2718408923-pi pi-times (12878ms)
    ✓ Click on element termo de referencia->gerenciamento de termos->1834015054-pi pi-search (12709ms)
    ✓ Click on element termo de referencia->gerenciamento de termos->1834015054-filtros (12574ms)
    ✓ Click on element termo de referencia->gerenciamento de termos->1834015054-novo (12712ms)
    ✓ Click on element termo de referencia->gerenciamento de termos->1834015054-exportar dados (12082ms)
    ✓ Click on element termo de referencia->gerenciamento de termos->1834015054-pi pi-times (12813ms)
    ✓ Click on element cadastros e consultas->licitacao->1555221225-pi pi-search (19946ms)
    ✓ Click on element cadastros e consultas->licitacao->1555221225-filtros (16816ms)
    ✓ Click on element cadastros e consultas->licitacao->1555221225-nova licitacao (16895ms)
    ✓ Click on element cadastros e consultas->licitacao->1555221225-pi pi-angle-right (16586ms)
    ✓ Click on element cadastros e consultas->licitacao->1555221225-pi pi-sort-alt (16079ms)
    ✓ Click on element cadastros e consultas->licitacao->1555221225-pi pi-times (15688ms)
    ✓ Click on element cadastros e consultas->adesao/carona->1678432678-pi pi-search (13391ms)
    ✓ Click on element cadastros e consultas->adesao/carona->1678432678-filtros (12701ms)
    ✓ Click on element cadastros e consultas->adesao/carona->1678432678-novo (12719ms)
    ✓ Click on element cadastros e consultas->adesao/carona->1678432678-exportar dados (12108ms)
    ✓ Click on element cadastros e consultas->adesao/carona->1678432678-entidade de origem (12758ms)
    ✓ Click on element cadastros e consultas->adesao/carona->1678432678-numero do processo administrativo (12259ms)
    ✓ Click on element cadastros e consultas->adesao/carona->1678432678-valor (12281ms)
    ✓ Click on element cadastros e consultas->adesao/carona->1678432678-objeto (12736ms)
    ✓ Click on element cadastros e consultas->adesao/carona->1678432678-pi pi-ellipsis-v (12274ms)
    ✓ Click on element cadastros e consultas->adesao/carona->1678432678-ver mais (12344ms)
    ✓ Click on element cadastros e consultas->adesao/carona->1678432678-pi pi-times (12811ms)
    ✓ Click on element cadastros e consultas->dispensa->2643273457-pi pi-search (12978ms)
    ✓ Click on element cadastros e consultas->dispensa->2643273457-filtros (12186ms)
    ✓ Click on element cadastros e consultas->dispensa->2643273457-novo (12725ms)
    ✓ Click on element cadastros e consultas->dispensa->2643273457-exportar dados (12466ms)
    ✓ Click on element cadastros e consultas->dispensa->2643273457-numero do processo (11824ms)
    ✓ Click on element cadastros e consultas->dispensa->2643273457-responsavel (12632ms)
    ✓ Click on element cadastros e consultas->dispensa->2643273457-objeto (12808ms)
    ✓ Click on element cadastros e consultas->dispensa->2643273457-data de ratificacao (12652ms)
    ✓ Click on element cadastros e consultas->dispensa->2643273457-valor (12729ms)
    ✓ Click on element cadastros e consultas->dispensa->2643273457-pi pi-ellipsis-v (12049ms)
    ✓ Click on element cadastros e consultas->dispensa->2643273457-pi pi-times (12673ms)
    ✓ Click on element cadastros e consultas->inexigibilidade->3253598109-pi pi-search (12768ms)
    ✓ Click on element cadastros e consultas->inexigibilidade->3253598109-filtros (12452ms)
    ✓ Click on element cadastros e consultas->inexigibilidade->3253598109-novo (12623ms)
    ✓ Click on element cadastros e consultas->inexigibilidade->3253598109-exportar dados (12636ms)
    ✓ Click on element cadastros e consultas->inexigibilidade->3253598109-numero do processo (11544ms)
    ✓ Click on element cadastros e consultas->inexigibilidade->3253598109-responsavel pela ratificacao (12561ms)
    ✓ Click on element cadastros e consultas->inexigibilidade->3253598109-objeto (12488ms)
    ✓ Click on element cadastros e consultas->inexigibilidade->3253598109-data da assinatura (12626ms)
    ✓ Click on element cadastros e consultas->inexigibilidade->3253598109-valor (12907ms)
    ✓ Click on element cadastros e consultas->inexigibilidade->3253598109-pi pi-ellipsis-v (12465ms)


  50 passing (11m)


  (Results)

  ┌────────────────────────────────────────────────────────────────────────────────────────────────┐
  │ Tests:        50                                                                               │
  │ Passing:      50                                                                               │
  │ Failing:      0                                                                                │
  │ Pending:      0                                                                                │
  │ Skipped:      0                                                                                │
  │ Screenshots:  0                                                                                │
  │ Video:        false                                                                            │
  │ Duration:     10 minutes, 58 seconds                                                           │
  │ Spec Ran:     cytestion_1.cy.js                                                                │
  └────────────────────────────────────────────────────────────────────────────────────────────────┘


────────────────────────────────────────────────────────────────────────────────────────────────────
                                                                                                    
  Running:  cytestion_2.cy.js                                                               (2 of 6)


  Cytestion
    ✓ Click on element cadastros e consultas->inexigibilidade->3253598109-pi pi-times (13795ms)
    ✓ Click on element cadastros e consultas->contrato/aditivo->1791441076-pi pi-search (14885ms)
    ✓ Click on element cadastros e consultas->contrato/aditivo->1791441076-filtros (14833ms)
    ✓ Click on element cadastros e consultas->contrato/aditivo->1791441076-novo (14441ms)
    ✓ Click on element cadastros e consultas->contrato/aditivo->1791441076-exportar dados (14561ms)
    ✓ Click on element cadastros e consultas->contrato/aditivo->1791441076-numero do contrato (13949ms)
    ✓ Click on element cadastros e consultas->contrato/aditivo->1791441076-licitante (14467ms)
    ✓ Click on element cadastros e consultas->contrato/aditivo->1791441076-objeto (14305ms)
    ✓ Click on element cadastros e consultas->contrato/aditivo->1791441076-modalidade (15167ms)
    ✓ Click on element cadastros e consultas->contrato/aditivo->1791441076-valor (14614ms)
    ✓ Click on element cadastros e consultas->contrato/aditivo->1791441076-forma contrato (14687ms)
    ✓ Click on element cadastros e consultas->contrato/aditivo->1791441076-entidade externa (14491ms)
    ✓ Click on element cadastros e consultas->contrato/aditivo->1791441076-pi pi-ellipsis-v (14455ms)
    ✓ Click on element cadastros e consultas->contrato/aditivo->1791441076-pi pi-times (13563ms)
    ✓ Click on element cadastros e consultas->comissao->1752699694-pi pi-search (13020ms)
    ✓ Click on element cadastros e consultas->comissao->1752699694-filtros (12031ms)
    ✓ Click on element cadastros e consultas->comissao->1752699694-novo (13123ms)
    ✓ Click on element cadastros e consultas->comissao->1752699694-pi pi-times (12596ms)
    ✓ Click on element cadastros e consultas->requisicoes de modificacao->1906747741-pi pi-search (13153ms)
    ✓ Click on element cadastros e consultas->requisicoes de modificacao->1906747741-filtros (13538ms)
    ✓ Click on element cadastros e consultas->requisicoes de modificacao->1906747741-pi pi-user-edit (12096ms)
    ✓ Click on element cadastros e consultas->requisicoes de modificacao->1906747741-pi pi-times (11903ms)
    ✓ Click on element cadastros e consultas->consultar processos->1353241976-pi pi-search (16532ms)
    ✓ Click on element cadastros e consultas->consultar processos->1353241976-filtros (17047ms)
    ✓ Click on element cadastros e consultas->consultar processos->1353241976-nova licitacao (16625ms)
    ✓ Click on element cadastros e consultas->consultar processos->1353241976-exportar dados (16693ms)
    ✓ Click on element cadastros e consultas->consultar processos->1353241976-numero (16573ms)
    ✓ Click on element cadastros e consultas->consultar processos->1353241976-entidade/orgao (15951ms)
    ✓ Click on element cadastros e consultas->consultar processos->1353241976-objeto (16212ms)
    ✓ Click on element cadastros e consultas->consultar processos->1353241976-data de abertura (16978ms)
    ✓ Click on element cadastros e consultas->consultar processos->1353241976-modalidade (16294ms)
    ✓ Click on element cadastros e consultas->consultar processos->1353241976-valor estimado (16834ms)
    ✓ Click on element cadastros e consultas->consultar processos->1353241976-pi pi-ellipsis-v (16565ms)
    ✓ Click on element cadastros e consultas->consultar processos->1353241976-pi pi-times (16618ms)
    ✓ Click on element auditoria->alertas dafo->775637628-pi pi-search (14023ms)
    ✓ Click on element auditoria->alertas dafo->775637628-filtros (12864ms)
    ✓ Click on element auditoria->alertas dafo->775637628-pi pi-eye (13331ms)
    ✓ Click on element auditoria->alertas dafo->775637628-pi pi-times (13343ms)
    ✓ Click on element auditoria->analisar processos->3240378834-pi pi-search (12157ms)
    ✓ Click on element auditoria->analisar processos->3240378834-filtros (12560ms)
    ✓ Click on element auditoria->analisar processos->3240378834-pi pi-angle-down (13127ms)
    ✓ Click on element auditoria->analisar processos->3240378834-pi pi-angle-right (13009ms)
    ✓ Click on element auditoria->analisar processos->3240378834-pi pi-sort-alt (13058ms)
    ✓ Click on element auditoria->analisar processos->3240378834-pi pi-times (13030ms)
    ✓ Click on element auditoria->secoes checklist->3479445712-pi pi-search (13002ms)
    ✓ Click on element auditoria->secoes checklist->3479445712-filtros (12993ms)
    ✓ Click on element auditoria->secoes checklist->3479445712-novo (17212ms)
    ✓ Click on element auditoria->secoes checklist->3479445712-pi pi-pencil (11919ms)
    ✓ Click on element auditoria->secoes checklist->3479445712-pi pi-trash (12272ms)
    ✓ Click on element auditoria->secoes checklist->3479445712-pi pi-times (12524ms)


  50 passing (12m)


  (Results)

  ┌────────────────────────────────────────────────────────────────────────────────────────────────┐
  │ Tests:        50                                                                               │
  │ Passing:      50                                                                               │
  │ Failing:      0                                                                                │
  │ Pending:      0                                                                                │
  │ Skipped:      0                                                                                │
  │ Screenshots:  0                                                                                │
  │ Video:        false                                                                            │
  │ Duration:     11 minutes, 55 seconds                                                           │
  │ Spec Ran:     cytestion_2.cy.js                                                                │
  └────────────────────────────────────────────────────────────────────────────────────────────────┘


────────────────────────────────────────────────────────────────────────────────────────────────────
                                                                                                    
  Running:  cytestion_3.cy.js                                                               (3 of 6)


  Cytestion
    ✓ Click on element auditoria->checklist de verificacao->3355604276-pi pi-search (14015ms)
    ✓ Click on element auditoria->checklist de verificacao->3355604276-filtros (12651ms)
    ✓ Click on element auditoria->checklist de verificacao->3355604276-novo (12974ms)
    ✓ Click on element auditoria->checklist de verificacao->3355604276-pi pi-pencil (13203ms)
    ✓ Click on element auditoria->checklist de verificacao->3355604276-pi pi-trash (12616ms)
    ✓ Click on element auditoria->checklist de verificacao->3355604276-pi pi-times (12929ms)
    ✓ Click on element auditoria->analise automatica->74772744-pi pi-search (12494ms)
    ✓ Click on element auditoria->analise automatica->74772744-filtros (12584ms)
    ✓ Click on element auditoria->analise automatica->74772744-novo (12317ms)
    ✓ Click on element auditoria->analise automatica->74772744-pi pi-pencil (12940ms)
    ✓ Click on element auditoria->analise automatica->74772744-pi pi-trash (13051ms)
    ✓ Click on element auditoria->analise automatica->74772744-pi pi-times (13119ms)
    ✓ Click on element auditoria->historico processos->1628962350-pi pi-search (12410ms)
    ✓ Click on element auditoria->historico processos->1628962350-pi pi-filter-slash (11998ms)
    ✓ Click on element auditoria->historico processos->1628962350-filtros (12612ms)
    ✓ Click on element auditoria->historico processos->1628962350-pi pi-eye (11873ms)
    ✓ Click on element auditoria->historico processos->1628962350-pi pi-times (12562ms)
    ✓ Click on element auditoria->analise de editais->4100354799-pi pi-search (12918ms)
    ✓ Click on element auditoria->analise de editais->4100354799-filtros (13114ms)
    ✓ Click on element auditoria->analise de editais->4100354799-novo edital (12720ms)
    ✓ Click on element auditoria->analise de editais->4100354799-pi pi-times (11413ms)
    ✓ Click on element auditoria->monitoramento atos diario oficial->3575258333-pi pi-search (12673ms)
    ✓ Click on element auditoria->monitoramento atos diario oficial->3575258333-filtros (12355ms)
    ✓ Click on element auditoria->monitoramento atos diario oficial->3575258333-pi pi-times (12540ms)
    ✓ Click on element auditoria->mapeamento de atos com licitacoes->2601858932-pi pi-search (12471ms)
    ✓ Click on element auditoria->mapeamento de atos com licitacoes->2601858932-filtros (13076ms)
    ✓ Click on element auditoria->mapeamento de atos com licitacoes->2601858932-pi pi-ellipsis-v (12282ms)
    ✓ Click on element auditoria->mapeamento de atos com licitacoes->2601858932-pi pi-times (12299ms)
    ✓ Click on element alertas->1537469311-detalhes do processo->licitacao (20819ms)
    ✓ Click on element alertas->1537469311-detalhes do processo->adesao/carona (16204ms)
    ✓ Click on element alertas->1537469311-detalhes do processo->dispensa (16280ms)
    ✓ Click on element alertas->1537469311-detalhes do processo->inexigibilidade (17008ms)
    ✓ Click on element alertas->1537469311-detalhes do processo->contrato/aditivo (19093ms)
    ✓ Click on element alertas->1537469311-detalhes do processo->comissao (17161ms)
    ✓ Click on element alertas->1537469311-detalhes do processo->requisicoes de modificacao (16350ms)
    ✓ Click on element alertas->1537469311-detalhes do processo->consultar processos (21249ms)
    ✓ Click on element alertas->1537469311-detalhes do processo->1700861693-pi pi-search (16223ms)
    ✓ Click on element alertas->1537469311-detalhes do processo->1700861693-filtros (15713ms)
    ✓ Click on element alertas->1537469311-detalhes do processo->1700861693-nova licitacao (16100ms)
    ✓ Click on element alertas->1537469311-detalhes do processo->1700861693-pi pi-angle-right (17152ms)
    ✓ Click on element alertas->1537469311-detalhes do processo->1700861693-pi pi-sort-alt (16616ms)
    ✓ Click on element alertas->1537469311-detalhes do processo->1700861693-preparatoria (16323ms)
    ✓ Click on element alertas->1537469311-detalhes do processo->1700861693-divulgacao e publicacao da licitacao (15787ms)
    ✓ Click on element alertas->1537469311-detalhes do processo->1700861693-proxima fase (16750ms)
    ✓ Click on element alertas->1537469311-detalhes do processo->1700861693-suspender licitacao (16287ms)
    ✓ Click on element alertas->1537469311-detalhes do processo->1700861693-finalizar licitacao (16609ms)
    ✓ Click on element alertas->1537469311-detalhes do processo->1700861693-excluir (16974ms)
    ✓ Click on element alertas->1537469311-detalhes do processo->1700861693-pi pi-list (16893ms)
    ✓ Click on element alertas->1537469311-detalhes do processo->1700861693-visualizar (16344ms)
    ✓ Click on element alertas->1537469311-detalhes do processo->1700861693-download (16798ms)


  50 passing (12m)


  (Results)

  ┌────────────────────────────────────────────────────────────────────────────────────────────────┐
  │ Tests:        50                                                                               │
  │ Passing:      50                                                                               │
  │ Failing:      0                                                                                │
  │ Pending:      0                                                                                │
  │ Skipped:      0                                                                                │
  │ Screenshots:  0                                                                                │
  │ Video:        false                                                                            │
  │ Duration:     12 minutes, 11 seconds                                                           │
  │ Spec Ran:     cytestion_3.cy.js                                                                │
  └────────────────────────────────────────────────────────────────────────────────────────────────┘


────────────────────────────────────────────────────────────────────────────────────────────────────
                                                                                                    
  Running:  cytestion_4.cy.js                                                               (4 of 6)


  Cytestion
    ✓ Click on element alertas->1537469311-detalhes do processo->1700861693-pi pi-times (17776ms)
    ✓ Click on element alertas->1537469311-visualizar alerta->3585023761-visualizar arquivos (12848ms)
    ✓ Click on element alertas->1537469311-visualizar alerta->3585023761-voltar (12956ms)
    ✓ Click on element alertas->1537469311-visualizar alerta->3585023761-arquivar (12815ms)
    ✓ Click on element alertas->1537469311-visualizar alerta->3585023761-responder (12566ms)
    ✓ Click on element alertas->1537469311-arquivar alerta->1537469311-cancelar (14136ms)
    ✓ Click on element alertas->1537469311-arquivar alerta->1537469311-arquivar (14181ms)
    ✓ Click on element administracao->falhas->1380608115-pi pi-search (12506ms)
    ✓ Click on element administracao->falhas->1380608115-filtros (12558ms)
    ✓ Click on element administracao->falhas->1380608115-novo (12083ms)
    ✓ Click on element administracao->falhas->1380608115-exportar dados (12811ms)
    ✓ Click on element administracao->falhas->1380608115-pi pi-pencil (13082ms)
    ✓ Click on element administracao->falhas->1380608115-pi pi-trash (12339ms)
    ✓ Click on element administracao->falhas->1380608115-pi pi-times (13061ms)
    ✓ Click on element administracao->feriados->4034562079-pi pi-search (13193ms)
    ✓ Click on element administracao->feriados->4034562079-filtros (12606ms)
    ✓ Click on element administracao->feriados->4034562079-novo (12468ms)
    ✓ Click on element administracao->feriados->4034562079-exportar dados (12878ms)
    ✓ Click on element administracao->feriados->4034562079-pi pi-pencil (12724ms)
    ✓ Click on element administracao->feriados->4034562079-pi pi-trash (12789ms)
    ✓ Click on element administracao->feriados->4034562079-pi pi-times (11840ms)
    ✓ Click on element administracao->fontes de recurso->2906815771-pi pi-search (11865ms)
    ✓ Click on element administracao->fontes de recurso->2906815771-filtros (12242ms)
    ✓ Click on element administracao->fontes de recurso->2906815771-novo (11931ms)
    ✓ Click on element administracao->fontes de recurso->2906815771-exportar dados (11930ms)
    ✓ Click on element administracao->fontes de recurso->2906815771-pi pi-pencil (12203ms)
    ✓ Click on element administracao->fontes de recurso->2906815771-pi pi-trash (12732ms)
    ✓ Click on element administracao->fontes de recurso->2906815771-pi pi-times (12396ms)
    ✓ Click on element administracao->formas de licitacao->2830712122-pi pi-search (12941ms)
    ✓ Click on element administracao->formas de licitacao->2830712122-filtros (12604ms)
    ✓ Click on element administracao->formas de licitacao->2830712122-novo (17236ms)
    ✓ Click on element administracao->formas de licitacao->2830712122-exportar dados (12768ms)
    ✓ Click on element administracao->formas de licitacao->2830712122-pi pi-pencil (11838ms)
    ✓ Click on element administracao->formas de licitacao->2830712122-pi pi-trash (11768ms)
    ✓ Click on element administracao->formas de licitacao->2830712122-pi pi-times (12480ms)
    ✓ Click on element administracao->formas de publicacao->1458627872-pi pi-search (13074ms)
    ✓ Click on element administracao->formas de publicacao->1458627872-filtros (12029ms)
    ✓ Click on element administracao->formas de publicacao->1458627872-novo (17098ms)
    ✓ Click on element administracao->formas de publicacao->1458627872-exportar dados (12405ms)
    ✓ Click on element administracao->formas de publicacao->1458627872-pi pi-pencil (12359ms)
    ✓ Click on element administracao->formas de publicacao->1458627872-pi pi-trash (12164ms)
    ✓ Click on element administracao->formas de publicacao->1458627872-pi pi-times (12819ms)
    ✓ Click on element administracao->fundamentacao legal->275348607-pi pi-search (12653ms)
    ✓ Click on element administracao->fundamentacao legal->275348607-filtros (12353ms)
    ✓ Click on element administracao->fundamentacao legal->275348607-novo (12944ms)
    ✓ Click on element administracao->fundamentacao legal->275348607-pi pi-pencil (11478ms)
    ✓ Click on element administracao->fundamentacao legal->275348607-pi pi-trash (11936ms)
    ✓ Click on element administracao->fundamentacao legal->275348607-pi pi-times (12587ms)
    ✓ Click on element administracao->licitantes->3164945720-pi pi-search (11689ms)
    ✓ Click on element administracao->licitantes->3164945720-filtros (11948ms)


  50 passing (11m)


  (Results)

  ┌────────────────────────────────────────────────────────────────────────────────────────────────┐
  │ Tests:        50                                                                               │
  │ Passing:      50                                                                               │
  │ Failing:      0                                                                                │
  │ Pending:      0                                                                                │
  │ Skipped:      0                                                                                │
  │ Screenshots:  0                                                                                │
  │ Video:        false                                                                            │
  │ Duration:     10 minutes, 42 seconds                                                           │
  │ Spec Ran:     cytestion_4.cy.js                                                                │
  └────────────────────────────────────────────────────────────────────────────────────────────────┘


────────────────────────────────────────────────────────────────────────────────────────────────────
                                                                                                    
  Running:  cytestion_5.cy.js                                                               (5 of 6)


  Cytestion
    ✓ Click on element administracao->licitantes->3164945720-novo (13682ms)
    ✓ Click on element administracao->licitantes->3164945720-exportar dados (12551ms)
    ✓ Click on element administracao->licitantes->3164945720-pi pi-list (13115ms)
    ✓ Click on element administracao->licitantes->3164945720-pi pi-pencil (12825ms)
    ✓ Click on element administracao->licitantes->3164945720-pi pi-trash (13417ms)
    ✓ Click on element administracao->licitantes->3164945720-pi pi-times (12687ms)
    ✓ Click on element administracao->modalidades da licitacao->2428299973-pi pi-search (12218ms)
    ✓ Click on element administracao->modalidades da licitacao->2428299973-filtros (12230ms)
    ✓ Click on element administracao->modalidades da licitacao->2428299973-novo (12558ms)
    ✓ Click on element administracao->modalidades da licitacao->2428299973-exportar dados (12730ms)
    ✓ Click on element administracao->modalidades da licitacao->2428299973-pi pi-pencil (12895ms)
    ✓ Click on element administracao->modalidades da licitacao->2428299973-pi pi-trash (12931ms)
    ✓ Click on element administracao->modalidades da licitacao->2428299973-pi pi-times (12272ms)
    ✓ Click on element administracao->criterios de julgamento->3946733471-pi pi-search (12656ms)
    ✓ Click on element administracao->criterios de julgamento->3946733471-filtros (12513ms)
    ✓ Click on element administracao->criterios de julgamento->3946733471-novo (12667ms)
    ✓ Click on element administracao->criterios de julgamento->3946733471-exportar dados (12078ms)
    ✓ Click on element administracao->criterios de julgamento->3946733471-pi pi-pencil (12735ms)
    ✓ Click on element administracao->criterios de julgamento->3946733471-pi pi-trash (12603ms)
    ✓ Click on element administracao->criterios de julgamento->3946733471-pi pi-times (12397ms)
    ✓ Click on element administracao->gerador de links->1437041263-pi pi-search (12747ms)
    ✓ Click on element administracao->gerador de links->1437041263-filtros (13565ms)
    ✓ Click on element administracao->gerador de links->1437041263-novo (12984ms)
    ✓ Click on element administracao->gerador de links->1437041263-pi pi-times (12741ms)
    ✓ Click on element administracao->variaveis de controle->3787439616-pi pi-search (12672ms)
    ✓ Click on element administracao->variaveis de controle->3787439616-filtros (12804ms)
    ✓ Click on element administracao->variaveis de controle->3787439616-pi pi-times (12291ms)
    ✓ Click on element administracao->parametrizacao dos arquivos->3706103062-pi pi-search (12305ms)
    ✓ Click on element administracao->parametrizacao dos arquivos->3706103062-filtros (11852ms)
    ✓ Click on element administracao->parametrizacao dos arquivos->3706103062-pi pi-list (12868ms)
    ✓ Click on element administracao->parametrizacao dos arquivos->3706103062-pi pi-pencil (12901ms)
    ✓ Click on element administracao->parametrizacao dos arquivos->3706103062-pi pi-times (11819ms)
    ✓ Click on element administracao->entidade externa->3919870791-pi pi-search (12671ms)
    ✓ Click on element administracao->entidade externa->3919870791-filtros (12928ms)
    ✓ Click on element administracao->entidade externa->3919870791-novo (11987ms)
    ✓ Click on element administracao->entidade externa->3919870791-exportar dados (12737ms)
    ✓ Click on element administracao->entidade externa->3919870791-pi pi-pencil (13022ms)
    ✓ Click on element administracao->entidade externa->3919870791-pi pi-trash (12981ms)
    ✓ Click on element administracao->entidade externa->3919870791-pi pi-times (12068ms)
    ✓ Click on element administracao->responsavel ente->1130073086-pi pi-search (12270ms)
    ✓ Click on element administracao->responsavel ente->1130073086-filtros (12687ms)
    ✓ Click on element administracao->responsavel ente->1130073086-novo (12691ms)
    ✓ Click on element administracao->responsavel ente->1130073086-pi pi-pencil (12949ms)
    ✓ Click on element administracao->responsavel ente->1130073086-pi pi-trash (11942ms)
    ✓ Click on element administracao->responsavel ente->1130073086-pi pi-times (12287ms)
    ✓ Click on element seguranca->grupos->1745718313-pi pi-search (12476ms)
    ✓ Click on element seguranca->grupos->1745718313-filtros (12502ms)
    ✓ Click on element seguranca->grupos->1745718313-novo (12357ms)
    ✓ Click on element seguranca->grupos->1745718313-permissoes (13194ms)
    ✓ Click on element seguranca->grupos->1745718313-usuarios (11917ms)


  50 passing (11m)


  (Results)

  ┌────────────────────────────────────────────────────────────────────────────────────────────────┐
  │ Tests:        50                                                                               │
  │ Passing:      50                                                                               │
  │ Failing:      0                                                                                │
  │ Pending:      0                                                                                │
  │ Skipped:      0                                                                                │
  │ Screenshots:  0                                                                                │
  │ Video:        false                                                                            │
  │ Duration:     10 minutes, 33 seconds                                                           │
  │ Spec Ran:     cytestion_5.cy.js                                                                │
  └────────────────────────────────────────────────────────────────────────────────────────────────┘


────────────────────────────────────────────────────────────────────────────────────────────────────
                                                                                                    
  Running:  cytestion_6.cy.js                                                               (6 of 6)


  Cytestion
    ✓ Click on element seguranca->grupos->1745718313-pi pi-pencil (14053ms)
    ✓ Click on element seguranca->grupos->1745718313-pi pi-trash (12976ms)
    ✓ Click on element seguranca->grupos->1745718313-pi pi-times (12035ms)
    ✓ Click on element seguranca->usuarios->4277602509-pi pi-search (11879ms)
    ✓ Click on element seguranca->usuarios->4277602509-filtros (12692ms)
    ✓ Click on element seguranca->usuarios->4277602509-grupos (12672ms)
    ✓ Click on element seguranca->usuarios->4277602509-pi pi-pencil (12309ms)
    ✓ Click on element seguranca->usuarios->4277602509-pi pi-times (11835ms)
    ✓ Click on element seguranca->auditores atribuidores->2252475832-pi pi-search (13151ms)
    ✓ Click on element seguranca->auditores atribuidores->2252475832-filtros (12522ms)
    ✓ Click on element seguranca->auditores atribuidores->2252475832-novo (12513ms)
    ✓ Click on element seguranca->auditores atribuidores->2252475832-pi pi-times (12332ms)
    ✓ Click on element seguranca->funcoes de risco->3861932206-pi pi-search (12698ms)
    ✓ Click on element seguranca->funcoes de risco->3861932206-filtros (12631ms)
    ✓ Click on element seguranca->funcoes de risco->3861932206-novo (13319ms)
    ✓ Click on element seguranca->funcoes de risco->3861932206-pi pi-eye (12311ms)
    ✓ Click on element seguranca->funcoes de risco->3861932206-pi pi-pencil (12614ms)
    ✓ Click on element seguranca->funcoes de risco->3861932206-pi pi-trash (12599ms)
    ✓ Click on element seguranca->funcoes de risco->3861932206-pi pi-times (12453ms)
    ✓ Click on element seguranca->configuracoes->2791227887-novo (12768ms)
    ✓ Click on element seguranca->configuracoes->2791227887-voltar (12536ms)
    ✓ Click on element seguranca->configuracoes->2791227887-salvar (12674ms)
    ✓ Click on element obras->medicao->391958567-pi pi-chevron-right (12950ms)
    ✓ Click on element obras->medicao->391958567-pi pi-times (12229ms)
    ✓ Click on element obras->medicao->391958567-pi pi-search (13224ms)
    ✓ Click on element obras->medicao->391958567-filtros (12493ms)
    ✓ Click on element obras->medicao->391958567-pi pi-ellipsis-v (13031ms)
    ✓ Click on element obras->medicao->391958567-ver mais (13347ms)


  28 passing (6m)


  (Results)

  ┌────────────────────────────────────────────────────────────────────────────────────────────────┐
  │ Tests:        28                                                                               │
  │ Passing:      28                                                                               │
  │ Failing:      0                                                                                │
  │ Pending:      0                                                                                │
  │ Skipped:      0                                                                                │
  │ Screenshots:  0                                                                                │
  │ Video:        false                                                                            │
  │ Duration:     5 minutes, 56 seconds                                                            │
  │ Spec Ran:     cytestion_6.cy.js                                                                │
  └────────────────────────────────────────────────────────────────────────────────────────────────┘


================================================================================

  (Run Finished)


       Spec                                              Tests  Passing  Failing  Pending  Skipped  
  ┌────────────────────────────────────────────────────────────────────────────────────────────────┐
  │ ✔  cytestion_1.cy.js                        10:58       50       50        -        -        - │
  ├────────────────────────────────────────────────────────────────────────────────────────────────┤
  │ ✔  cytestion_2.cy.js                        11:55       50       50        -        -        - │
  ├────────────────────────────────────────────────────────────────────────────────────────────────┤
  │ ✔  cytestion_3.cy.js                        12:11       50       50        -        -        - │
  ├────────────────────────────────────────────────────────────────────────────────────────────────┤
  │ ✔  cytestion_4.cy.js                        10:42       50       50        -        -        - │
  ├────────────────────────────────────────────────────────────────────────────────────────────────┤
  │ ✔  cytestion_5.cy.js                        10:33       50       50        -        -        - │
  ├────────────────────────────────────────────────────────────────────────────────────────────────┤
  │ ✔  cytestion_6.cy.js                        05:56       28       28        -        -        - │
  └────────────────────────────────────────────────────────────────────────────────────────────────┘
    ✔  All specs passed!                      1:02:17      278      278        -        -        -  

[1;92mINFO:[0;0m Generating tests
[1;92mINFO:[0;0m Total test cases: 444
[1;92mINFO:[0;0m Total test cases without skip: 88
[1;92mINFO:[0;0m Batched file created: ../e2e/exploratory/A20/administrador/batched/cytestion_1.cy.js. Total tests in batched file: 50
[1;92mINFO:[0;0m Batched file created: ../e2e/exploratory/A20/administrador/batched/cytestion_2.cy.js. Total tests in batched file: 38
$ ./node_modules/.bin/cypress run -s '../e2e/exploratory/A20/administrador/batched/**/*.cy.js'

================================================================================

  (Run Starting)

  ┌────────────────────────────────────────────────────────────────────────────────────────────────┐
  │ Cypress:        13.6.2                                                                         │
  │ Browser:        Electron 114 (headless)                                                        │
  │ Node Version:   v16.20.0 (/home/lsi/.nvm/versions/node/v16.20.0/bin/node)                      │
  │ Specs:          2 found (cytestion_1.cy.js, cytestion_2.cy.js)                                 │
  │ Searched:       /home/lsi/tcc/tce/cytestion-utilization/e2e/exploratory/A20/administrad │
  │                 or/batched/**/*.cy.js                                                          │
  │ Experiments:    experimentalMemoryManagement=true                                              │
  └────────────────────────────────────────────────────────────────────────────────────────────────┘


────────────────────────────────────────────────────────────────────────────────────────────────────
                                                                                                    
  Running:  cytestion_1.cy.js                                                               (1 of 2)


  Cytestion
    ✓ Click on element termo de referencia->secoes->2718408923-novo->171684078-voltar (14151ms)
    ✓ Click on element termo de referencia->secoes->2718408923-novo->171684078-salvar (13638ms)
    ✓ Click on element termo de referencia->secoes->2718408923-pi pi-pencil->556775477-voltar (12957ms)
    ✓ Click on element termo de referencia->secoes->2718408923-pi pi-pencil->556775477-salvar (12881ms)
    ✓ Click on element termo de referencia->gerenciamento de termos->1834015054-novo->942852187-exportar (14945ms)
    ✓ Click on element termo de referencia->gerenciamento de termos->1834015054-novo->942852187-voltar (13176ms)
    ✓ Click on element termo de referencia->gerenciamento de termos->1834015054-exportar dados->1834015054-csv (14178ms)
    ✓ Click on element termo de referencia->gerenciamento de termos->1834015054-exportar dados->1834015054-xls (13898ms)
    ✓ Click on element termo de referencia->gerenciamento de termos->1834015054-exportar dados->1834015054-pdf (14730ms)
    ✓ Click on element cadastros e consultas->licitacao->1555221225-nova licitacao->98475936-voltar (12259ms)
    ✓ Click on element cadastros e consultas->licitacao->1555221225-nova licitacao->98475936-pi pi-search (13156ms)
    ✓ Click on element cadastros e consultas->licitacao->1555221225-nova licitacao->98475936-salvar (13413ms)
    ✓ Click on element cadastros e consultas->licitacao->1555221225-pi pi-angle-right->1555221225-pi pi-angle-down (18071ms)
    ✓ Click on element cadastros e consultas->licitacao->1555221225-pi pi-sort-alt->1555221225-aplicar (17909ms)
    ✓ Click on element cadastros e consultas->comissao->1752699694-novo->3756309115-voltar (12565ms)
    ✓ Click on element cadastros e consultas->comissao->1752699694-novo->3756309115-salvar (13028ms)
    ✓ Click on element cadastros e consultas->requisicoes de modificacao->1906747741-pi pi-user-edit->alertas dafo (13344ms)
    ✓ Click on element cadastros e consultas->requisicoes de modificacao->1906747741-pi pi-user-edit->analisar processos (12856ms)
    ✓ Click on element cadastros e consultas->requisicoes de modificacao->1906747741-pi pi-user-edit->secoes checklist (13067ms)
    ✓ Click on element cadastros e consultas->requisicoes de modificacao->1906747741-pi pi-user-edit->checklist de verificacao (13081ms)
    ✓ Click on element cadastros e consultas->requisicoes de modificacao->1906747741-pi pi-user-edit->analise automatica (12467ms)
    ✓ Click on element cadastros e consultas->requisicoes de modificacao->1906747741-pi pi-user-edit->historico processos (13295ms)
    ✓ Click on element cadastros e consultas->requisicoes de modificacao->1906747741-pi pi-user-edit->analise de editais (13028ms)
    ✓ Click on element cadastros e consultas->requisicoes de modificacao->1906747741-pi pi-user-edit->monitoramento atos diario oficial (12939ms)
    ✓ Click on element cadastros e consultas->requisicoes de modificacao->1906747741-pi pi-user-edit->mapeamento de atos com licitacoes (12748ms)
    ✓ Click on element auditoria->alertas dafo->775637628-pi pi-eye->775637628-cancelar (14959ms)
    ✓ Click on element auditoria->alertas dafo->775637628-pi pi-eye->775637628-rejeitar alerta (14396ms)
    ✓ Click on element auditoria->alertas dafo->775637628-pi pi-eye->775637628-enviar para jurisdicionado (14828ms)
    ✓ Click on element auditoria->analisar processos->3240378834-pi pi-sort-alt->3240378834-aplicar (14625ms)
    ✓ Click on element auditoria->secoes checklist->3479445712-novo->803856921-voltar (17644ms)
    ✓ Click on element auditoria->secoes checklist->3479445712-novo->803856921-salvar (17137ms)
    ✓ Click on element auditoria->secoes checklist->3479445712-pi pi-pencil->3227589920-voltar (13308ms)
    ✓ Click on element auditoria->secoes checklist->3479445712-pi pi-pencil->3227589920-salvar (13343ms)
    ✓ Click on element auditoria->analise automatica->74772744-pi pi-pencil->3330963944-voltar (13591ms)
    ✓ Click on element auditoria->analise automatica->74772744-pi pi-pencil->3330963944-salvar (12481ms)
    ✓ Click on element auditoria->historico processos->1628962350-pi pi-eye->1628962350-fechar (14150ms)
    ✓ Click on element auditoria->analise de editais->4100354799-novo edital->4100354799-voltar (14512ms)
    ✓ Click on element auditoria->analise de editais->4100354799-novo edital->4100354799-analisar (13969ms)
    ✓ Click on element alertas->1537469311-visualizar alerta->3585023761-arquivar->3585023761-cancelar (14593ms)
    ✓ Click on element administracao->falhas->1380608115-pi pi-pencil->3165962653-voltar (13063ms)
    ✓ Click on element administracao->falhas->1380608115-pi pi-pencil->3165962653-salvar (13200ms)
    ✓ Click on element administracao->feriados->4034562079-pi pi-pencil->249978481-voltar (13078ms)
    ✓ Click on element administracao->feriados->4034562079-pi pi-pencil->249978481-salvar (13076ms)
    ✓ Click on element administracao->fontes de recurso->2906815771-pi pi-pencil->1144828917-voltar (12998ms)
    ✓ Click on element administracao->fontes de recurso->2906815771-pi pi-pencil->1144828917-salvar (13327ms)
    ✓ Click on element administracao->formas de licitacao->2830712122-novo->1615329263-voltar (17743ms)
    ✓ Click on element administracao->formas de licitacao->2830712122-novo->1615329263-salvar (17247ms)
    ✓ Click on element administracao->formas de licitacao->2830712122-exportar dados->2830712122-csv (15030ms)
    ✓ Click on element administracao->formas de licitacao->2830712122-exportar dados->2830712122-xls (14850ms)
    ✓ Click on element administracao->formas de licitacao->2830712122-exportar dados->2830712122-pdf (14114ms)


  50 passing (12m)


  (Results)

  ┌────────────────────────────────────────────────────────────────────────────────────────────────┐
  │ Tests:        50                                                                               │
  │ Passing:      50                                                                               │
  │ Failing:      0                                                                                │
  │ Pending:      0                                                                                │
  │ Skipped:      0                                                                                │
  │ Screenshots:  0                                                                                │
  │ Video:        false                                                                            │
  │ Duration:     11 minutes, 45 seconds                                                           │
  │ Spec Ran:     cytestion_1.cy.js                                                                │
  └────────────────────────────────────────────────────────────────────────────────────────────────┘


────────────────────────────────────────────────────────────────────────────────────────────────────
                                                                                                    
  Running:  cytestion_2.cy.js                                                               (2 of 2)


  Cytestion
    ✓ Click on element administracao->formas de publicacao->1458627872-novo->2117816265-voltar (18901ms)
    ✓ Click on element administracao->formas de publicacao->1458627872-novo->2117816265-salvar (17518ms)
    ✓ Click on element administracao->formas de publicacao->1458627872-exportar dados->1458627872-csv (14340ms)
    ✓ Click on element administracao->formas de publicacao->1458627872-exportar dados->1458627872-xls (13380ms)
    ✓ Click on element administracao->formas de publicacao->1458627872-exportar dados->1458627872-pdf (14334ms)
    ✓ Click on element administracao->formas de publicacao->1458627872-pi pi-pencil->3010823888-voltar (13667ms)
    ✓ Click on element administracao->formas de publicacao->1458627872-pi pi-pencil->3010823888-salvar (12916ms)
    ✓ Click on element administracao->licitantes->3164945720-pi pi-pencil->1052880824-voltar (12052ms)
    ✓ Click on element administracao->licitantes->3164945720-pi pi-pencil->1052880824-salvar (12725ms)
    ✓ Click on element administracao->modalidades da licitacao->2428299973-pi pi-pencil->266598411-voltar (13144ms)
    ✓ Click on element administracao->modalidades da licitacao->2428299973-pi pi-pencil->266598411-salvar (12941ms)
    ✓ Click on element administracao->criterios de julgamento->3946733471-pi pi-pencil->3606632177-voltar (13017ms)
    ✓ Click on element administracao->criterios de julgamento->3946733471-pi pi-pencil->3606632177-salvar (13228ms)
    ✓ Click on element administracao->gerador de links->1437041263-novo->2968366042-voltar (13262ms)
    ✓ Click on element administracao->gerador de links->1437041263-novo->2968366042-salvar (12403ms)
    ✓ Click on element administracao->parametrizacao dos arquivos->3706103062-pi pi-pencil->1098338586-voltar (12781ms)
    1) Click on element administracao->parametrizacao dos arquivos->3706103062-pi pi-pencil->1098338586-salvar
    ✓ Click on element administracao->entidade externa->3919870791-novo->3705829890-voltar (13258ms)
    ✓ Click on element administracao->entidade externa->3919870791-novo->3705829890-salvar (13074ms)
    ✓ Click on element administracao->entidade externa->3919870791-exportar dados->3919870791-csv (14969ms)
    ✓ Click on element administracao->entidade externa->3919870791-exportar dados->3919870791-xls (15509ms)
    ✓ Click on element administracao->entidade externa->3919870791-exportar dados->3919870791-pdf (14819ms)
    ✓ Click on element administracao->entidade externa->3919870791-pi pi-pencil->3319292489-voltar (13410ms)
    ✓ Click on element administracao->entidade externa->3919870791-pi pi-pencil->3319292489-salvar (12860ms)
    ✓ Click on element administracao->responsavel ente->1130073086-pi pi-pencil->2652145970-voltar (13257ms)
    ✓ Click on element administracao->responsavel ente->1130073086-pi pi-pencil->2652145970-salvar (13519ms)
    ✓ Click on element seguranca->grupos->1745718313-pi pi-pencil->1090080807-voltar (13517ms)
    ✓ Click on element seguranca->grupos->1745718313-pi pi-pencil->1090080807-salvar (13603ms)
    ✓ Click on element seguranca->usuarios->4277602509-pi pi-pencil->1750615299-voltar (13409ms)
    ✓ Click on element seguranca->usuarios->4277602509-pi pi-pencil->1750615299-salvar (13301ms)
    ✓ Click on element seguranca->auditores atribuidores->2252475832-novo->2252475832-cancelar (14949ms)
    ✓ Click on element seguranca->funcoes de risco->3861932206-novo->461755643-voltar (13337ms)
    ✓ Click on element seguranca->funcoes de risco->3861932206-novo->461755643-salvar (13057ms)
    ✓ Click on element seguranca->funcoes de risco->3861932206-pi pi-pencil->2734677634-novo (13156ms)
    ✓ Click on element seguranca->funcoes de risco->3861932206-pi pi-pencil->2734677634-voltar (13283ms)
    ✓ Click on element seguranca->funcoes de risco->3861932206-pi pi-pencil->2734677634-salvar (13261ms)
    ✓ Click on element seguranca->configuracoes->2791227887-novo->2791227887-pi pi-trash (14835ms)
    ✓ Click on element obras->medicao->391958567-ver mais->391958567-ver menos (15519ms)


  37 passing (9m)
  1 failing

  1) Cytestion
       Click on element administracao->parametrizacao dos arquivos->3706103062-pi pi-pencil->1098338586-salvar:

      AssertionError: Timed out retrying after 5000ms: Check requests with server error: expected 500 to be below 500
      + expected - actual


      at Context.eval (webpack://cytestion/./cypress/support/commands.js:262:80)




  (Results)

  ┌────────────────────────────────────────────────────────────────────────────────────────────────┐
  │ Tests:        38                                                                               │
  │ Passing:      37                                                                               │
  │ Failing:      1                                                                                │
  │ Pending:      0                                                                                │
  │ Skipped:      0                                                                                │
  │ Screenshots:  1                                                                                │
  │ Video:        false                                                                            │
  │ Duration:     8 minutes, 50 seconds                                                            │
  │ Spec Ran:     cytestion_2.cy.js                                                                │
  └────────────────────────────────────────────────────────────────────────────────────────────────┘


  (Screenshots)

  -  /home/lsi/tcc/tce/cytestion-utilization/cytestion/cypress/screenshots/cytestion_     (1280x720)
     2.cy.js/Cytestion -- Click on element administracao-parametrizacao dos arquivos-               
     3706103062-pi pi-pencil-1098338586-salvar (failed).png                                         


================================================================================

  (Run Finished)


       Spec                                              Tests  Passing  Failing  Pending  Skipped  
  ┌────────────────────────────────────────────────────────────────────────────────────────────────┐
  │ ✔  cytestion_1.cy.js                        11:45       50       50        -        -        - │
  ├────────────────────────────────────────────────────────────────────────────────────────────────┤
  │ ✖  cytestion_2.cy.js                        08:50       38       37        1        -        - │
  └────────────────────────────────────────────────────────────────────────────────────────────────┘
    ✖  1 of 2 failed (50%)                      20:35       88       87        1        -        -  

info Visit https://yarnpkg.com/en/docs/cli/run for documentation about this command.
[1;92mINFO:[0;0m Generating tests
Test file generated! (../e2e/exploratory/A20/administrador/cytestion.cy.js)
Time execution: 1:40:10.464 (h:mm:ss.mmm)
[1;92mINFO:[0;0m Run failures tests
info Visit https://yarnpkg.com/en/docs/cli/run for documentation about this command.
