TEST-NAME,IDS-TIME(MS),IDUBS-TIME(MS)
,4128,4079
index-navbar-toggle,4843,4839
index-navbar-brand,6607,6651
index-index,4572,4409
index-about,4516,4447
index-courses,4547,4402
index-fees,4510,4397
index-portfolio,4696,4558
index-dropdown-toggle,4520,4397
index-right-sidebar,4201,4129
index-dummy-link-1,4175,4135
index-dummy-link-2,4224,4127
index-dummy-link-3,4269,4126
index-contact,4536,4417
index-read-more,4570,4406
index-text-1,4502,4415
index-text-2,4523,4404
index-text-3,4545,4398
index-text-4,4492,4402
index-text-5,4541,4408
index-text-6,4492,4391
index-twitter,4524,4405
index-facebook,4556,4407
index-dribbble,4530,4394
index-flickr,4499,4401
index-github,4512,4394
index-index-footer,4513,4392
index-about-footer,4513,4401
index-courses-footer,4469,4393
index-fees-footer,4502,4396
index-portfolio-footer,4469,4395
index-contact-footer,4447,4398
index-about->about-navbar-toggle,6313,5032
index-about->about-navbar-brand,7962,4547
index-about->about-index,5874,4400
index-about->about-about,5842,4418
index-about->about-courses,6735,4412
index-about->about-fees,6656,4411
index-about->about-portfolio,6022,4551
index-about->about-dropdown-toggle,7916,4394
index-about->about-right-sidebar,7589,4133
index-about->about-dummy-link-1,7620,4122
index-about->about-dummy-link-2,7633,4120
index-about->about-dummy-link-3,7837,4120
index-about->about-contact,7910,4403
index-about->about-Responsive,5819,4400
index-about->about-HTML5,5823,4397
index-about->about-Bootstrap,7883,4399
index-about->about-Clean,8127,4398
index-about->about-Premium,8088,4397
index-about->about-facebook-ceo,8080,4400
index-about->about-google-ceo,8083,4398
index-about->about-twitter-ceo,7936,4392
index-about->about-dribbble-ceo,7912,4393
index-about->about-github-ceo,8022,4409
index-about->about-facebook-director,7887,4400
index-about->about-google-director,8061,4391
index-about->about-twitter-director,8048,4388
index-about->about-dribbble-director,8096,4390
index-about->about-github-director,8073,4395
index-about->about-facebook-manager,8043,4389
index-about->about-google-manager,8149,4392
index-about->about-twitter-manager,7963,4403
index-about->about-dribbble-manager,8126,4402
index-about->about-github-manager,7948,4397
index-about->about-facebook-creative,8088,4394
index-about->about-google-creative,7884,4393
index-about->about-twitter-creative,8073,4405
index-about->about-dribbble-creative,7860,4399
index-about->about-github-creative,8058,4388
index-about->about-twitter,7871,4392
index-about->about-facebook,8077,4400
index-about->about-dribbble,8030,4393
index-about->about-flickr,8047,4391
index-about->about-github,7908,4409
index-about->about-index-footer,8081,4391
index-about->about-about-footer,5812,4394
index-about->about-courses-footer,6710,4392
index-about->about-fees-footer,6651,4404
index-about->about-portfolio-footer,6632,4404
index-about->about-contact-footer,6624,4389
index-courses->courses-navbar-toggle,6077,4531
index-courses->courses-navbar-brand,6643,4559
index-courses->courses-index,6731,4396
index-courses->courses-about,5849,4448
index-courses->courses-courses,8092,4400
index-courses->courses-fees,8104,4400
index-courses->courses-portfolio,5968,4536
index-courses->courses-dropdown-toggle,5810,4391
index-courses->courses-right-sidebar,5521,4117
index-courses->courses-dummy-link-1,5529,4130
index-courses->courses-dummy-link-2,5528,4109
index-courses->courses-dummy-link-3,5555,4122
index-courses->courses-contact,6598,4407
index-courses->courses-twitter,5821,4392
index-courses->courses-facebook,8066,4390
index-courses->courses-dribbble,8005,4387
index-courses->courses-flickr,7844,4391
index-courses->courses-github,7888,4390
index-courses->courses-index-footer,8050,4407
index-courses->courses-about-footer,5810,4398
index-courses->courses-courses-footer,5782,4394
index-courses->courses-fees-footer,6628,4410
index-courses->courses-portfolio-footer,6666,4404
index-courses->courses-contact-footer,6633,4393
index-fees->fees-navbar-collapse,7664,4202
index-fees->fees-navbar-brand,7898,4410
index-fees->fees-index,5819,4405
index-fees->fees-about,5768,4405
index-fees->fees-courses,5838,4401
index-fees->fees-fees,5806,4422
index-fees->fees-portfolio,6642,4422
index-fees->fees-dropdown,5826,4399
index-fees->fees-right-sidebar,5487,4137
index-fees->fees-dummy-link-1,5593,4128
index-fees->fees-dummy-link-2,5594,4134
index-fees->fees-dummy-link-3,5495,4135
index-fees->fees-contact,6656,4414
index-fees->fees-signup-basic,5811,4407
index-fees->fees-signup-standard,7950,4404
index-fees->fees-signup-advanced,7997,4414
index-fees->fees-signup-mighty,7937,4410
index-fees->fees-twitter,7930,4399
index-fees->fees-facebook,8136,4414
index-fees->fees-dribbble,8103,4401
index-fees->fees-flickr,7959,4404
index-fees->fees-github,8111,4396
index-fees->fees-WebThemez,14835,12047
index-portfolio->portfolio-navbar-collapse,7706,4187
index-portfolio->sidebar-navbar-brand,7915,4423
index-portfolio->portfolio-index,6704,5319
index-portfolio->portfolio-about,5945,4471
index-portfolio->portfolio-courses,6639,4404
index-portfolio->portfolio-fees,6762,4408
index-portfolio->portfolio-portfolio,5858,4407
index-portfolio->portfolio-dropdown,7955,4400
index-portfolio->portfolio-right-sidebar,7658,4149
index-portfolio->portfolio-dummy-link-1,7755,4131
index-portfolio->portfolio-dummy-link-2,7621,4133
index-portfolio->portfolio-dummy-link-3,7649,4144
index-portfolio->portfolio-contact,7931,4413
index-portfolio->portfolio-all,5879,4424
index-portfolio->portfolio-web-design,5895,4423
index-portfolio->portfolio-photography,5852,4408
index-portfolio->portfolio-print,5827,4402
index-portfolio->portfolio-twitter,5855,4406
index-portfolio->portfolio-facebook,7857,4403
index-portfolio->portfolio-dribbble,7908,4410
index-portfolio->portfolio-flickr,8082,4402
index-portfolio->portfolio-github,8093,4421
index-portfolio->portfolio-index-footer,8064,4436
index-portfolio->portfolio-about-footer,5843,4437
index-portfolio->portfolio-courses-footer,5866,4414
index-portfolio->portfolio-fees-footer,5830,4414
index-portfolio->portfolio-portfolio-footer,5817,4395
index-portfolio->portfolio-contact-footer,6729,4398
index-contact->contact-navbar-toggle,7644,4193
index-contact->contact-navbar-brand,7970,4421
index-contact->contact-index,5799,4412
index-contact->contact-about,5846,4401
index-contact->contact-courses,5848,4409
index-contact->contact-fees,5859,4412
index-contact->contact-portfolio,5820,4410
index-contact->contact-dropdown-toggle,5823,4407
index-contact->contact-right-sidebar,5526,4133
index-contact->contact-dummy-link-1,5581,4132
index-contact->contact-dummy-link-2,5496,4136
index-contact->contact-dummy-link-3,5583,4135
index-contact->contact-contact,5843,4408
index-contact->send-message-button,7840,4400
index-contact->courses-twitter,5833,4400
index-contact->courses-facebook,5882,4431
index-contact->courses-dribbble,7905,4405
index-contact->courses-flickr,7883,4408
index-contact->courses-github,8106,4426
index-contact->contact-index-footer,7925,4413
index-contact->contact-about-footer,5872,4464
index-contact->contact-courses-footer,5846,4393
index-contact->contact-fees-footer,5831,4398
index-contact->contact-portfolio-footer,6578,5033
index-contact->contact-contact-footer,8126,4391
dex-contact->email-name-input-email-address-input-phone-number-input-subject-input-message-textarea and submit,6634,4636
index-about->about-navbar-brand->index-navbar-toggle,7767,4993
index-about->about-navbar-brand->index-navbar-brand,8075,4436
index-about->about-navbar-brand->index-index,7984,4415
index-about->about-navbar-brand->index-about,7971,4455
index-about->about-navbar-brand->index-courses,7250,4404
index-about->about-navbar-brand->index-fees,7186,4408
index-about->about-navbar-brand->index-portfolio,7344,4576
index-about->about-navbar-brand->index-dropdown-toggle,9398,4407
index-about->about-navbar-brand->index-right-sidebar,7645,4130
index-about->about-navbar-brand->index-dummy-link-1,7726,4137
index-about->about-navbar-brand->index-dummy-link-2,7666,4142
index-about->about-navbar-brand->index-dummy-link-3,7719,4125
index-about->about-navbar-brand->index-contact,7976,4407
index-about->about-navbar-brand->index-read-more,7139,4403
index-about->about-navbar-brand->index-text-1,9222,4408
index-about->about-navbar-brand->index-text-2,9439,4395
index-about->about-navbar-brand->index-text-3,9273,4402
index-about->about-navbar-brand->index-text-4,9440,4394
index-about->about-navbar-brand->index-text-5,9412,4399
index-about->about-navbar-brand->index-text-6,9319,4410
index-about->about-navbar-brand->index-twitter,9245,4408
index-about->about-navbar-brand->index-facebook,9442,4407
index-about->about-navbar-brand->index-dribbble,9268,4402
index-about->about-navbar-brand->index-flickr,9444,4404
index-about->about-navbar-brand->index-github,9249,4397
index-about->about-navbar-brand->index-index-footer,9478,4400
index-about->about-navbar-brand->index-about-footer,9463,4395
index-about->about-navbar-brand->index-courses-footer,7147,4413
index-about->about-navbar-brand->index-fees-footer,7188,4399
index-about->about-navbar-brand->index-portfolio-footer,7205,4413
index-about->about-navbar-brand->index-contact-footer,7155,4394
index-about->about-fees->index-index-footer,9287,8650
index-about->about-fees->index-about-footer,7210,4444
index-about->about-fees->index-courses-footer,7207,4398
index-about->about-fees->index-fees-footer,7186,4400
index-about->about-fees->index-portfolio-footer,9182,4430
index-about->about-fees->index-contact-footer,7133,4397
