STATE,IDS-OCCURRENCE,IDUBS-OCCURRENCE
root,219,32
index-navbar-toggle,2,2
index-navbar-brand,2,2
index-index,2,2
index-about,88,51
index-courses,26,26
index-fees,25,25
index-portfolio,30,30
index-dropdown-toggle,2,2
index-right-sidebar,2,2
index-dummy-link-1,2,2
index-dummy-link-2,2,2
index-dummy-link-3,2,2
index-contact,28,27
index-read-more,2,2
index-text-1,2,2
index-text-2,2,2
index-text-3,2,2
index-text-4,2,2
index-text-5,2,2
index-text-6,2,2
index-twitter,2,2
index-facebook,2,2
index-dribbble,2,2
index-flickr,2,2
index-github,2,2
index-index-footer,3,3
index-about-footer,3,3
index-courses-footer,3,3
index-fees-footer,3,3
index-portfolio-footer,3,3
index-contact-footer,3,3
about-navbar-toggle,1,1
about-navbar-brand,32,32
about-index,1,1
about-about,1,1
about-courses,1,1
about-fees,7,7
about-portfolio,1,1
about-dropdown-toggle,1,1
about-right-sidebar,1,1
about-dummy-link-1,1,1
about-dummy-link-2,1,1
about-dummy-link-3,1,1
about-contact,1,1
about-Responsive,1,1
about-HTML5,1,1
about-Bootstrap,1,1
about-Clean,1,1
about-Premium,1,1
about-facebook-ceo,1,1
about-google-ceo,1,1
about-twitter-ceo,1,1
about-dribbble-ceo,1,1
about-github-ceo,1,1
about-facebook-director,1,1
about-google-director,1,1
about-twitter-director,1,1
about-dribbble-director,1,1
about-github-director,1,1
about-facebook-manager,1,1
about-google-manager,1,1
about-twitter-manager,1,1
about-dribbble-manager,1,1
about-github-manager,1,1
about-facebook-creative,1,1
about-google-creative,1,1
about-twitter-creative,1,1
about-dribbble-creative,1,1
about-github-creative,1,1
about-twitter,1,1
about-facebook,1,1
about-dribbble,1,1
about-flickr,1,1
about-github,1,1
about-index-footer,1,1
about-about-footer,1,1
about-courses-footer,1,1
about-fees-footer,1,1
about-portfolio-footer,1,1
about-contact-footer,1,1
courses-navbar-toggle,1,1
courses-navbar-brand,1,1
courses-index,1,1
courses-about,1,1
courses-courses,1,1
courses-fees,1,1
courses-portfolio,1,1
courses-dropdown-toggle,1,1
courses-right-sidebar,1,1
courses-dummy-link-1,1,1
courses-dummy-link-2,1,1
courses-dummy-link-3,1,1
courses-contact,1,1
courses-twitter,2,2
courses-facebook,2,2
courses-dribbble,2,2
courses-flickr,2,2
courses-github,2,2
courses-index-footer,1,1
courses-about-footer,1,1
courses-courses-footer,1,1
courses-fees-footer,1,1
courses-portfolio-footer,1,1
courses-contact-footer,1,1
fees-navbar-collapse,1,1
fees-navbar-brand,1,1
fees-index,1,1
fees-about,1,1
fees-courses,1,1
fees-fees,1,1
fees-portfolio,1,1
fees-dropdown,1,1
fees-right-sidebar,1,1
fees-dummy-link-1,1,1
fees-dummy-link-2,1,1
fees-dummy-link-3,1,1
fees-contact,1,1
fees-signup-basic,1,1
fees-signup-standard,1,1
fees-signup-advanced,1,1
fees-signup-mighty,1,1
fees-twitter,1,1
fees-facebook,1,1
fees-dribbble,1,1
fees-flickr,1,1
fees-github,1,1
fees-WebThemez,1,1
portfolio-navbar-collapse,1,1
sidebar-navbar-brand,1,1
portfolio-index,1,1
portfolio-about,1,1
portfolio-courses,1,1
portfolio-fees,1,1
portfolio-portfolio,1,1
portfolio-dropdown,1,1
portfolio-right-sidebar,1,1
portfolio-dummy-link-1,1,1
portfolio-dummy-link-2,1,1
portfolio-dummy-link-3,1,1
portfolio-contact,1,1
portfolio-all,1,1
portfolio-web-design,1,1
portfolio-photography,1,1
portfolio-print,1,1
portfolio-twitter,1,1
portfolio-facebook,1,1
portfolio-dribbble,1,1
portfolio-flickr,1,1
portfolio-github,1,1
portfolio-index-footer,1,1
portfolio-about-footer,1,1
portfolio-courses-footer,1,1
portfolio-fees-footer,1,1
portfolio-portfolio-footer,1,1
portfolio-contact-footer,1,1
contact-navbar-toggle,1,1
contact-navbar-brand,1,1
contact-index,1,1
contact-about,1,1
contact-courses,1,1
contact-fees,1,1
contact-portfolio,1,1
contact-dropdown-toggle,1,1
contact-right-sidebar,1,1
contact-dummy-link-1,1,1
contact-dummy-link-2,1,1
contact-dummy-link-3,1,1
contact-contact,1,1
send-message-button,1,1
contact-index-footer,1,1
contact-about-footer,1,1
contact-courses-footer,1,1
contact-fees-footer,1,1
contact-portfolio-footer,1,1
contact-contact-footer,1,1
email-name-input-email-address-input-phone-number-input-subject-input-message-textarea,0,1
