STATE,IDS-OCCURRENCE,IDUBS-OCCURRENCE
root,94,36
home,1,1
tabelas-corporativo,3,3
parametros,32,11
transacoes,2,2
gerenciamento-dofs,14,4
processos,27,4
relatorio,2,2
processos-customizados,1,1
download,5,5
collapse-menu,1,1
modules-menu,1,1
1564287553-operações em lote,1,1
1564287553-power-search-button,1,1
1564287553-playcircleoutlined,1,1
1564287553-input-number-timer,1,1
tabelas-corporativas/parametros-gerais/parest,1,1
series-estabelecimento,1,1
digitacao/emissao-dof/filas-adaptador,13,6
parametros/notas-tecnicas-por-uf,6,6
parametros/nota-fiscal-m21-parametros,12,3
transacoes/digitacao-manutencao-dof,1,1
gerenciamento-dofs/inutilizacao-nfe,6,5
gerenciamento-dofs/gerenciador-destinos,4,3
gerenciamento-dofs/nota-fiscal-m21,3,3
processos/limpeza-snf,6,6
processos/limpeza-log-integra-nfe,10,10
processos/limpeza-eventos-adaptador,10,10
relatorio/relatorio-quebra-de-sequencia-de-documentos,1,1
176558749-power-search-button,1,1
176558749-download,1,1
176558749-detalhes,1,1
176558749-excluir,1,1
1597369178-novo,4,3
1597369178-power-search-button,1,1
1597369178-eyeoutlined,5,4
1597369178-deleteoutlined,1,1
1597369178-carregar mais,1,1
2894110433-powerselect-notaTecnicaKey,5,5
parametros/nota-fiscal-m21-parametros/logotipo-new,7,3
parametros/nota-fiscal-m21-parametros/formas-envio,4,3
2361222596-atualize as informações da busca,1,1
2361222596-enquadrar,1,1
2361222596-power-search-button,1,1
2361222596-carregar mais,1,1
2781661985-criar destino de emissão,2,1
2781661985-power-search-button,1,1
485494959-operações em lote,1,1
485494959-power-search-button,1,1
1756863936-executar,1,1
1756863936-agendamentos,1,1
1756863936-power-search-button,1,1
1756863936-visualização,2,2
1172322540-executar,5,5
1172322540-agendamentos,1,1
1172322540-power-search-button,1,1
1172322540-visualização,2,2
2009102830-executar,5,5
2009102830-agendamentos,1,1
2009102830-power-search-button,1,1
2009102830-visualização,2,2
2032344527-salvar,1,1
2032344527-voltar,1,1
640694358-remover item,1,1
640694358-salvar,1,1
640694358-voltar,1,1
2894110433-power-search-button,1,1
2894110433-carregar mais,1,1
2894110433-fechar,1,1
2894110433-power-search-input,1,1
2396904729-novo,5,4
2396904729-power-search-button,1,1
2374286314-remover item,1,1
2374286314-salvar,1,1
1756863936-item-,1,1
1172322540-múltipla seleção,2,2
1172322540-agendar,1,1
1172322540-input-PDIAS,1,1
1172322540-item-,1,1
2009102830-múltipla seleção,2,2
2009102830-agendar,1,1
2009102830-input-PDIAS,1,1
2009102830-item-,1,1
2142727024-upload logotipo,1,1
2142727024-salvar,1,1
2142727024-voltar,1,1
1172322540-cancelar,1,1
2009102830-cancelar,1,1
2361222596-powerselect-estCodigo-2361222596-powerselect-mdofCodigo-2361222596-powerselect-indEntradaSaida-2361222596-powerselect-serie-2361222596-powerselect-indInutilizacao,0,1
2032344527-input-titulo-2032344527-powerselect-estCodigo-2032344527-powerselect-nopCodigo-2032344527-powerselect-edofCodigo-2032344527-input-sistemaOrigem,0,1
640694358-input-titulo-640694358-powerselect-estCodigo-640694358-powerselect-nopCodigo-640694358-powerselect-edofCodigo-640694358-powerselect-serieId-640694358-input-sistemaOrigem,0,1
2374286314-checkbox-email-2374286314-checkbox-bucket-2374286314-input-remetenteMa-2374286314-input-emailRemetenteMa-2374286314-input-password-senhaRemetenteMa-2374286314-input-hostMa-2374286314-input-number-portaServidorMa-2374286314-powerselect-sslMa-2374286314-powerselect-tlsMa-2374286314-powerselect-envioAutomaticoMa-2374286314-input-accessKeyIdBu-2374286314-input-password-secretAccessKeyBu-2374286314-input-nomeBucketBu-2374286314-input-endpointBu-2374286314-input-number-portaServidorBu-2374286314-input-regionNameBu-2374286314-powerselect-secureBu-2374286314-powerselect-envioAutomaticoBu,0,1
2781661985-powerselect-docDefId-2781661985-input-titulo,0,1
2142727024-powerselect-indGenerico-2142727024-powerselect-formulario-2142727024-powerselect-estCodigo,0,1
