TEST-NAME,IDS-TIME(MS),IDUBS-TIME(MS)
,8624.0,9616.0
home,9874.0,10446.0
tabelas-oficiais,6678.0,6400.0
tabelas-corporativas,6558.0,6387.0
contabil,6456.0,6406.0
integracoes,6594.0,6383.0
transacoes,6404.0,6394.0
controles-ciap,6730.0,6651.0
operacoes,6574.0,6376.0
regras,6490.0,6370.0
processos,6525.0,6453.0
relatorios,6525.0,6374.0
informes-fiscais,6591.0,6467.0
obrigacoes,6427.0,6385.0
processos-customizados,7790.0,7600.0
download,7732.0,7632.0
collapse-menu,6537.0,6377.0
modules-menu,7647.0,7243.0
tabelas-oficiais->tabelas-oficiais/cfop,10997.0,11914.0
tabelas-oficiais->tabelas-oficiais/tabela-codigos-efd-icms-ipi,7759.0,7398.0
tabelas-oficiais->tabelas-oficiais/ncm,7576.0,7228.0
tabelas-corporativas->tabelas-corporativas/parametrizacao-geral,7593.0,7387.0
tabelas-corporativas->tabelas-corporativas/edof,7450.0,7436.0
tabelas-corporativas->tabelas-corporativas/nop,7584.0,7312.0
tabelas-corporativas->tabelas-corporativas/config-livro,7512.0,7405.0
tabelas-corporativas->tabelas-corporativas/pfj,7629.0,7384.0
tabelas-corporativas->tabelas-corporativas/hierarquia-pessoas,7565.0,7390.0
tabelas-corporativas->tabelas-corporativas/cadastro,7589.0,7398.0
tabelas-corporativas->tabelas-corporativas/cadastro-prestacoes,7530.0,7453.0
contabil->contabil/plano-contas,7533.0,7397.0
contabil->contabil/centro-custo,7579.0,7449.0
integracoes->integracoes/edicao,7704.0,7216.0
integracoes->integracoes/importacao,7666.0,7426.0
integracoes->integracoes/exportacao,7599.0,7455.0
integracoes->integracoes/executar-interfaces,7535.0,7406.0
transacoes->transacoes/dof,7570.0,7230.0
controles-ciap->1421670172-novo,8824.0,6312.0
controles-ciap->1421670172-power-search-button,8920.0,6814.0
operacoes->operacoes/ajuste-valores,8122.0,7937.0
operacoes->operacoes/saidas,8236.0,7936.0
operacoes->operacoes/atribuicao,12280.0,12016.0
operacoes->operacoes/total-saidas,8099.0,7974.0
regras->regras/geracao-controle,8426.0,8131.0
regras->regras/apuracao-saidas,8337.0,8048.0
regras->regras/calculo-creditos,8071.0,8023.0
regras->regras/parametros-uf,8169.0,7987.0
regras->regras/lancamentos-ajustes-regras,8217.0,7957.0
processos->processos/geracao-controles,12323.0,12121.299999999997
processos->processos/exclusao-controles,12327.0,12042.0
processos->processos/exclusao-controle-dof-aquisicao,12244.0,12057.0
processos->processos/totalizacao-saidas,12237.0,12121.299999999997
processos->processos/geracao-creditos,12261.0,12121.299999999997
processos->processos/exclusao-creditos,12282.0,12066.0
processos->processos/apropriacao-credito-extemporaneos,12307.0,12121.299999999997
processos->processos/atualizacao-indicador,12265.0,12121.299999999997
processos->processos/exclusao-op-saida,12264.0,12121.299999999997
processos->processos/suspencao-retomada-creditos,12077.0,12109.0
processos->processos/transferencia-inc-societaria,12299.0,12097.0
relatorios->relatorios/controles-ciap,12309.0,12106.0
relatorios->relatorios/conferenc-controles-incorp,12343.0,12121.299999999997
relatorios->relatorios/creditos-curto-longo-prazo,12384.0,12121.299999999997
relatorios->relatorios/creditos-parcelados-periodo,12132.0,12072.0
relatorios->relatorios/diferencas-arredondamento,12338.0,12121.299999999997
relatorios->relatorios/operacoes-de-saida,12375.0,12026.0
relatorios->relatorios/val-creditos-icms-controle,12203.0,12121.299999999997
informes-fiscais->informes-fiscais/lançamentos-ajustes,7560.0,7453.0
informes-fiscais->informes-fiscais/cred-icms-tomados-priod,12199.0,12081.0
informes-fiscais->informes-fiscais/contr-cred-modc,15319.0,12121.299999999997
informes-fiscais->informes-fiscais/contr-cred-modc-mg,12301.0,12121.299999999997
informes-fiscais->informes-fiscais/contr-cred-modc-rj,12238.0,12121.299999999997
informes-fiscais->informes-fiscais/contr-cred-modd,12156.0,12121.299999999997
obrigacoes->obrigacoes/configuracao,12363.0,11992.0
obrigacoes->obrigacoes/periodicidade,12231.0,11829.0
obrigacoes->obrigacoes/configuracao-estabelecimento,12245.0,12013.0
obrigacoes->obrigacoes/solicitacoes,12276.0,12121.299999999997
obrigacoes->obrigacoes/obrigacoes-executadas,12208.0,12121.299999999997
download->538981869-power-search-button,10996.0,5062.0
download->538981869-download,10932.0,8430.0
download->538981869-detalhes,8981.0,6526.0
download->538981869-excluir,8956.0,6497.0
controles-ciap->1421670172-novo->4032240461-salvar,18098.9,12121.299999999997
controles-ciap->1421670172-novo->4032240461-voltar,10500.0,6698.0
ntroles-ciap->1421670172-novo->4032240461-input-bemCodigo-4032240461-input-numPlaqueta-4032240461-input-projeto-4032240461-input-seqIncorporacao-4032240461-input-monetary-qtd-4032240461-powerselect-dfltNbmCodigo-4032240461-textarea-descricao-4032240461-textarea-funcao-4032240461-powerselect-codCta-4032240461-powerselect-codCcus-4032240461-powerselect-codCtaDepr-4032240461-input-vidaUtil-4032240461-checkbox-checkBemAtivCirculante-4032240461-checkbox-checkIndCpc-4032240461-powerselect-cmercCodigo-4032240461-powerselect-edofCodigo-4032240461-input-serieSubserie-4032240461-input-numero-4032240461-powerselect-cfopCodigo-4032240461-powerselect-nopCodigo-4032240461-input-numItem-4032240461-powerselect-subclasseIdf-4032240461-powerselect-unid-4032240461-powerselect-emitentePfjCodigo-4032240461-powerselect-emitenteLocCodigo-4032240461-powerselect-remetentePfjCodigo-4032240461-powerselect-remetenteLocCodigo-4032240461-input-monetary-vlOriginalCorrigido-4032240461-input-monetary-vlIcmsApropriado-4032240461-input-monetary-vlIcmsDifApropriado-4032240461-input-monetary-vlIcmsSttApropriado-4032240461-input-monetary-vlIcmsStfApropriado-4032240461-input-monetary-vlIcmsFrtApropriado-4032240461-input-numLivroFiscal-4032240461-input-folhaLivroFiscal-4032240461-input-nfeLocalizador-4032240461-input-numDa and submit,18098.9,12121.299999999997
operacoes->operacoes/ajuste-valores->3035848061-power-search-button,9510.0,6827.0
operacoes->operacoes/saidas->2604458697-novo,9652.0,6068.0
operacoes->operacoes/saidas->2604458697-power-search-button,10390.0,6793.0
operacoes->operacoes/atribuicao->3844251654-pesquisar,13713.0,5796.0
operacoes->operacoes/total-saidas->809189514-novo,10574.0,6899.0
operacoes->operacoes/total-saidas->809189514-power-search-button,10355.0,6791.0
regras->regras/geracao-controle->269251538-plusoutlined,9631.0,6029.0
regras->regras/geracao-controle->269251538-power-search-button,10379.0,6765.0
regras->regras/apuracao-saidas->3172943428-plusoutlined,9580.0,6034.0
regras->regras/apuracao-saidas->3172943428-power-search-button,9279.0,6980.0
regras->regras/calculo-creditos->854429064-plusoutlined,9609.0,6055.0
regras->regras/calculo-creditos->854429064-power-search-button,10397.0,6824.0
regras->regras/parametros-uf->111041507-power-search-button,9547.0,6837.0
regras->regras/parametros-uf->111041507-eyeoutlined,9362.0,6014.0
regras->regras/lancamentos-ajustes-regras->3291988906-novo,9704.0,6042.0
regras->regras/lancamentos-ajustes-regras->3291988906-power-search-button,9316.0,6828.0
regras->regras/lancamentos-ajustes-regras->3291988906-selectoutlined,9401.0,5834.0
regras->regras/lancamentos-ajustes-regras->3291988906-visualizar/editar,9354.0,5799.0
regras->regras/lancamentos-ajustes-regras->3291988906-excluir,10261.0,6793.0
processos->processos/geracao-controles->1614615400-executar,14731.0,5039.0
processos->processos/geracao-controles->1614615400-agendamentos,13498.0,6592.0
processos->processos/geracao-controles->1614615400-power-search-button,14715.0,6385.0
processos->processos/geracao-controles->1614615400-ajuda,14690.0,6339.0
processos->processos/geracao-controles->1614615400-visualização,14885.0,6371.0
processos->processos/geracao-controles->1614615400-regerar,14631.0,6481.0
processos->processos/geracao-controles->1614615400-detalhes,14684.0,6553.0
processos->processos/geracao-controles->1614615400-abrir visualização,14749.0,6490.0
processos->processos/exclusao-controles->287994784-executar,14699.0,6435.0
processos->processos/exclusao-controles->287994784-agendamentos,18098.9,6661.0
processos->processos/exclusao-controles->287994784-power-search-button,14666.0,6394.0
processos->processos/exclusao-controles->287994784-ajuda,14587.0,6377.0
processos->processos/exclusao-controles->287994784-visualização,14730.0,6464.0
processos->processos/exclusao-controle-dof-aquisicao->1629306443-executar,14568.0,7593.0
processos->processos/exclusao-controle-dof-aquisicao->1629306443-agendamentos,18098.9,6635.0
processos->processos/exclusao-controle-dof-aquisicao->1629306443-power-search-button,15290.0,6381.0
processos->processos/exclusao-controle-dof-aquisicao->1629306443-visualização,14756.0,6254.0
processos->processos/totalizacao-saidas->633719453-executar,14679.0,6426.0
processos->processos/totalizacao-saidas->633719453-agendamentos,18089.0,6627.0
processos->processos/totalizacao-saidas->633719453-power-search-button,14754.0,6649.0
processos->processos/totalizacao-saidas->633719453-visualização,14819.0,6925.0
processos->processos/exclusao-creditos->2814741288-executar,14766.0,6553.0
processos->processos/exclusao-creditos->2814741288-agendamentos,18051.0,6614.0
processos->processos/exclusao-creditos->2814741288-power-search-button,13726.0,6371.0
processos->processos/exclusao-creditos->2814741288-visualização,14570.0,6502.0
processos->processos/exclusao-creditos->2814741288-regerar,14723.0,6259.0
processos->processos/exclusao-creditos->2814741288-detalhes,14683.0,6463.0
processos->processos/exclusao-creditos->2814741288-abrir visualização,14778.0,6481.0
processos->processos/exclusao-creditos->2814741288-excluir,18098.9,11137.0
processos->processos/apropriacao-credito-extemporaneos->298565727-executar,14820.0,6632.0
processos->processos/apropriacao-credito-extemporaneos->298565727-agendamentos,17961.0,6643.0
processos->processos/apropriacao-credito-extemporaneos->298565727-power-search-button,14552.0,6223.0
processos->processos/apropriacao-credito-extemporaneos->298565727-visualização,14812.0,6458.0
processos->processos/apropriacao-credito-extemporaneos->298565727-regerar,14714.0,6409.0
processos->processos/apropriacao-credito-extemporaneos->298565727-detalhes,14644.0,6410.0
processos->processos/apropriacao-credito-extemporaneos->298565727-abrir visualização,14662.0,6530.0
processos->processos/apropriacao-credito-extemporaneos->298565727-excluir,14879.0,6425.0
processos->processos/atualizacao-indicador->2224043782-executar,14724.0,6501.0
processos->processos/atualizacao-indicador->2224043782-agendamentos,17999.0,6682.0
processos->processos/atualizacao-indicador->2224043782-power-search-button,13664.0,6363.0
processos->processos/atualizacao-indicador->2224043782-visualização,14732.0,6505.0
processos->processos/exclusao-op-saida->3183959863-executar,14742.0,6484.0
processos->processos/exclusao-op-saida->3183959863-agendamentos,18093.0,6666.0
processos->processos/exclusao-op-saida->3183959863-power-search-button,13724.0,6412.0
processos->processos/exclusao-op-saida->3183959863-visualização,14827.0,6455.0
processos->processos/suspencao-retomada-creditos->985668109-executar,14719.0,6492.0
processos->processos/suspencao-retomada-creditos->985668109-agendamentos,18060.0,6621.0
processos->processos/suspencao-retomada-creditos->985668109-power-search-button,14673.0,5436.0
processos->processos/suspencao-retomada-creditos->985668109-visualização,14699.0,6343.0
processos->processos/suspencao-retomada-creditos->985668109-regerar,14692.0,6487.0
processos->processos/suspencao-retomada-creditos->985668109-detalhes,14832.0,6433.0
processos->processos/suspencao-retomada-creditos->985668109-abrir visualização,14723.0,6444.0
processos->processos/suspencao-retomada-creditos->985668109-excluir,14635.0,6419.0
processos->processos/transferencia-inc-societaria->1642007593-executar,14841.0,6460.0
processos->processos/transferencia-inc-societaria->1642007593-agendamentos,18003.0,6636.0
processos->processos/transferencia-inc-societaria->1642007593-power-search-button,14567.0,6439.0
processos->processos/transferencia-inc-societaria->1642007593-visualização,14889.0,6490.0
relatorios->relatorios/controles-ciap->2680178634-executar,14821.0,6498.0
relatorios->relatorios/controles-ciap->2680178634-agendamentos,17789.0,6684.0
relatorios->relatorios/controles-ciap->2680178634-power-search-button,14708.0,6778.0
relatorios->relatorios/controles-ciap->2680178634-visualização,14841.0,6495.0
relatorios->relatorios/conferenc-controles-incorp->4033549032-executar,14748.0,6450.0
relatorios->relatorios/conferenc-controles-incorp->4033549032-agendamentos,17999.0,6627.0
relatorios->relatorios/conferenc-controles-incorp->4033549032-power-search-button,14549.0,6864.0
relatorios->relatorios/conferenc-controles-incorp->4033549032-visualização,14851.0,6537.0
relatorios->relatorios/creditos-curto-longo-prazo->172111467-executar,14683.0,6568.0
relatorios->relatorios/creditos-curto-longo-prazo->172111467-agendamentos,18054.0,6653.0
relatorios->relatorios/creditos-curto-longo-prazo->172111467-power-search-button,14609.0,6431.0
relatorios->relatorios/creditos-curto-longo-prazo->172111467-visualização,14657.0,6558.0
relatorios->relatorios/creditos-parcelados-periodo->4272249838-executar,14622.0,6431.0
relatorios->relatorios/creditos-parcelados-periodo->4272249838-agendamentos,18023.0,6625.0
relatorios->relatorios/creditos-parcelados-periodo->4272249838-power-search-button,14658.0,6210.0
relatorios->relatorios/creditos-parcelados-periodo->4272249838-visualização,14694.0,6505.0
relatorios->relatorios/diferencas-arredondamento->532328817-executar,14689.0,6615.0
relatorios->relatorios/diferencas-arredondamento->532328817-agendamentos,18098.9,6695.0
relatorios->relatorios/diferencas-arredondamento->532328817-power-search-button,13681.0,6447.0
relatorios->relatorios/diferencas-arredondamento->532328817-visualização,14752.0,6464.0
relatorios->relatorios/operacoes-de-saida->3190201375-executar,14683.0,6483.0
relatorios->relatorios/operacoes-de-saida->3190201375-agendamentos,12793.0,12121.299999999997
relatorios->relatorios/operacoes-de-saida->3190201375-power-search-button,14581.0,6459.0
relatorios->relatorios/operacoes-de-saida->3190201375-visualização,14532.0,6486.0
relatorios->relatorios/val-creditos-icms-controle->1912915204-executar,14743.0,6508.0
relatorios->relatorios/val-creditos-icms-controle->1912915204-agendamentos,18098.9,6573.0
relatorios->relatorios/val-creditos-icms-controle->1912915204-power-search-button,13699.0,6212.0
relatorios->relatorios/val-creditos-icms-controle->1912915204-visualização,14777.0,6490.0
relatorios->relatorios/val-creditos-icms-controle->1912915204-regerar,14703.0,6443.0
relatorios->relatorios/val-creditos-icms-controle->1912915204-detalhes,14747.0,6551.0
relatorios->relatorios/val-creditos-icms-controle->1912915204-abrir visualização,14711.0,6495.0
relatorios->relatorios/val-creditos-icms-controle->1912915204-excluir,14681.0,6449.0
informes-fiscais->informes-fiscais/cred-icms-tomados-priod->1868435819-executar,14772.0,6468.0
informes-fiscais->informes-fiscais/cred-icms-tomados-priod->1868435819-agendamentos,18085.0,6652.0
informes-fiscais->informes-fiscais/cred-icms-tomados-priod->1868435819-power-search-button,13663.0,6451.0
informes-fiscais->informes-fiscais/cred-icms-tomados-priod->1868435819-visualização,14687.0,6563.0
informes-fiscais->informes-fiscais/cred-icms-tomados-priod->1868435819-regerar,14677.0,6451.0
informes-fiscais->informes-fiscais/cred-icms-tomados-priod->1868435819-detalhes,14708.0,6449.0
informes-fiscais->informes-fiscais/cred-icms-tomados-priod->1868435819-abrir visualização,14808.0,6447.0
informes-fiscais->informes-fiscais/cred-icms-tomados-priod->1868435819-excluir,14608.0,6474.0
informes-fiscais->informes-fiscais/contr-cred-modc->1437611396-executar,14660.0,6574.0
informes-fiscais->informes-fiscais/contr-cred-modc->1437611396-agendamentos,18098.9,6623.0
informes-fiscais->informes-fiscais/contr-cred-modc->1437611396-power-search-button,14756.0,6486.0
informes-fiscais->informes-fiscais/contr-cred-modc->1437611396-visualização,14922.0,6430.0
informes-fiscais->informes-fiscais/contr-cred-modc-mg->2762236547-executar,14641.0,6604.0
informes-fiscais->informes-fiscais/contr-cred-modc-mg->2762236547-agendamentos,17914.0,6635.0
informes-fiscais->informes-fiscais/contr-cred-modc-mg->2762236547-power-search-button,13661.0,6469.0
informes-fiscais->informes-fiscais/contr-cred-modc-mg->2762236547-visualização,18098.9,6536.0
informes-fiscais->informes-fiscais/contr-cred-modc-rj->2762236705-executar,14692.0,6484.0
informes-fiscais->informes-fiscais/contr-cred-modc-rj->2762236705-agendamentos,18098.9,6731.0
informes-fiscais->informes-fiscais/contr-cred-modc-rj->2762236705-power-search-button,14656.0,6403.0
informes-fiscais->informes-fiscais/contr-cred-modc-rj->2762236705-visualização,14676.0,6495.0
informes-fiscais->informes-fiscais/contr-cred-modd->1437611397-executar,14686.0,6468.0
informes-fiscais->informes-fiscais/contr-cred-modd->1437611397-agendamentos,18013.0,6679.0
informes-fiscais->informes-fiscais/contr-cred-modd->1437611397-power-search-button,14655.0,6311.0
informes-fiscais->informes-fiscais/contr-cred-modd->1437611397-visualização,14750.0,6445.0
obrigacoes->obrigacoes/configuracao->3982231145-power-search-button,13703.0,6496.0
obrigacoes->obrigacoes/configuracao->3982231145-gerenciar labels,14725.0,6485.0
obrigacoes->obrigacoes/configuracao->3982231145-visualizar parâmetros,18022.0,6668.0
obrigacoes->obrigacoes/configuracao->3982231145-visualizar/editar,17987.0,6583.0
obrigacoes->obrigacoes/periodicidade->4090291865-novo,14648.0,6524.0
obrigacoes->obrigacoes/periodicidade->4090291865-power-search-button,14763.0,6543.0
obrigacoes->obrigacoes/periodicidade->4090291865-editar,14711.0,6502.0
obrigacoes->obrigacoes/periodicidade->4090291865-excluir,14736.0,6404.0
obrigacoes->obrigacoes/configuracao-estabelecimento->2182589889-novo,14863.0,6476.0
obrigacoes->obrigacoes/configuracao-estabelecimento->2182589889-power-search-button,14668.0,6439.0
obrigacoes->obrigacoes/configuracao-estabelecimento->2182589889-excluir,14860.0,6519.0
obrigacoes->obrigacoes/solicitacoes->829857080-ir para todas as obrigações,18023.0,9859.0
obrigacoes->obrigacoes/solicitacoes->829857080-ajuda,13734.0,5447.0
obrigacoes->obrigacoes/obrigacoes-executadas->1017963809-power-search-button,13661.0,6491.0
obrigacoes->obrigacoes/obrigacoes-executadas->1017963809-visualização,14780.0,6544.0
obrigacoes->obrigacoes/obrigacoes-executadas->1017963809-abrir visualização,11234.0,11043.0
obrigacoes->obrigacoes/obrigacoes-executadas->1017963809-visualizar,14622.0,6543.0
operacoes->operacoes/saidas->2604458697-novo->189297600-salvar,15282.0,12108.0
operacoes->operacoes/saidas->2604458697-novo->189297600-voltar,10802.0,5905.0
eracoes->operacoes/saidas->2604458697-novo->189297600-powerselect-informanteEstCodigo-189297600-powerselect-ctrlNotaFiscal-189297600-powerselect-ctrlOperacao-189297600-input-motivoBaixa and submit,12796.0,9311.0
operacoes->operacoes/atribuicao->3844251654-pesquisar->3844251654-power-search-button,16099.0,5227.0
operacoes->operacoes/atribuicao->3844251654-pesquisar->3844251654-cancelar,16099.0,5273.0
operacoes->operacoes/total-saidas->809189514-novo->809189514-salvar,11834.0,8239.0
operacoes->operacoes/total-saidas->809189514-novo->809189514-voltar,10728.0,7121.0
eracoes->operacoes/total-saidas->809189514-novo->809189514-powerselect-estCodigo-809189514-input-monetary-vlTotalBases-809189514-input-monetary-vlTotalIsentas-809189514-input-monetary-vlTotalSaidas-809189514-checkbox-indicaHierarquia and submit,10661.0,7113.0
gras->regras/geracao-controle->269251538-plusoutlined->269251538-input-titulo and submit,9629.0,5515.0
gras->regras/apuracao-saidas->3172943428-plusoutlined->3172943428-input-titulo and submit,9590.0,6040.0
gras->regras/calculo-creditos->854429064-plusoutlined->854429064-input-titulo and submit,9599.0,6112.0
regras->regras/parametros-uf->111041507-eyeoutlined->3222286876-salvar,13940.0,8960.0
regras->regras/parametros-uf->111041507-eyeoutlined->3222286876-voltar,10796.0,6121.0
regras->regras/lancamentos-ajustes-regras->3291988906-novo->738981759-salvar,11685.0,6994.0
regras->regras/lancamentos-ajustes-regras->3291988906-novo->738981759-voltar,10635.0,5788.0
gras->regras/lancamentos-ajustes-regras->3291988906-novo->738981759-input-rgajCodigo-738981759-textarea-obsRegra and submit,9598.0,6052.0
regras->regras/lancamentos-ajustes-regras->3291988906-selectoutlined->2051661756-novo,10844.0,6100.0
regras->regras/lancamentos-ajustes-regras->3291988906-selectoutlined->2051661756-power-search-button,11699.0,6780.0
regras->regras/lancamentos-ajustes-regras->3291988906-selectoutlined->2051661756-excluir,11572.0,6928.0
regras->regras/lancamentos-ajustes-regras->3291988906-visualizar/editar->2442857990-selecionar critérios,11643.0,6751.0
regras->regras/lancamentos-ajustes-regras->3291988906-visualizar/editar->2442857990-estabelecimentos da regra,11718.0,6843.0
regras->regras/lancamentos-ajustes-regras->3291988906-visualizar/editar->2442857990-itens de ajuste,10746.0,5393.0
regras->regras/lancamentos-ajustes-regras->3291988906-visualizar/editar->2442857990-remover item,11492.0,6349.0
regras->regras/lancamentos-ajustes-regras->3291988906-visualizar/editar->2442857990-salvar,10470.0,5764.0
regras->regras/lancamentos-ajustes-regras->3291988906-visualizar/editar->2442857990-voltar,10706.0,6669.0
gras->regras/lancamentos-ajustes-regras->3291988906-visualizar/editar->2442857990-textarea-obsRegra and submit,9689.0,6081.0
ocessos->processos/geracao-controles->1614615400-visualização->1614615400-item- and submit,14791.0,6537.0
processos->processos/geracao-controles->1614615400-detalhes->1614615400-dados disponíveis para impressão,14967.0,6849.0
processos->processos/geracao-controles->1614615400-abrir visualização->1614615400-aumentar o zoom,16054.0,7760.0
processos->processos/geracao-controles->1614615400-abrir visualização->1614615400-diminuir o zoom,16282.0,7615.0
processos->processos/geracao-controles->1614615400-abrir visualização->1614615400-expandir,16160.0,7781.0
processos->processos/geracao-controles->1614615400-abrir visualização->1614615400-download,16094.0,7645.0
processos->processos/exclusao-controles->287994784-executar->287994784-múltipla seleção,14927.0,6768.0
processos->processos/exclusao-controles->287994784-executar->287994784-agendar,17090.0,9754.0
ocessos->processos/exclusao-controles->287994784-visualização->287994784-item- and submit,14742.0,6372.0
processos->processos/exclusao-controle-dof-aquisicao->1629306443-executar->1629306443-múltipla seleção,15106.0,6865.0
processos->processos/exclusao-controle-dof-aquisicao->1629306443-executar->1629306443-agendar,18047.0,9850.0
ocessos->processos/exclusao-controle-dof-aquisicao->1629306443-executar->1629306443-input-P_NUMERO_DOF-1629306443-input-P_SERIE_SUBSERIE-1629306443-input-P_ITEM_DOF and submit,14639.0,6668.0
ocessos->processos/exclusao-controle-dof-aquisicao->1629306443-visualização->1629306443-item- and submit,14695.0,6447.0
processos->processos/totalizacao-saidas->633719453-executar->633719453-múltipla seleção,15120.0,6823.0
processos->processos/totalizacao-saidas->633719453-executar->633719453-agendar,18039.0,9902.0
ocessos->processos/totalizacao-saidas->633719453-executar->633719453-input-P_PERIODO and submit,9469.0,6321.0
ocessos->processos/totalizacao-saidas->633719453-visualização->633719453-item- and submit,14531.0,6558.0
processos->processos/exclusao-creditos->2814741288-executar->2814741288-múltipla seleção,14827.0,10894.0
processos->processos/exclusao-creditos->2814741288-executar->2814741288-agendar,16905.0,9859.0
ocessos->processos/exclusao-creditos->2814741288-visualização->2814741288-item- and submit,14721.0,6461.0
processos->processos/exclusao-creditos->2814741288-detalhes->2814741288-dados disponíveis para impressão,15003.0,6724.0
processos->processos/exclusao-creditos->2814741288-abrir visualização->2814741288-aumentar o zoom,15901.0,7704.0
processos->processos/exclusao-creditos->2814741288-abrir visualização->2814741288-diminuir o zoom,16075.0,7702.0
processos->processos/exclusao-creditos->2814741288-abrir visualização->2814741288-expandir,16008.0,7706.0
processos->processos/exclusao-creditos->2814741288-abrir visualização->2814741288-download,15944.0,7672.0
processos->processos/apropriacao-credito-extemporaneos->298565727-executar->298565727-múltipla seleção,14906.0,6777.0
processos->processos/apropriacao-credito-extemporaneos->298565727-executar->298565727-agendar,18095.0,9698.0
ocessos->processos/apropriacao-credito-extemporaneos->298565727-executar->298565727-input-P_DT_INICIO-298565727-input-P_DT_FIM-298565727-input-P_PERIODO and submit,14659.0,6316.0
ocessos->processos/apropriacao-credito-extemporaneos->298565727-visualização->298565727-item- and submit,14742.0,6660.0
processos->processos/apropriacao-credito-extemporaneos->298565727-detalhes->298565727-dados disponíveis para impressão,14928.0,6780.0
processos->processos/apropriacao-credito-extemporaneos->298565727-abrir visualização->298565727-aumentar o zoom,15977.0,7540.0
processos->processos/apropriacao-credito-extemporaneos->298565727-abrir visualização->298565727-diminuir o zoom,15920.0,7561.0
processos->processos/apropriacao-credito-extemporaneos->298565727-abrir visualização->298565727-expandir,16142.0,7735.0
processos->processos/apropriacao-credito-extemporaneos->298565727-abrir visualização->298565727-download,15914.0,7690.0
processos->processos/atualizacao-indicador->2224043782-executar->2224043782-múltipla seleção,15136.0,6523.0
processos->processos/atualizacao-indicador->2224043782-executar->2224043782-agendar,18098.9,9789.0
ocessos->processos/atualizacao-indicador->2224043782-visualização->2224043782-item- and submit,14807.0,6517.0
processos->processos/exclusao-op-saida->3183959863-executar->3183959863-múltipla seleção,15432.0,6821.0
processos->processos/exclusao-op-saida->3183959863-executar->3183959863-agendar,18090.0,9759.0
ocessos->processos/exclusao-op-saida->3183959863-executar->3183959863-input-P_NUMERO_DOF and submit,14731.0,6479.0
ocessos->processos/exclusao-op-saida->3183959863-visualização->3183959863-item- and submit,15013.0,6326.0
processos->processos/suspencao-retomada-creditos->985668109-executar->985668109-múltipla seleção,14986.0,6557.0
processos->processos/suspencao-retomada-creditos->985668109-executar->985668109-agendar,17958.0,9818.0
ocessos->processos/suspencao-retomada-creditos->985668109-executar->985668109-input-P_MOTIVO and submit,14751.0,6467.0
ocessos->processos/suspencao-retomada-creditos->985668109-visualização->985668109-item- and submit,14712.0,6502.0
processos->processos/suspencao-retomada-creditos->985668109-detalhes->985668109-dados disponíveis para impressão,15027.0,6781.0
processos->processos/suspencao-retomada-creditos->985668109-abrir visualização->985668109-aumentar o zoom,16026.0,7783.0
processos->processos/suspencao-retomada-creditos->985668109-abrir visualização->985668109-diminuir o zoom,16043.0,7779.0
processos->processos/suspencao-retomada-creditos->985668109-abrir visualização->985668109-expandir,15909.0,7778.0
processos->processos/suspencao-retomada-creditos->985668109-abrir visualização->985668109-download,16070.0,7778.0
processos->processos/transferencia-inc-societaria->1642007593-executar->1642007593-múltipla seleção,14888.0,6825.0
processos->processos/transferencia-inc-societaria->1642007593-executar->1642007593-agendar,18088.0,9817.0
ocessos->processos/transferencia-inc-societaria->1642007593-executar->1642007593-input-P_MOTIVO_BAIXA and submit,14653.0,6464.0
ocessos->processos/transferencia-inc-societaria->1642007593-visualização->1642007593-item- and submit,14858.0,6562.0
relatorios->relatorios/controles-ciap->2680178634-executar->2680178634-múltipla seleção,15070.0,6913.0
relatorios->relatorios/controles-ciap->2680178634-executar->2680178634-agendar,18033.0,9799.0
latorios->relatorios/controles-ciap->2680178634-executar->2680178634-input-P_BEM_DE-2680178634-input-P_BEM_ATE-2680178634-input-P_NUM_PLAQ_DE-2680178634-input-P_NUM_PLAQ_ATE and submit,14703.0,6531.0
latorios->relatorios/controles-ciap->2680178634-visualização->2680178634-item- and submit,14883.0,6599.0
relatorios->relatorios/conferenc-controles-incorp->4033549032-executar->4033549032-múltipla seleção,18098.9,6904.0
relatorios->relatorios/conferenc-controles-incorp->4033549032-executar->4033549032-agendar,18098.9,9832.0
latorios->relatorios/conferenc-controles-incorp->4033549032-executar->4033549032-input-P_PERIODO-4033549032-input-P_ID_CTRL_PAI-4033549032-input-P_COD_BEM_PAI-4033549032-input-P_NUM_PLAQUETA_PAI-4033549032-input-P_ID_CTRL_FILHO-4033549032-input-P_COD_BEM_FILHO and submit,15007.0,10193.0
latorios->relatorios/conferenc-controles-incorp->4033549032-visualização->4033549032-item- and submit,14740.0,6599.0
relatorios->relatorios/creditos-curto-longo-prazo->172111467-executar->172111467-múltipla seleção,14995.0,6742.0
relatorios->relatorios/creditos-curto-longo-prazo->172111467-executar->172111467-agendar,17087.0,9760.0
latorios->relatorios/creditos-curto-longo-prazo->172111467-executar->172111467-input-P_CURTO_PRAZO-172111467-input-P_LONGO_PRAZO and submit,14839.0,6457.0
latorios->relatorios/creditos-curto-longo-prazo->172111467-visualização->172111467-item- and submit,14794.0,6521.0
relatorios->relatorios/creditos-parcelados-periodo->4272249838-executar->4272249838-múltipla seleção,15169.0,6760.0
relatorios->relatorios/creditos-parcelados-periodo->4272249838-executar->4272249838-agendar,18029.0,9759.0
latorios->relatorios/creditos-parcelados-periodo->4272249838-visualização->4272249838-item- and submit,14925.0,6505.0
relatorios->relatorios/diferencas-arredondamento->532328817-executar->532328817-múltipla seleção,15010.0,6834.0
relatorios->relatorios/diferencas-arredondamento->532328817-executar->532328817-agendar,16996.0,9780.0
latorios->relatorios/diferencas-arredondamento->532328817-executar->532328817-input-P_PERIODO and submit,14714.0,6456.0
latorios->relatorios/diferencas-arredondamento->532328817-visualização->532328817-item- and submit,14808.0,6504.0
relatorios->relatorios/operacoes-de-saida->3190201375-executar->3190201375-múltipla seleção,15105.0,6776.0
relatorios->relatorios/operacoes-de-saida->3190201375-executar->3190201375-agendar,18024.0,9836.0
latorios->relatorios/operacoes-de-saida->3190201375-executar->3190201375-input-P_NUMERO-3190201375-input-P_SERIE-3190201375-input-P_ID_CONTROLE-3190201375-input-P_BEM_CODIGO-3190201375-input-P_PLAQUETA-3190201375-input-P_COD_CTA and submit,14666.0,6371.0
latorios->relatorios/operacoes-de-saida->3190201375-visualização->3190201375-item- and submit,14846.0,6639.0
relatorios->relatorios/val-creditos-icms-controle->1912915204-executar->1912915204-múltipla seleção,15114.0,6840.0
relatorios->relatorios/val-creditos-icms-controle->1912915204-executar->1912915204-agendar,17904.0,9829.0
latorios->relatorios/val-creditos-icms-controle->1912915204-visualização->1912915204-item- and submit,14844.0,6426.0
relatorios->relatorios/val-creditos-icms-controle->1912915204-detalhes->1912915204-dados disponíveis para impressão,15123.0,6899.0
relatorios->relatorios/val-creditos-icms-controle->1912915204-abrir visualização->1912915204-aumentar o zoom,15978.0,7783.0
relatorios->relatorios/val-creditos-icms-controle->1912915204-abrir visualização->1912915204-diminuir o zoom,16131.0,7811.0
relatorios->relatorios/val-creditos-icms-controle->1912915204-abrir visualização->1912915204-expandir,15936.0,7871.0
relatorios->relatorios/val-creditos-icms-controle->1912915204-abrir visualização->1912915204-download,15963.0,7782.0
informes-fiscais->informes-fiscais/cred-icms-tomados-priod->1868435819-executar->1868435819-múltipla seleção,15160.0,6802.0
informes-fiscais->informes-fiscais/cred-icms-tomados-priod->1868435819-executar->1868435819-agendar,18047.0,9850.0
formes-fiscais->informes-fiscais/cred-icms-tomados-priod->1868435819-executar->1868435819-input-P_ANO-1868435819-input-P_MES and submit,14893.0,6484.0
formes-fiscais->informes-fiscais/cred-icms-tomados-priod->1868435819-visualização->1868435819-item- and submit,14804.0,6578.0
informes-fiscais->informes-fiscais/cred-icms-tomados-priod->1868435819-detalhes->1868435819-dados disponíveis para impressão,15033.0,6878.0
informes-fiscais->informes-fiscais/cred-icms-tomados-priod->1868435819-abrir visualização->1868435819-aumentar o zoom,16138.0,7901.0
informes-fiscais->informes-fiscais/cred-icms-tomados-priod->1868435819-abrir visualização->1868435819-diminuir o zoom,16109.0,7844.0
informes-fiscais->informes-fiscais/cred-icms-tomados-priod->1868435819-abrir visualização->1868435819-expandir,16158.0,7853.0
informes-fiscais->informes-fiscais/cred-icms-tomados-priod->1868435819-abrir visualização->1868435819-download,15953.0,7825.0
informes-fiscais->informes-fiscais/contr-cred-modc->1437611396-executar->1437611396-múltipla seleção,14941.0,6859.0
informes-fiscais->informes-fiscais/contr-cred-modc->1437611396-executar->1437611396-agendar,18098.9,9818.0
formes-fiscais->informes-fiscais/contr-cred-modc->1437611396-executar->1437611396-input-P_NUMERO_LIVRO-1437611396-input-P_FOLHA_INICIAL and submit,14640.0,6518.0
formes-fiscais->informes-fiscais/contr-cred-modc->1437611396-visualização->1437611396-item- and submit,14794.0,6635.0
informes-fiscais->informes-fiscais/contr-cred-modc-mg->2762236547-executar->2762236547-múltipla seleção,15080.0,6867.0
informes-fiscais->informes-fiscais/contr-cred-modc-mg->2762236547-executar->2762236547-agendar,18098.9,9857.0
formes-fiscais->informes-fiscais/contr-cred-modc-mg->2762236547-executar->2762236547-input-P_NUMERO_LIVRO-2762236547-input-P_FOLHA_INICIAL and submit,14737.0,6647.0
formes-fiscais->informes-fiscais/contr-cred-modc-mg->2762236547-visualização->2762236547-item- and submit,18098.9,12121.299999999997
informes-fiscais->informes-fiscais/contr-cred-modc-rj->2762236705-executar->2762236705-múltipla seleção,15297.0,6913.0
informes-fiscais->informes-fiscais/contr-cred-modc-rj->2762236705-executar->2762236705-agendar,18052.0,9574.0
formes-fiscais->informes-fiscais/contr-cred-modc-rj->2762236705-executar->2762236705-input-P_NUMERO_LIVRO-2762236705-input-P_FOLHA_INICIAL and submit,14817.0,6295.0
formes-fiscais->informes-fiscais/contr-cred-modc-rj->2762236705-visualização->2762236705-item- and submit,15003.0,6499.0
informes-fiscais->informes-fiscais/contr-cred-modd->1437611397-executar->1437611397-múltipla seleção,15221.0,6742.0
informes-fiscais->informes-fiscais/contr-cred-modd->1437611397-executar->1437611397-agendar,18098.0,9779.0
formes-fiscais->informes-fiscais/contr-cred-modd->1437611397-executar->1437611397-input-P_NUMERO_LIVRO-1437611397-input-P_FOLHA_INICIAL and submit,14705.0,6435.0
formes-fiscais->informes-fiscais/contr-cred-modd->1437611397-visualização->1437611397-item- and submit,14734.0,6623.0
obrigacoes->obrigacoes/configuracao->3982231145-gerenciar labels->3982231145-fechar,15991.0,8049.0
obrigacoes->obrigacoes/configuracao->3982231145-visualizar/editar->2618916230-salvar,18098.9,8423.0
obrigacoes->obrigacoes/configuracao->3982231145-visualizar/editar->2618916230-voltar,18098.9,6560.0
obrigacoes->obrigacoes/periodicidade->4090291865-novo->4090291865-criar,17062.0,9896.0
obrigacoes->obrigacoes/periodicidade->4090291865-novo->4090291865-cancelar,15317.0,8227.0
rigacoes->obrigacoes/periodicidade->4090291865-novo->4090291865-input-number-ano and submit,14760.0,6475.0
obrigacoes->obrigacoes/periodicidade->4090291865-editar->4090291865-remover item,16065.0,7792.0
obrigacoes->obrigacoes/periodicidade->4090291865-editar->4090291865-salvar,15190.0,6641.0
obrigacoes->obrigacoes/configuracao-estabelecimento->2182589889-novo->2182589889-cancelar,15089.0,7823.0
obrigacoes->obrigacoes/solicitacoes->829857080-ir para todas as obrigações->829857080-voltar às obrigações do módulo,18098.9,5093.0
rigacoes->obrigacoes/obrigacoes-executadas->1017963809-visualização->1017963809-item- and submit,14817.0,6615.0
obrigacoes->obrigacoes/obrigacoes-executadas->1017963809-visualizar->1017963809-dados disponíveis para impressão,15104.0,6806.0
regras->regras/lancamentos-ajustes-regras->3291988906-selectoutlined->2051661756-novo->1470273197-salvar,14075.0,9446.0
regras->regras/lancamentos-ajustes-regras->3291988906-selectoutlined->2051661756-novo->1470273197-voltar,12625.0,6122.0
gras->regras/lancamentos-ajustes-regras->3291988906-selectoutlined->2051661756-novo->1470273197-powerselect-ufCodigo-1470273197-checkbox-detalhaAjuste-1470273197-checkbox-operacaoIncentivada-1470273197-powerselect-vlAjuste-1470273197-powerselect-descrAjuste and submit,18098.9,12121.299999999997
regras->regras/lancamentos-ajustes-regras->3291988906-visualizar/editar->2442857990-selecionar critérios->2442857990-item-cfop,12247.0,6520.0
regras->regras/lancamentos-ajustes-regras->3291988906-visualizar/editar->2442857990-selecionar critérios->2442857990-item-nop,12032.0,7113.0
regras->regras/lancamentos-ajustes-regras->3291988906-visualizar/editar->2442857990-estabelecimentos da regra->2442857990-power-search-button,13013.0,8106.0
regras->regras/lancamentos-ajustes-regras->3291988906-visualizar/editar->2442857990-estabelecimentos da regra->2442857990-carregar mais,12211.0,7107.0
regras->regras/lancamentos-ajustes-regras->3291988906-visualizar/editar->2442857990-estabelecimentos da regra->2442857990-fechar,12065.0,7084.0
gras->regras/lancamentos-ajustes-regras->3291988906-visualizar/editar->2442857990-estabelecimentos da regra->2442857990-power-search-input and submit,11502.0,9528.0
processos->processos/geracao-controles->1614615400-abrir visualização->1614615400-expandir->1614615400-diminuir,17208.0,9194.0
processos->processos/exclusao-controles->287994784-executar->287994784-múltipla seleção->287994784-cancelar,17876.0,8060.0
processos->processos/exclusao-controle-dof-aquisicao->1629306443-executar->1629306443-múltipla seleção->1629306443-cancelar,16286.0,8000.0
processos->processos/totalizacao-saidas->633719453-executar->633719453-múltipla seleção->633719453-cancelar,16374.0,7993.0
processos->processos/exclusao-creditos->2814741288-abrir visualização->2814741288-expandir->2814741288-diminuir,17233.0,9006.0
processos->processos/apropriacao-credito-extemporaneos->298565727-executar->298565727-múltipla seleção->298565727-cancelar,16398.0,8041.0
processos->processos/apropriacao-credito-extemporaneos->298565727-abrir visualização->298565727-expandir->298565727-diminuir,17102.0,9099.0
processos->processos/atualizacao-indicador->2224043782-executar->2224043782-múltipla seleção->2224043782-cancelar,16419.0,8016.0
processos->processos/exclusao-op-saida->3183959863-executar->3183959863-múltipla seleção->3183959863-cancelar,16365.0,8051.0
processos->processos/suspencao-retomada-creditos->985668109-executar->985668109-múltipla seleção->985668109-cancelar,16319.0,8095.0
processos->processos/suspencao-retomada-creditos->985668109-abrir visualização->985668109-expandir->985668109-diminuir,17326.0,8996.0
processos->processos/transferencia-inc-societaria->1642007593-executar->1642007593-múltipla seleção->1642007593-cancelar,16366.0,8064.0
relatorios->relatorios/controles-ciap->2680178634-executar->2680178634-múltipla seleção->2680178634-cancelar,16289.0,7871.0
relatorios->relatorios/creditos-curto-longo-prazo->172111467-executar->172111467-múltipla seleção->172111467-cancelar,16178.0,9418.0
relatorios->relatorios/creditos-parcelados-periodo->4272249838-executar->4272249838-múltipla seleção->4272249838-cancelar,16210.0,9716.0
relatorios->relatorios/diferencas-arredondamento->532328817-executar->532328817-múltipla seleção->532328817-cancelar,16362.0,8006.0
relatorios->relatorios/operacoes-de-saida->3190201375-executar->3190201375-múltipla seleção->3190201375-cancelar,16359.0,8123.0
relatorios->relatorios/val-creditos-icms-controle->1912915204-executar->1912915204-múltipla seleção->1912915204-cancelar,16182.0,8301.0
relatorios->relatorios/val-creditos-icms-controle->1912915204-abrir visualização->1912915204-expandir->1912915204-diminuir,17389.0,9084.0
informes-fiscais->informes-fiscais/cred-icms-tomados-priod->1868435819-executar->1868435819-múltipla seleção->1868435819-cancelar,16301.0,7992.0
informes-fiscais->informes-fiscais/cred-icms-tomados-priod->1868435819-abrir visualização->1868435819-expandir->1868435819-diminuir,17314.0,9060.0
informes-fiscais->informes-fiscais/contr-cred-modc->1437611396-executar->1437611396-múltipla seleção->1437611396-cancelar,16175.0,8007.0
informes-fiscais->informes-fiscais/contr-cred-modc-mg->2762236547-executar->2762236547-múltipla seleção->2762236547-cancelar,16230.0,8160.0
informes-fiscais->informes-fiscais/contr-cred-modc-rj->2762236705-executar->2762236705-múltipla seleção->2762236705-cancelar,16286.0,8114.0
informes-fiscais->informes-fiscais/contr-cred-modd->1437611397-executar->1437611397-múltipla seleção->1437611397-cancelar,16283.0,8026.0
obrigacoes->obrigacoes/solicitacoes->829857080-ir para todas as obrigações->829857080-voltar às obrigações do módulo->829857080-ir para todas as obrigações,18098.9,7365.0
