TEST-NAME,IDS-TIME(MS),IDUBS-TIME(MS)
,11445.0,10994.0
home,12076.0,11304.0
tabelas-oficiais,6773.0,6369.0
parametros-sistema,6633.0,6312.0
tabelas-corporativas,6805.0,6347.0
conteudo-importacao,6661.0,6398.0
obrigacoes,6679.0,6556.0
processos-customizados,7649.0,7581.0
downloads,7622.0,7866.0
collapse-menu,6599.0,6287.0
modules-menu,7687.0,7560.0
3791239504-exibir dados,7730.0,7544.0
tabelas-oficiais->tabelas-oficiais/origem-mercadoria,13328.0,12448.0
parametros-sistema->parametros-sistema/parametros-gerais,8082.0,7901.0
tabelas-corporativas->tabelas-corporativas/pfj,8053.0,7855.0
tabelas-corporativas->tabelas-corporativas/mercadorias,8076.0,7827.0
tabelas-corporativas->tabelas-corporativas/transacoes,8023.0,7921.0
conteudo-importacao->conteudo-importacao/informacoes-cadastrais,8005.0,7870.0
conteudo-importacao->conteudo-importacao/transacoes,8259.0,7813.0
conteudo-importacao->conteudo-importacao/processos,8051.0,7903.0
conteudo-importacao->conteudo-importacao/relatorios,8035.0,7874.0
obrigacoes->obrigacoes/propriedades,12550.0,12281.0
obrigacoes->obrigacoes/solicitacoes,12508.0,12186.0
obrigacoes->obrigacoes/obrigacoes-executadas,12294.0,12182.0
obrigacoes->obrigacoes/periodicidade,12439.0,13536.8
obrigacoes->obrigacoes/estabelecimento,12431.0,13536.8
downloads->1930978028-power-search-button,11005.0,6669.0
downloads->1930978028-download,11101.0,8644.0
downloads->1930978028-detalhes,9092.0,6655.0
downloads->1930978028-excluir,9095.0,6534.0
parametros-sistema->parametros-sistema/parametros-gerais->parametros-sistema/parametros-gerais/parametrizacao-geral,14357.0,13536.8
tabelas-corporativas->tabelas-corporativas/pfj->tabelas-corporativas/pfj/pessoas-fisicas-juridicas,9043.0,8707.0
tabelas-corporativas->tabelas-corporativas/mercadorias->tabelas-corporativas/mercadorias/cadastro-mercadorias,9077.0,8884.0
tabelas-corporativas->tabelas-corporativas/mercadorias->tabelas-corporativas/mercadorias/unidade-medida,9055.0,8906.0
tabelas-corporativas->tabelas-corporativas/transacoes->tabelas-corporativas/transacoes/digitacao-manutencao-dof,9017.0,8920.0
conteudo-importacao->conteudo-importacao/informacoes-cadastrais->conteudo-importacao/informacoes-cadastrais/estrutura-mercadorias-fci,9513.0,9236.0
conteudo-importacao->conteudo-importacao/transacoes->conteudo-importacao/transacoes/conteudo-importacao,9485.0,9238.0
conteudo-importacao->conteudo-importacao/processos->conteudo-importacao/processos/gerar-ci,13917.0,13536.8
conteudo-importacao->conteudo-importacao/processos->conteudo-importacao/processos/gerar-ci-estimativa,13826.0,13480.0
conteudo-importacao->conteudo-importacao/processos->conteudo-importacao/processos/replicar-ci,13744.0,13536.8
conteudo-importacao->conteudo-importacao/processos->conteudo-importacao/processos/apagar-ci,13761.0,13536.8
conteudo-importacao->conteudo-importacao/processos->conteudo-importacao/processos/exportar-fci,13731.0,13536.8
conteudo-importacao->conteudo-importacao/processos->conteudo-importacao/processos/importacao-controles-fci,9434.0,9294.0
conteudo-importacao->conteudo-importacao/relatorios->conteudo-importacao/relatorios/memoria-calculo,13763.0,13518.0
conteudo-importacao->conteudo-importacao/relatorios->conteudo-importacao/relatorios/composicao,13965.0,13536.8
conteudo-importacao->conteudo-importacao/relatorios->conteudo-importacao/relatorios/composicao-estimativa,13712.0,13536.8
conteudo-importacao->conteudo-importacao/relatorios->conteudo-importacao/relatorios/enquadramento-documentos,13770.0,13536.8
obrigacoes->obrigacoes/propriedades->778959242-power-search-button,13702.0,6595.0
obrigacoes->obrigacoes/propriedades->778959242-gerenciar labels,14919.0,6550.0
obrigacoes->obrigacoes/propriedades->778959242-visualizar parâmetros,18139.0,6577.0
obrigacoes->obrigacoes/propriedades->778959242-visualizar/editar,18107.0,6575.0
obrigacoes->obrigacoes/solicitacoes->3611409689-ir para todas as obrigações,18243.0,6630.0
obrigacoes->obrigacoes/solicitacoes->3611409689-ajuda,13870.0,5480.0
obrigacoes->obrigacoes/obrigacoes-executadas->1557170498-power-search-button,13730.0,6606.0
obrigacoes->obrigacoes/obrigacoes-executadas->1557170498-visualização,14831.0,6672.0
obrigacoes->obrigacoes/obrigacoes-executadas->1557170498-abrir visualização,14698.0,6537.0
obrigacoes->obrigacoes/obrigacoes-executadas->1557170498-visualizar,14882.0,6545.0
obrigacoes->obrigacoes/periodicidade->334531258-novo,14808.0,6594.0
obrigacoes->obrigacoes/periodicidade->334531258-power-search-button,14851.0,6536.0
obrigacoes->obrigacoes/periodicidade->334531258-editar,14802.0,6574.0
obrigacoes->obrigacoes/periodicidade->334531258-excluir,14654.0,6562.0
obrigacoes->obrigacoes/estabelecimento->3784989026-novo,14831.0,7220.0
obrigacoes->obrigacoes/estabelecimento->3784989026-power-search-button,14628.0,6607.0
obrigacoes->obrigacoes/estabelecimento->3784989026-excluir,14715.0,6549.0
conteudo-importacao->conteudo-importacao/informacoes-cadastrais->conteudo-importacao/informacoes-cadastrais/estrutura-mercadorias-fci->1084560218-novo,14588.0,9863.0
conteudo-importacao->conteudo-importacao/informacoes-cadastrais->conteudo-importacao/informacoes-cadastrais/estrutura-mercadorias-fci->1084560218-power-search-button,10915.0,6504.0
conteudo-importacao->conteudo-importacao/informacoes-cadastrais->conteudo-importacao/informacoes-cadastrais/estrutura-mercadorias-fci->1084560218-selectoutlined,10920.0,5604.0
conteudo-importacao->conteudo-importacao/informacoes-cadastrais->conteudo-importacao/informacoes-cadastrais/estrutura-mercadorias-fci->1084560218-eyeoutlined,10759.0,5984.0
conteudo-importacao->conteudo-importacao/informacoes-cadastrais->conteudo-importacao/informacoes-cadastrais/estrutura-mercadorias-fci->1084560218-deleteoutlined,11648.0,6465.0
conteudo-importacao->conteudo-importacao/transacoes->conteudo-importacao/transacoes/conteudo-importacao->2038373371-novo,10790.0,5515.0
conteudo-importacao->conteudo-importacao/transacoes->conteudo-importacao/transacoes/conteudo-importacao->2038373371-power-search-button,11883.0,6508.0
conteudo-importacao->conteudo-importacao/processos->conteudo-importacao/processos/gerar-ci->1869266243-executar,16182.0,5405.0
conteudo-importacao->conteudo-importacao/processos->conteudo-importacao/processos/gerar-ci->1869266243-agendamentos,15235.0,6611.0
conteudo-importacao->conteudo-importacao/processos->conteudo-importacao/processos/gerar-ci->1869266243-power-search-button,14927.0,6546.0
conteudo-importacao->conteudo-importacao/processos->conteudo-importacao/processos/gerar-ci->1869266243-visualização,16149.0,6623.0
conteudo-importacao->conteudo-importacao/processos->conteudo-importacao/processos/gerar-ci->1869266243-regerar,16133.0,6525.0
conteudo-importacao->conteudo-importacao/processos->conteudo-importacao/processos/gerar-ci->1869266243-detalhes,16274.0,6552.0
conteudo-importacao->conteudo-importacao/processos->conteudo-importacao/processos/gerar-ci->1869266243-abrir visualização,16155.0,6651.0
conteudo-importacao->conteudo-importacao/processos->conteudo-importacao/processos/gerar-ci->1869266243-excluir,16114.0,6622.0
conteudo-importacao->conteudo-importacao/processos->conteudo-importacao/processos/gerar-ci-estimativa->2161799073-executar,16227.0,6588.0
conteudo-importacao->conteudo-importacao/processos->conteudo-importacao/processos/gerar-ci-estimativa->2161799073-agendamentos,14930.0,6616.0
conteudo-importacao->conteudo-importacao/processos->conteudo-importacao/processos/gerar-ci-estimativa->2161799073-power-search-button,15129.0,6541.0
conteudo-importacao->conteudo-importacao/processos->conteudo-importacao/processos/gerar-ci-estimativa->2161799073-visualização,16271.0,6604.0
conteudo-importacao->conteudo-importacao/processos->conteudo-importacao/processos/gerar-ci-estimativa->2161799073-regerar,16219.0,6564.0
conteudo-importacao->conteudo-importacao/processos->conteudo-importacao/processos/gerar-ci-estimativa->2161799073-detalhes,16310.0,6552.0
conteudo-importacao->conteudo-importacao/processos->conteudo-importacao/processos/gerar-ci-estimativa->2161799073-abrir visualização,16276.0,6502.0
conteudo-importacao->conteudo-importacao/processos->conteudo-importacao/processos/gerar-ci-estimativa->2161799073-excluir,16299.0,6574.0
conteudo-importacao->conteudo-importacao/processos->conteudo-importacao/processos/replicar-ci->3930886052-executar,16220.0,6572.0
conteudo-importacao->conteudo-importacao/processos->conteudo-importacao/processos/replicar-ci->3930886052-agendamentos,19680.8,6583.0
conteudo-importacao->conteudo-importacao/processos->conteudo-importacao/processos/replicar-ci->3930886052-power-search-button,16206.0,7103.0
conteudo-importacao->conteudo-importacao/processos->conteudo-importacao/processos/replicar-ci->3930886052-visualização,16220.0,6556.0
conteudo-importacao->conteudo-importacao/processos->conteudo-importacao/processos/apagar-ci->18966040-executar,16132.0,6691.0
conteudo-importacao->conteudo-importacao/processos->conteudo-importacao/processos/apagar-ci->18966040-agendamentos,19593.0,6709.0
conteudo-importacao->conteudo-importacao/processos->conteudo-importacao/processos/apagar-ci->18966040-power-search-button,16218.0,6308.0
conteudo-importacao->conteudo-importacao/processos->conteudo-importacao/processos/apagar-ci->18966040-visualização,16228.0,6602.0
conteudo-importacao->conteudo-importacao/processos->conteudo-importacao/processos/apagar-ci->18966040-regerar,16144.0,6527.0
conteudo-importacao->conteudo-importacao/processos->conteudo-importacao/processos/apagar-ci->18966040-detalhes,16287.0,6608.0
conteudo-importacao->conteudo-importacao/processos->conteudo-importacao/processos/apagar-ci->18966040-abrir visualização,16214.0,6357.0
conteudo-importacao->conteudo-importacao/processos->conteudo-importacao/processos/apagar-ci->18966040-excluir,16247.0,6432.0
conteudo-importacao->conteudo-importacao/processos->conteudo-importacao/processos/exportar-fci->4013629049-executar,16092.0,6535.0
conteudo-importacao->conteudo-importacao/processos->conteudo-importacao/processos/exportar-fci->4013629049-agendamentos,19485.0,6557.0
conteudo-importacao->conteudo-importacao/processos->conteudo-importacao/processos/exportar-fci->4013629049-power-search-button,16254.0,6518.0
conteudo-importacao->conteudo-importacao/processos->conteudo-importacao/processos/exportar-fci->4013629049-visualização,16240.0,6595.0
conteudo-importacao->conteudo-importacao/processos->conteudo-importacao/processos/importacao-controles-fci->3614748927-importar,10801.0,5507.0
conteudo-importacao->conteudo-importacao/processos->conteudo-importacao/processos/importacao-controles-fci->3614748927-power-search-button,11914.0,6504.0
conteudo-importacao->conteudo-importacao/relatorios->conteudo-importacao/relatorios/memoria-calculo->2164517070-executar,16084.0,6556.0
conteudo-importacao->conteudo-importacao/relatorios->conteudo-importacao/relatorios/memoria-calculo->2164517070-agendamentos,19564.0,6703.0
conteudo-importacao->conteudo-importacao/relatorios->conteudo-importacao/relatorios/memoria-calculo->2164517070-power-search-button,16221.0,6319.0
conteudo-importacao->conteudo-importacao/relatorios->conteudo-importacao/relatorios/memoria-calculo->2164517070-visualização,16229.0,6562.0
conteudo-importacao->conteudo-importacao/relatorios->conteudo-importacao/relatorios/memoria-calculo->2164517070-regerar,16186.0,6520.0
conteudo-importacao->conteudo-importacao/relatorios->conteudo-importacao/relatorios/memoria-calculo->2164517070-detalhes,16325.0,6562.0
conteudo-importacao->conteudo-importacao/relatorios->conteudo-importacao/relatorios/memoria-calculo->2164517070-abrir visualização,16154.0,6518.0
conteudo-importacao->conteudo-importacao/relatorios->conteudo-importacao/relatorios/memoria-calculo->2164517070-excluir,16289.0,6630.0
conteudo-importacao->conteudo-importacao/relatorios->conteudo-importacao/relatorios/composicao->2832538547-executar,16520.0,6521.0
conteudo-importacao->conteudo-importacao/relatorios->conteudo-importacao/relatorios/composicao->2832538547-agendamentos,19680.8,13518.0
conteudo-importacao->conteudo-importacao/relatorios->conteudo-importacao/relatorios/composicao->2832538547-power-search-button,16485.0,6574.0
conteudo-importacao->conteudo-importacao/relatorios->conteudo-importacao/relatorios/composicao->2832538547-visualização,16230.0,6617.0
conteudo-importacao->conteudo-importacao/relatorios->conteudo-importacao/relatorios/composicao-estimativa->3114380081-executar,15888.0,6536.0
conteudo-importacao->conteudo-importacao/relatorios->conteudo-importacao/relatorios/composicao-estimativa->3114380081-agendamentos,19638.0,6721.0
conteudo-importacao->conteudo-importacao/relatorios->conteudo-importacao/relatorios/composicao-estimativa->3114380081-power-search-button,16135.0,6857.0
conteudo-importacao->conteudo-importacao/relatorios->conteudo-importacao/relatorios/composicao-estimativa->3114380081-visualização,16219.0,6784.0
conteudo-importacao->conteudo-importacao/relatorios->conteudo-importacao/relatorios/enquadramento-documentos->573119890-executar,16244.0,6540.0
conteudo-importacao->conteudo-importacao/relatorios->conteudo-importacao/relatorios/enquadramento-documentos->573119890-agendamentos,19269.0,6746.0
conteudo-importacao->conteudo-importacao/relatorios->conteudo-importacao/relatorios/enquadramento-documentos->573119890-power-search-button,16282.0,6385.0
conteudo-importacao->conteudo-importacao/relatorios->conteudo-importacao/relatorios/enquadramento-documentos->573119890-visualização,16162.0,6666.0
obrigacoes->obrigacoes/propriedades->778959242-gerenciar labels->778959242-fechar,16167.0,7885.0
obrigacoes->obrigacoes/propriedades->778959242-visualizar/editar->2070648359-salvar,19680.8,8546.0
obrigacoes->obrigacoes/propriedades->778959242-visualizar/editar->2070648359-voltar,19680.8,6634.0
obrigacoes->obrigacoes/solicitacoes->3611409689-ir para todas as obrigações->3611409689-voltar às obrigações do módulo,19680.8,5063.0
obrigacoes->obrigacoes/solicitacoes->3611409689-ir para todas as obrigações->3611409689-nova solicitação,19680.8,5212.0
obrigacoes->obrigacoes/solicitacoes->3611409689-ir para todas as obrigações->3611409689-agendamentos,19680.8,5178.0
obrigacoes->obrigacoes/solicitacoes->3611409689-ir para todas as obrigações->3611409689-atualizar,19384.0,5549.0
rigacoes->obrigacoes/obrigacoes-executadas->1557170498-visualização->1557170498-item- and submit,14802.0,6608.0
obrigacoes->obrigacoes/obrigacoes-executadas->1557170498-abrir visualização->1557170498-aumentar o zoom,15935.0,8195.0
obrigacoes->obrigacoes/obrigacoes-executadas->1557170498-abrir visualização->1557170498-diminuir o zoom,16041.0,8000.0
obrigacoes->obrigacoes/obrigacoes-executadas->1557170498-abrir visualização->1557170498-expandir,15982.0,7983.0
obrigacoes->obrigacoes/obrigacoes-executadas->1557170498-abrir visualização->1557170498-download,16050.0,7911.0
obrigacoes->obrigacoes/obrigacoes-executadas->1557170498-visualizar->1557170498-dados disponíveis para impressão,15338.0,6874.0
obrigacoes->obrigacoes/periodicidade->334531258-novo->334531258-criar,18256.0,9923.0
obrigacoes->obrigacoes/periodicidade->334531258-novo->334531258-cancelar,15256.0,6957.0
rigacoes->obrigacoes/periodicidade->334531258-novo->334531258-input-number-ano and submit,14982.0,6585.0
obrigacoes->obrigacoes/periodicidade->334531258-editar->334531258-remover item,16048.0,7871.0
obrigacoes->obrigacoes/periodicidade->334531258-editar->334531258-salvar,15307.0,7068.0
obrigacoes->obrigacoes/estabelecimento->3784989026-novo->3784989026-cancelar,16316.0,8014.0
conteudo-importacao->conteudo-importacao/informacoes-cadastrais->conteudo-importacao/informacoes-cadastrais/estrutura-mercadorias-fci->1084560218-selectoutlined->2635423676-novo,16115.0,5937.0
conteudo-importacao->conteudo-importacao/informacoes-cadastrais->conteudo-importacao/informacoes-cadastrais/estrutura-mercadorias-fci->1084560218-selectoutlined->2635423676-power-search-button,13195.0,6535.0
conteudo-importacao->conteudo-importacao/informacoes-cadastrais->conteudo-importacao/informacoes-cadastrais/estrutura-mercadorias-fci->1084560218-eyeoutlined->456659030-mais operações,13223.0,7155.0
conteudo-importacao->conteudo-importacao/informacoes-cadastrais->conteudo-importacao/informacoes-cadastrais/estrutura-mercadorias-fci->1084560218-eyeoutlined->456659030-remover item,13294.0,7192.0
conteudo-importacao->conteudo-importacao/informacoes-cadastrais->conteudo-importacao/informacoes-cadastrais/estrutura-mercadorias-fci->1084560218-eyeoutlined->456659030-salvar,12207.0,6238.0
conteudo-importacao->conteudo-importacao/informacoes-cadastrais->conteudo-importacao/informacoes-cadastrais/estrutura-mercadorias-fci->1084560218-eyeoutlined->456659030-voltar,12322.0,6200.0
conteudo-importacao->conteudo-importacao/informacoes-cadastrais->conteudo-importacao/informacoes-cadastrais/estrutura-mercadorias-fci->1084560218-eyeoutlined->456659030-novo,12205.0,6194.0
conteudo-importacao->conteudo-importacao/informacoes-cadastrais->conteudo-importacao/informacoes-cadastrais/estrutura-mercadorias-fci->1084560218-eyeoutlined->456659030-power-search-button,13274.0,7233.0
conteudo-importacao->conteudo-importacao/informacoes-cadastrais->conteudo-importacao/informacoes-cadastrais/estrutura-mercadorias-fci->1084560218-eyeoutlined->456659030-eyeoutlined,13095.0,7191.0
conteudo-importacao->conteudo-importacao/informacoes-cadastrais->conteudo-importacao/informacoes-cadastrais/estrutura-mercadorias-fci->1084560218-eyeoutlined->456659030-deleteoutlined,13235.0,7168.0
nteudo-importacao->conteudo-importacao/informacoes-cadastrais->conteudo-importacao/informacoes-cadastrais/estrutura-mercadorias-fci->1084560218-eyeoutlined->456659030-powerselect-estCodigo and submit,10854.0,5963.0
conteudo-importacao->conteudo-importacao/transacoes->conteudo-importacao/transacoes/conteudo-importacao->2038373371-novo->1607739854-salvar,15134.0,8468.0
conteudo-importacao->conteudo-importacao/transacoes->conteudo-importacao/transacoes/conteudo-importacao->2038373371-novo->1607739854-voltar,12201.0,5632.0
nteudo-importacao->conteudo-importacao/transacoes->conteudo-importacao/transacoes/conteudo-importacao->2038373371-novo->1607739854-powerselect-estCodigo-1607739854-powerselect-mercCodigo-1607739854-input-fciNumero-1607739854-checkbox-fciNova-1607739854-powerselect-omCodigo-1607739854-input-monetary-valorImportado-1607739854-input-monetary-qtdImportado-1607739854-input-monetary-valorNacional-1607739854-input-monetary-qtdNacional-1607739854-input-monetary-valorInterestadual-1607739854-input-monetary-qtdInterestadual-1607739854-input-monetary-conteudoImportacao-1607739854-input-monetary-valorImportacao-1607739854-input-protocolo and submit,19680.8,13536.8
nteudo-importacao->conteudo-importacao/processos->conteudo-importacao/processos/gerar-ci->1869266243-visualização->1869266243-item- and submit,16294.0,6665.0
conteudo-importacao->conteudo-importacao/processos->conteudo-importacao/processos/gerar-ci->1869266243-detalhes->1869266243-dados disponíveis para impressão,16495.0,6892.0
conteudo-importacao->conteudo-importacao/processos->conteudo-importacao/processos/gerar-ci->1869266243-abrir visualização->1869266243-aumentar o zoom,17411.0,7922.0
conteudo-importacao->conteudo-importacao/processos->conteudo-importacao/processos/gerar-ci->1869266243-abrir visualização->1869266243-diminuir o zoom,17530.0,7829.0
conteudo-importacao->conteudo-importacao/processos->conteudo-importacao/processos/gerar-ci->1869266243-abrir visualização->1869266243-expandir,17392.0,7813.0
conteudo-importacao->conteudo-importacao/processos->conteudo-importacao/processos/gerar-ci->1869266243-abrir visualização->1869266243-download,17537.0,7874.0
conteudo-importacao->conteudo-importacao/processos->conteudo-importacao/processos/gerar-ci-estimativa->2161799073-executar->2161799073-múltipla seleção,16604.0,6947.0
conteudo-importacao->conteudo-importacao/processos->conteudo-importacao/processos/gerar-ci-estimativa->2161799073-executar->2161799073-agendar,19656.0,9835.0
nteudo-importacao->conteudo-importacao/processos->conteudo-importacao/processos/gerar-ci-estimativa->2161799073-executar->2161799073-input-PERIODO-2161799073-input-PERIODO2 and submit,16321.0,6556.0
nteudo-importacao->conteudo-importacao/processos->conteudo-importacao/processos/gerar-ci-estimativa->2161799073-visualização->2161799073-item- and submit,16283.0,9187.0
conteudo-importacao->conteudo-importacao/processos->conteudo-importacao/processos/gerar-ci-estimativa->2161799073-detalhes->2161799073-dados disponíveis para impressão,16548.0,6951.0
conteudo-importacao->conteudo-importacao/processos->conteudo-importacao/processos/gerar-ci-estimativa->2161799073-abrir visualização->2161799073-aumentar o zoom,17755.0,8775.0
conteudo-importacao->conteudo-importacao/processos->conteudo-importacao/processos/gerar-ci-estimativa->2161799073-abrir visualização->2161799073-diminuir o zoom,17637.0,7908.0
conteudo-importacao->conteudo-importacao/processos->conteudo-importacao/processos/gerar-ci-estimativa->2161799073-abrir visualização->2161799073-expandir,17426.0,7819.0
conteudo-importacao->conteudo-importacao/processos->conteudo-importacao/processos/gerar-ci-estimativa->2161799073-abrir visualização->2161799073-download,17598.0,7872.0
conteudo-importacao->conteudo-importacao/processos->conteudo-importacao/processos/replicar-ci->3930886052-executar->3930886052-múltipla seleção,16487.0,6825.0
conteudo-importacao->conteudo-importacao/processos->conteudo-importacao/processos/replicar-ci->3930886052-executar->3930886052-agendar,19508.0,9669.0
nteudo-importacao->conteudo-importacao/processos->conteudo-importacao/processos/replicar-ci->3930886052-executar->3930886052-input-PERIODO and submit,16099.0,6536.0
nteudo-importacao->conteudo-importacao/processos->conteudo-importacao/processos/replicar-ci->3930886052-visualização->3930886052-item- and submit,16331.0,6587.0
conteudo-importacao->conteudo-importacao/processos->conteudo-importacao/processos/apagar-ci->18966040-executar->18966040-múltipla seleção,16490.0,9564.0
conteudo-importacao->conteudo-importacao/processos->conteudo-importacao/processos/apagar-ci->18966040-executar->18966040-agendar,19590.0,9871.0
nteudo-importacao->conteudo-importacao/processos->conteudo-importacao/processos/apagar-ci->18966040-visualização->18966040-item- and submit,16285.0,6619.0
conteudo-importacao->conteudo-importacao/processos->conteudo-importacao/processos/apagar-ci->18966040-detalhes->18966040-dados disponíveis para impressão,16552.0,6857.0
conteudo-importacao->conteudo-importacao/processos->conteudo-importacao/processos/apagar-ci->18966040-abrir visualização->18966040-aumentar o zoom,17500.0,7832.0
conteudo-importacao->conteudo-importacao/processos->conteudo-importacao/processos/apagar-ci->18966040-abrir visualização->18966040-diminuir o zoom,18257.0,7879.0
conteudo-importacao->conteudo-importacao/processos->conteudo-importacao/processos/apagar-ci->18966040-abrir visualização->18966040-expandir,17463.0,7823.0
conteudo-importacao->conteudo-importacao/processos->conteudo-importacao/processos/apagar-ci->18966040-abrir visualização->18966040-download,17383.0,7924.0
conteudo-importacao->conteudo-importacao/processos->conteudo-importacao/processos/exportar-fci->4013629049-executar->4013629049-múltipla seleção,16589.0,6858.0
conteudo-importacao->conteudo-importacao/processos->conteudo-importacao/processos/exportar-fci->4013629049-executar->4013629049-agendar,19609.0,9905.0
nteudo-importacao->conteudo-importacao/processos->conteudo-importacao/processos/exportar-fci->4013629049-executar->4013629049-input-PERIODO and submit,19680.8,10078.0
nteudo-importacao->conteudo-importacao/processos->conteudo-importacao/processos/exportar-fci->4013629049-visualização->4013629049-item- and submit,16196.0,6597.0
conteudo-importacao->conteudo-importacao/processos->conteudo-importacao/processos/importacao-controles-fci->3614748927-importar->3614748927- selecionar arquivo,13085.0,7862.0
conteudo-importacao->conteudo-importacao/processos->conteudo-importacao/processos/importacao-controles-fci->3614748927-importar->3614748927-cancelar,12095.0,7211.0
nteudo-importacao->conteudo-importacao/processos->conteudo-importacao/processos/importacao-controles-fci->3614748927-importar->3614748927-powerselect-estabelecimento-3614748927-radio-tipoArquivo and submit,11025.0,6022.0
conteudo-importacao->conteudo-importacao/relatorios->conteudo-importacao/relatorios/memoria-calculo->2164517070-executar->2164517070-múltipla seleção,16506.0,6825.0
conteudo-importacao->conteudo-importacao/relatorios->conteudo-importacao/relatorios/memoria-calculo->2164517070-executar->2164517070-agendar,19625.0,9841.0
nteudo-importacao->conteudo-importacao/relatorios->conteudo-importacao/relatorios/memoria-calculo->2164517070-executar->2164517070-input-PERIODO and submit,16126.0,6587.0
nteudo-importacao->conteudo-importacao/relatorios->conteudo-importacao/relatorios/memoria-calculo->2164517070-visualização->2164517070-item- and submit,16225.0,6585.0
conteudo-importacao->conteudo-importacao/relatorios->conteudo-importacao/relatorios/memoria-calculo->2164517070-detalhes->2164517070-dados disponíveis para impressão,16459.0,6934.0
conteudo-importacao->conteudo-importacao/relatorios->conteudo-importacao/relatorios/memoria-calculo->2164517070-abrir visualização->2164517070-aumentar o zoom,17490.0,7870.0
conteudo-importacao->conteudo-importacao/relatorios->conteudo-importacao/relatorios/memoria-calculo->2164517070-abrir visualização->2164517070-diminuir o zoom,17528.0,7876.0
conteudo-importacao->conteudo-importacao/relatorios->conteudo-importacao/relatorios/memoria-calculo->2164517070-abrir visualização->2164517070-expandir,17353.0,7853.0
conteudo-importacao->conteudo-importacao/relatorios->conteudo-importacao/relatorios/memoria-calculo->2164517070-abrir visualização->2164517070-download,17441.0,7827.0
conteudo-importacao->conteudo-importacao/relatorios->conteudo-importacao/relatorios/composicao->2832538547-executar->2832538547-múltipla seleção,16436.0,6924.0
conteudo-importacao->conteudo-importacao/relatorios->conteudo-importacao/relatorios/composicao->2832538547-executar->2832538547-agendar,19413.0,9892.0
nteudo-importacao->conteudo-importacao/relatorios->conteudo-importacao/relatorios/composicao->2832538547-executar->2832538547-input-PERIODO-2832538547-input-PERIODO2 and submit,16164.0,6368.0
nteudo-importacao->conteudo-importacao/relatorios->conteudo-importacao/relatorios/composicao->2832538547-visualização->2832538547-item- and submit,16070.0,6682.0
conteudo-importacao->conteudo-importacao/relatorios->conteudo-importacao/relatorios/composicao-estimativa->3114380081-executar->3114380081-múltipla seleção,16410.0,6887.0
conteudo-importacao->conteudo-importacao/relatorios->conteudo-importacao/relatorios/composicao-estimativa->3114380081-executar->3114380081-agendar,19555.0,9918.0
nteudo-importacao->conteudo-importacao/relatorios->conteudo-importacao/relatorios/composicao-estimativa->3114380081-executar->3114380081-input-PERIODO-3114380081-input-PERIODO2 and submit,16166.0,7327.0
nteudo-importacao->conteudo-importacao/relatorios->conteudo-importacao/relatorios/composicao-estimativa->3114380081-visualização->3114380081-item- and submit,16238.0,6596.0
conteudo-importacao->conteudo-importacao/relatorios->conteudo-importacao/relatorios/enquadramento-documentos->573119890-executar->573119890-múltipla seleção,16445.0,6707.0
conteudo-importacao->conteudo-importacao/relatorios->conteudo-importacao/relatorios/enquadramento-documentos->573119890-executar->573119890-agendar,19443.0,9909.0
nteudo-importacao->conteudo-importacao/relatorios->conteudo-importacao/relatorios/enquadramento-documentos->573119890-executar->573119890-input-PERIODO-573119890-input-PERIODO2 and submit,16327.0,6559.0
nteudo-importacao->conteudo-importacao/relatorios->conteudo-importacao/relatorios/enquadramento-documentos->573119890-visualização->573119890-item- and submit,16288.0,6702.0
obrigacoes->obrigacoes/solicitacoes->3611409689-ir para todas as obrigações->3611409689-voltar às obrigações do módulo->3611409689-ir para todas as obrigações,19680.8,7532.0
obrigacoes->obrigacoes/obrigacoes-executadas->1557170498-abrir visualização->1557170498-expandir->1557170498-diminuir,17490.0,9188.0
conteudo-importacao->conteudo-importacao/informacoes-cadastrais->conteudo-importacao/informacoes-cadastrais/estrutura-mercadorias-fci->1084560218-eyeoutlined->456659030-mais operações->456659030-item-,19680.8,7465.0
conteudo-importacao->conteudo-importacao/informacoes-cadastrais->conteudo-importacao/informacoes-cadastrais/estrutura-mercadorias-fci->1084560218-eyeoutlined->456659030-novo->240213176-salvar,18360.0,8481.0
conteudo-importacao->conteudo-importacao/informacoes-cadastrais->conteudo-importacao/informacoes-cadastrais/estrutura-mercadorias-fci->1084560218-eyeoutlined->456659030-novo->240213176-voltar,13607.0,5533.0
nteudo-importacao->conteudo-importacao/informacoes-cadastrais->conteudo-importacao/informacoes-cadastrais/estrutura-mercadorias-fci->1084560218-eyeoutlined->456659030-novo->240213176-powerselect-mercCodigo-240213176-input-monetary-qtd-240213176-input-monetary-qtdReal-240213176-powerselect-umReal-240213176-powerselect-indOrigem and submit,19680.8,13536.8
conteudo-importacao->conteudo-importacao/transacoes->conteudo-importacao/transacoes/conteudo-importacao->2038373371-novo->1607739854-voltar->2038373371-novo,13407.0,5917.0
conteudo-importacao->conteudo-importacao/transacoes->conteudo-importacao/transacoes/conteudo-importacao->2038373371-novo->1607739854-voltar->2038373371-power-search-button,14415.0,6880.0
conteudo-importacao->conteudo-importacao/processos->conteudo-importacao/processos/gerar-ci->1869266243-abrir visualização->1869266243-expandir->1869266243-diminuir,18616.0,7445.0
conteudo-importacao->conteudo-importacao/processos->conteudo-importacao/processos/gerar-ci-estimativa->2161799073-executar->2161799073-múltipla seleção->2161799073-cancelar,17920.0,9808.0
conteudo-importacao->conteudo-importacao/processos->conteudo-importacao/processos/gerar-ci-estimativa->2161799073-abrir visualização->2161799073-expandir->2161799073-diminuir,18885.0,9085.0
conteudo-importacao->conteudo-importacao/processos->conteudo-importacao/processos/replicar-ci->3930886052-executar->3930886052-múltipla seleção->3930886052-cancelar,17870.0,8185.0
conteudo-importacao->conteudo-importacao/processos->conteudo-importacao/processos/apagar-ci->18966040-executar->18966040-múltipla seleção->18966040-cancelar,17848.0,8125.0
conteudo-importacao->conteudo-importacao/processos->conteudo-importacao/processos/apagar-ci->18966040-abrir visualização->18966040-expandir->18966040-diminuir,18826.0,9120.0
conteudo-importacao->conteudo-importacao/processos->conteudo-importacao/processos/exportar-fci->4013629049-executar->4013629049-múltipla seleção->4013629049-cancelar,17921.0,8173.0
conteudo-importacao->conteudo-importacao/relatorios->conteudo-importacao/relatorios/memoria-calculo->2164517070-executar->2164517070-múltipla seleção->2164517070-cancelar,17709.0,8139.0
conteudo-importacao->conteudo-importacao/relatorios->conteudo-importacao/relatorios/memoria-calculo->2164517070-abrir visualização->2164517070-expandir->2164517070-diminuir,18744.0,9065.0
conteudo-importacao->conteudo-importacao/relatorios->conteudo-importacao/relatorios/composicao->2832538547-executar->2832538547-múltipla seleção->2832538547-cancelar,17740.0,8144.0
conteudo-importacao->conteudo-importacao/relatorios->conteudo-importacao/relatorios/composicao-estimativa->3114380081-executar->3114380081-múltipla seleção->3114380081-cancelar,17760.0,8139.0
conteudo-importacao->conteudo-importacao/relatorios->conteudo-importacao/relatorios/enquadramento-documentos->573119890-executar->573119890-múltipla seleção->573119890-cancelar,17826.0,8086.0
