TEST-NAME,IDS-TIME(MS),IDUBS-TIME(MS)
,14025,12823
tce-logo-button,13981,12766
collapse-menu-button,11771,11297
entity-button,12639,12035
scale-plus-button,12698,11486
scale-standard-button,12557,11916
scale-minus-button,12409,10825
layout-button,11284,11298
notification-button,12417,11356
profile-button,13493,12453
catalogo de produtos,12749,12110
termo de referencia,12367,12139
cadastros e consultas,11593,10664
auditoria,12258,11132
alertas,13299,11810
administracao,12005,11304
seguranca,12444,11096
obras,12768,10892
2147483695-3 nov,s) no ultimo ,s) no ultimo 
2147483695-5 nov,s) no ultimo ,s) no ultimo 
2147483695-2 nov,s) no ultimo ,s) no ultimo 
2147483695-10 nov,s) no ultimo ,s) no ultimo 
2147483695-15 nov,s) no ultimo ,s) no ultimo 
2147483695-exibir todos os alertas...,11444,10969
2147483695-visualizar,12554,11534
entity-button->2147483695-cancelar,15124,14512
profile-button->recarregar-permissoes-button,15525,14372
profile-button->configuracoes-button,13580,13235
profile-button->sobre-button,13642,12559
catalogo de produtos->4245688225-pi pi-search,13766,11623
catalogo de produtos->4245688225-filtros,13452,12236
catalogo de produtos->4245688225-pi pi-times,13479,13033
termo de referencia->secoes,13901,12877
termo de referencia->gerenciamento de termos,13901,13130
cadastros e consultas->licitacao,17048,16175
cadastros e consultas->adesao/carona,13953,14083
cadastros e consultas->dispensa,12792,12157
cadastros e consultas->inexigibilidade,13976,12382
cadastros e consultas->contrato/aditivo,16093,14609
cadastros e consultas->comissao,13979,12675
cadastros e consultas->requisicoes de modificacao,14135,13550
cadastros e consultas->consultar processos,18210,16081
auditoria->alertas dafo,13404,13120
auditoria->analisar processos,12996,12911
auditoria->secoes checklist,13805,13004
auditoria->checklist de verificacao,14047,13240
auditoria->analise automatica,13944,12814
auditoria->historico processos,13856,13266
auditoria->analise de editais,14008,12078
auditoria->monitoramento atos diario oficial,13835,12860
auditoria->mapeamento de atos com licitacoes,14224,13141
alertas->1537469311-pi pi-search,13271,12256
alertas->1537469311-filtros,13325,12812
alertas->1537469311-detalhes do processo,17748,16175
alertas->1537469311-visualizar alerta,14196,12632
alertas->1537469311-arquivar alerta,13877,12361
alertas->1537469311-pi pi-times,14129,12732
administracao->elementos de despesa,13441,13657
administracao->falhas,14192,12801
administracao->feriados,13084,13083
administracao->fontes de recurso,14112,13171
administracao->formas de licitacao,13787,13623
administracao->formas de publicacao,14261,12945
administracao->fundamentacao legal,13738,12521
administracao->licitantes,13918,13021
administracao->modalidades da licitacao,13945,13003
administracao->criterios de julgamento,12929,13199
administracao->gerador de links,13645,12300
administracao->variaveis de controle,13868,12443
administracao->parametrizacao dos arquivos,13762,12659
administracao->entidade externa,14336,13279
administracao->responsavel ente,14391,12183
seguranca->grupos,13509,13135
seguranca->usuarios,13714,13558
seguranca->auditores atribuidores,14333,12477
seguranca->funcoes de risco,15484,14161
seguranca->configuracoes,13912,12983
obras->medicao,14203,12943
termo de referencia->secoes->2718408923-pi pi-search,16587,14332
termo de referencia->secoes->2718408923-pi pi-filter-slash,15442,13107
termo de referencia->secoes->2718408923-filtros,15970,12832
termo de referencia->secoes->2718408923-novo,14510,12517
termo de referencia->secoes->2718408923-pi pi-pencil,14327,12522
termo de referencia->secoes->2718408923-pi pi-trash,15539,12065
termo de referencia->secoes->2718408923-pi pi-times,15275,12878
termo de referencia->gerenciamento de termos->1834015054-pi pi-search,16096,12709
termo de referencia->gerenciamento de termos->1834015054-filtros,15391,12574
termo de referencia->gerenciamento de termos->1834015054-novo,14462,12712
termo de referencia->gerenciamento de termos->1834015054-exportar dados,15697,12082
termo de referencia->gerenciamento de termos->1834015054-pi pi-times,14792,12813
cadastros e consultas->licitacao->1555221225-pi pi-search,21194,19946
cadastros e consultas->licitacao->1555221225-filtros,18235,16816
cadastros e consultas->licitacao->1555221225-nova licitacao,19309,16895
cadastros e consultas->licitacao->1555221225-pi pi-angle-right,18266,16586
cadastros e consultas->licitacao->1555221225-pi pi-sort-alt,18877,16079
cadastros e consultas->licitacao->1555221225-pi pi-times,17406,15688
cadastros e consultas->adesao/carona->1678432678-pi pi-search,15127,13391
cadastros e consultas->adesao/carona->1678432678-filtros,15389,12701
cadastros e consultas->adesao/carona->1678432678-novo,15301,12719
cadastros e consultas->adesao/carona->1678432678-exportar dados,15236,12108
cadastros e consultas->adesao/carona->1678432678-entidade de origem,14820,12758
cadastros e consultas->adesao/carona->1678432678-numero do processo administrativo,14970,12259
cadastros e consultas->adesao/carona->1678432678-valor,15554,12281
cadastros e consultas->adesao/carona->1678432678-objeto,14955,12736
cadastros e consultas->adesao/carona->1678432678-pi pi-ellipsis-v,14985,12274
cadastros e consultas->adesao/carona->1678432678-ver mais,15305,12344
cadastros e consultas->adesao/carona->1678432678-pi pi-times,15438,12811
cadastros e consultas->dispensa->2643273457-pi pi-search,14860,12978
cadastros e consultas->dispensa->2643273457-filtros,14926,12186
cadastros e consultas->dispensa->2643273457-novo,15126,12725
cadastros e consultas->dispensa->2643273457-exportar dados,15301,12466
cadastros e consultas->dispensa->2643273457-numero do processo,15283,11824
cadastros e consultas->dispensa->2643273457-responsavel,14967,12632
cadastros e consultas->dispensa->2643273457-objeto,15345,12808
cadastros e consultas->dispensa->2643273457-data de ratificacao,14921,12652
cadastros e consultas->dispensa->2643273457-valor,14870,12729
cadastros e consultas->dispensa->2643273457-pi pi-ellipsis-v,14854,12049
cadastros e consultas->dispensa->2643273457-pi pi-times,14738,12673
cadastros e consultas->inexigibilidade->3253598109-pi pi-search,15612,12768
cadastros e consultas->inexigibilidade->3253598109-filtros,15085,12452
cadastros e consultas->inexigibilidade->3253598109-novo,15050,12623
cadastros e consultas->inexigibilidade->3253598109-exportar dados,15688,12636
cadastros e consultas->inexigibilidade->3253598109-numero do processo,15093,11544
cadastros e consultas->inexigibilidade->3253598109-responsavel pela ratificacao,15127,12561
cadastros e consultas->inexigibilidade->3253598109-objeto,15308,12488
cadastros e consultas->inexigibilidade->3253598109-data da assinatura,14927,12626
cadastros e consultas->inexigibilidade->3253598109-valor,15159,12907
cadastros e consultas->inexigibilidade->3253598109-pi pi-ellipsis-v,15426,12465
cadastros e consultas->inexigibilidade->3253598109-pi pi-times,16579,13795
cadastros e consultas->contrato/aditivo->1791441076-pi pi-search,16908,14885
cadastros e consultas->contrato/aditivo->1791441076-filtros,16352,14833
cadastros e consultas->contrato/aditivo->1791441076-novo,17090,14441
cadastros e consultas->contrato/aditivo->1791441076-exportar dados,17206,14561
cadastros e consultas->contrato/aditivo->1791441076-numero do contrato,16807,13949
cadastros e consultas->contrato/aditivo->1791441076-licitante,17035,14467
cadastros e consultas->contrato/aditivo->1791441076-objeto,17063,14305
cadastros e consultas->contrato/aditivo->1791441076-modalidade,17115,15167
cadastros e consultas->contrato/aditivo->1791441076-valor,16408,14614
cadastros e consultas->contrato/aditivo->1791441076-forma contrato,17386,14687
cadastros e consultas->contrato/aditivo->1791441076-entidade externa,17276,14491
cadastros e consultas->contrato/aditivo->1791441076-pi pi-ellipsis-v,15633,14455
cadastros e consultas->contrato/aditivo->1791441076-pi pi-times,16489,13563
cadastros e consultas->comissao->1752699694-pi pi-search,15426,13020
cadastros e consultas->comissao->1752699694-filtros,15065,12031
cadastros e consultas->comissao->1752699694-novo,14748,13123
cadastros e consultas->comissao->1752699694-pi pi-times,14829,12596
cadastros e consultas->requisicoes de modificacao->1906747741-pi pi-search,15461,13153
cadastros e consultas->requisicoes de modificacao->1906747741-filtros,15484,13538
cadastros e consultas->requisicoes de modificacao->1906747741-pi pi-user-edit,15499,12096
cadastros e consultas->requisicoes de modificacao->1906747741-pi pi-times,14824,11903
cadastros e consultas->consultar processos->1353241976-pi pi-search,19254,16532
cadastros e consultas->consultar processos->1353241976-filtros,18089,17047
cadastros e consultas->consultar processos->1353241976-nova licitacao,19479,16625
cadastros e consultas->consultar processos->1353241976-exportar dados,17979,16693
cadastros e consultas->consultar processos->1353241976-numero,19104,16573
cadastros e consultas->consultar processos->1353241976-entidade/orgao,18853,15951
cadastros e consultas->consultar processos->1353241976-objeto,19717,16212
cadastros e consultas->consultar processos->1353241976-data de abertura,19838,16978
cadastros e consultas->consultar processos->1353241976-modalidade,19427,16294
cadastros e consultas->consultar processos->1353241976-valor estimado,19722,16834
cadastros e consultas->consultar processos->1353241976-pi pi-ellipsis-v,19534,16565
cadastros e consultas->consultar processos->1353241976-pi pi-times,19176,16618
auditoria->alertas dafo->775637628-pi pi-search,15424,14023
auditoria->alertas dafo->775637628-filtros,15126,12864
auditoria->alertas dafo->775637628-pi pi-eye,15275,13331
auditoria->alertas dafo->775637628-pi pi-times,14816,13343
auditoria->analisar processos->3240378834-pi pi-search,15664,12157
auditoria->analisar processos->3240378834-filtros,15140,12560
auditoria->analisar processos->3240378834-pi pi-angle-down,15540,13127
auditoria->analisar processos->3240378834-pi pi-angle-right,15600,13009
auditoria->analisar processos->3240378834-pi pi-sort-alt,16035,13058
auditoria->analisar processos->3240378834-pi pi-times,14663,13030
auditoria->secoes checklist->3479445712-pi pi-search,15540,13002
auditoria->secoes checklist->3479445712-filtros,15195,12993
auditoria->secoes checklist->3479445712-novo,19304,17212
auditoria->secoes checklist->3479445712-pi pi-pencil,15228,11919
auditoria->secoes checklist->3479445712-pi pi-trash,15261,12272
auditoria->secoes checklist->3479445712-pi pi-times,14808,12524
auditoria->checklist de verificacao->3355604276-pi pi-search,16379,14015
auditoria->checklist de verificacao->3355604276-filtros,14793,12651
auditoria->checklist de verificacao->3355604276-novo,15340,12974
auditoria->checklist de verificacao->3355604276-pi pi-pencil,14971,13203
auditoria->checklist de verificacao->3355604276-pi pi-trash,15117,12616
auditoria->checklist de verificacao->3355604276-pi pi-times,15147,12929
auditoria->analise automatica->74772744-pi pi-search,14080,12494
auditoria->analise automatica->74772744-filtros,15388,12584
auditoria->analise automatica->74772744-novo,15247,12317
auditoria->analise automatica->74772744-pi pi-pencil,14612,12940
auditoria->analise automatica->74772744-pi pi-trash,15430,13051
auditoria->analise automatica->74772744-pi pi-times,14823,13119
auditoria->historico processos->1628962350-pi pi-search,15273,12410
auditoria->historico processos->1628962350-pi pi-filter-slash,15010,11998
auditoria->historico processos->1628962350-filtros,14771,12612
auditoria->historico processos->1628962350-pi pi-eye,15339,11873
auditoria->historico processos->1628962350-pi pi-times,15197,12562
auditoria->analise de editais->4100354799-pi pi-search,15395,12918
auditoria->analise de editais->4100354799-filtros,15654,13114
auditoria->analise de editais->4100354799-novo edital,15573,12720
auditoria->analise de editais->4100354799-pi pi-times,15176,11413
auditoria->monitoramento atos diario oficial->3575258333-pi pi-search,14851,12673
auditoria->monitoramento atos diario oficial->3575258333-filtros,14937,12355
auditoria->monitoramento atos diario oficial->3575258333-pi pi-times,15239,12540
auditoria->mapeamento de atos com licitacoes->2601858932-pi pi-search,14931,12471
auditoria->mapeamento de atos com licitacoes->2601858932-filtros,15110,13076
auditoria->mapeamento de atos com licitacoes->2601858932-pi pi-ellipsis-v,14982,12282
auditoria->mapeamento de atos com licitacoes->2601858932-pi pi-times,15286,12299
alertas->1537469311-detalhes do processo->licitacao,23348,20819
alertas->1537469311-detalhes do processo->adesao/carona,18704,16204
alertas->1537469311-detalhes do processo->dispensa,18797,16280
alertas->1537469311-detalhes do processo->inexigibilidade,20552,17008
alertas->1537469311-detalhes do processo->contrato/aditivo,20998,19093
alertas->1537469311-detalhes do processo->comissao,18711,17161
alertas->1537469311-detalhes do processo->requisicoes de modificacao,19647,16350
alertas->1537469311-detalhes do processo->consultar processos,22784,21249
alertas->1537469311-detalhes do processo->1700861693-pi pi-search,17937,16223
alertas->1537469311-detalhes do processo->1700861693-filtros,19351,15713
alertas->1537469311-detalhes do processo->1700861693-nova licitacao,18153,16100
alertas->1537469311-detalhes do processo->1700861693-pi pi-angle-right,19452,17152
alertas->1537469311-detalhes do processo->1700861693-pi pi-sort-alt,19024,16616
alertas->1537469311-detalhes do processo->1700861693-preparatoria,18552,16323
alertas->1537469311-detalhes do processo->1700861693-divulgacao e publicacao da licitacao,19434,15787
alertas->1537469311-detalhes do processo->1700861693-proxima fase,19317,16750
alertas->1537469311-detalhes do processo->1700861693-suspender licitacao,17058,16287
alertas->1537469311-detalhes do processo->1700861693-finalizar licitacao,18927,16609
alertas->1537469311-detalhes do processo->1700861693-excluir,19355,16974
alertas->1537469311-detalhes do processo->1700861693-pi pi-list,19564,16893
alertas->1537469311-detalhes do processo->1700861693-visualizar,18729,16344
alertas->1537469311-detalhes do processo->1700861693-download,19152,16798
alertas->1537469311-detalhes do processo->1700861693-pi pi-times,19944,17776
alertas->1537469311-visualizar alerta->3585023761-visualizar arquivos,15945,12848
alertas->1537469311-visualizar alerta->3585023761-voltar,14714,12956
alertas->1537469311-visualizar alerta->3585023761-arquivar,14777,12815
alertas->1537469311-visualizar alerta->3585023761-responder,15684,12566
alertas->1537469311-arquivar alerta->1537469311-cancelar,15015,14136
alertas->1537469311-arquivar alerta->1537469311-arquivar,15289,14181
administracao->falhas->1380608115-pi pi-search,15117,12506
administracao->falhas->1380608115-filtros,15402,12558
administracao->falhas->1380608115-novo,14799,12083
administracao->falhas->1380608115-exportar dados,15367,12811
administracao->falhas->1380608115-pi pi-pencil,14474,13082
administracao->falhas->1380608115-pi pi-trash,15306,12339
administracao->falhas->1380608115-pi pi-times,13864,13061
administracao->feriados->4034562079-pi pi-search,15201,13193
administracao->feriados->4034562079-filtros,14155,12606
administracao->feriados->4034562079-novo,14799,12468
administracao->feriados->4034562079-exportar dados,15218,12878
administracao->feriados->4034562079-pi pi-pencil,15063,12724
administracao->feriados->4034562079-pi pi-trash,14448,12789
administracao->feriados->4034562079-pi pi-times,14865,11840
administracao->fontes de recurso->2906815771-pi pi-search,14837,11865
administracao->fontes de recurso->2906815771-filtros,15068,12242
administracao->fontes de recurso->2906815771-novo,15082,11931
administracao->fontes de recurso->2906815771-exportar dados,15121,11930
administracao->fontes de recurso->2906815771-pi pi-pencil,15442,12203
administracao->fontes de recurso->2906815771-pi pi-trash,15070,12732
administracao->fontes de recurso->2906815771-pi pi-times,15584,12396
administracao->formas de licitacao->2830712122-pi pi-search,15205,12941
administracao->formas de licitacao->2830712122-filtros,15542,12604
administracao->formas de licitacao->2830712122-novo,19627,17236
administracao->formas de licitacao->2830712122-exportar dados,14540,12768
administracao->formas de licitacao->2830712122-pi pi-pencil,15264,11838
administracao->formas de licitacao->2830712122-pi pi-trash,14934,11768
administracao->formas de licitacao->2830712122-pi pi-times,15017,12480
administracao->formas de publicacao->1458627872-pi pi-search,15875,13074
administracao->formas de publicacao->1458627872-filtros,15178,12029
administracao->formas de publicacao->1458627872-novo,19746,17098
administracao->formas de publicacao->1458627872-exportar dados,15566,12405
administracao->formas de publicacao->1458627872-pi pi-pencil,15432,12359
administracao->formas de publicacao->1458627872-pi pi-trash,15269,12164
administracao->formas de publicacao->1458627872-pi pi-times,14083,12819
administracao->fundamentacao legal->275348607-pi pi-search,15212,12653
administracao->fundamentacao legal->275348607-filtros,14913,12353
administracao->fundamentacao legal->275348607-novo,15170,12944
administracao->fundamentacao legal->275348607-pi pi-pencil,14728,11478
administracao->fundamentacao legal->275348607-pi pi-trash,15320,11936
administracao->fundamentacao legal->275348607-pi pi-times,15092,12587
administracao->licitantes->3164945720-pi pi-search,13917,11689
administracao->licitantes->3164945720-filtros,15050,11948
administracao->licitantes->3164945720-novo,16297,13682
administracao->licitantes->3164945720-exportar dados,15038,12551
administracao->licitantes->3164945720-pi pi-list,15554,13115
administracao->licitantes->3164945720-pi pi-pencil,15233,12825
administracao->licitantes->3164945720-pi pi-trash,15644,13417
administracao->licitantes->3164945720-pi pi-times,14874,12687
administracao->modalidades da licitacao->2428299973-pi pi-search,15211,12218
administracao->modalidades da licitacao->2428299973-filtros,15475,12230
administracao->modalidades da licitacao->2428299973-novo,14875,12558
administracao->modalidades da licitacao->2428299973-exportar dados,14929,12730
administracao->modalidades da licitacao->2428299973-pi pi-pencil,15430,12895
administracao->modalidades da licitacao->2428299973-pi pi-trash,15094,12931
administracao->modalidades da licitacao->2428299973-pi pi-times,14987,12272
administracao->criterios de julgamento->3946733471-pi pi-search,14079,12656
administracao->criterios de julgamento->3946733471-filtros,15057,12513
administracao->criterios de julgamento->3946733471-novo,15388,12667
administracao->criterios de julgamento->3946733471-exportar dados,14882,12078
administracao->criterios de julgamento->3946733471-pi pi-pencil,15985,12735
administracao->criterios de julgamento->3946733471-pi pi-trash,14465,12603
administracao->criterios de julgamento->3946733471-pi pi-times,14761,12397
administracao->gerador de links->1437041263-pi pi-search,15627,12747
administracao->gerador de links->1437041263-filtros,15409,13565
administracao->gerador de links->1437041263-novo,14562,12984
administracao->gerador de links->1437041263-pi pi-times,14162,12741
administracao->variaveis de controle->3787439616-pi pi-search,14500,12672
administracao->variaveis de controle->3787439616-filtros,15112,12804
administracao->variaveis de controle->3787439616-pi pi-times,15042,12291
administracao->parametrizacao dos arquivos->3706103062-pi pi-search,15612,12305
administracao->parametrizacao dos arquivos->3706103062-filtros,14958,11852
administracao->parametrizacao dos arquivos->3706103062-pi pi-list,16006,12868
administracao->parametrizacao dos arquivos->3706103062-pi pi-pencil,15456,12901
administracao->parametrizacao dos arquivos->3706103062-pi pi-times,15255,11819
administracao->entidade externa->3919870791-pi pi-search,15302,12671
administracao->entidade externa->3919870791-filtros,15683,12928
administracao->entidade externa->3919870791-novo,15432,11987
administracao->entidade externa->3919870791-exportar dados,15395,12737
administracao->entidade externa->3919870791-pi pi-pencil,15075,13022
administracao->entidade externa->3919870791-pi pi-trash,15474,12981
administracao->entidade externa->3919870791-pi pi-times,15146,12068
administracao->responsavel ente->1130073086-pi pi-search,15184,12270
administracao->responsavel ente->1130073086-filtros,15086,12687
administracao->responsavel ente->1130073086-novo,15015,12691
administracao->responsavel ente->1130073086-pi pi-pencil,15325,12949
administracao->responsavel ente->1130073086-pi pi-trash,15642,11942
administracao->responsavel ente->1130073086-pi pi-times,14933,12287
seguranca->grupos->1745718313-pi pi-search,14918,12476
seguranca->grupos->1745718313-filtros,15034,12502
seguranca->grupos->1745718313-novo,15210,12357
seguranca->grupos->1745718313-permissoes,15132,13194
seguranca->grupos->1745718313-usuarios,14995,11917
seguranca->grupos->1745718313-pi pi-pencil,16328,14053
seguranca->grupos->1745718313-pi pi-trash,15645,12976
seguranca->grupos->1745718313-pi pi-times,14690,12035
seguranca->usuarios->4277602509-pi pi-search,14723,11879
seguranca->usuarios->4277602509-filtros,15034,12692
seguranca->usuarios->4277602509-grupos,15454,12672
seguranca->usuarios->4277602509-pi pi-pencil,15478,12309
seguranca->usuarios->4277602509-pi pi-times,14897,11835
seguranca->auditores atribuidores->2252475832-pi pi-search,15057,13151
seguranca->auditores atribuidores->2252475832-filtros,15355,12522
seguranca->auditores atribuidores->2252475832-novo,14105,12513
seguranca->auditores atribuidores->2252475832-pi pi-times,15162,12332
seguranca->funcoes de risco->3861932206-pi pi-search,15345,12698
seguranca->funcoes de risco->3861932206-filtros,15131,12631
seguranca->funcoes de risco->3861932206-novo,15057,13319
seguranca->funcoes de risco->3861932206-pi pi-eye,15535,12311
seguranca->funcoes de risco->3861932206-pi pi-pencil,15078,12614
seguranca->funcoes de risco->3861932206-pi pi-trash,15101,12599
seguranca->funcoes de risco->3861932206-pi pi-times,14868,12453
seguranca->configuracoes->2791227887-novo,15251,12768
seguranca->configuracoes->2791227887-voltar,15949,12536
seguranca->configuracoes->2791227887-salvar,15543,12674
obras->medicao->391958567-pi pi-chevron-right,14936,12950
obras->medicao->391958567-pi pi-times,15259,12229
obras->medicao->391958567-pi pi-search,15239,13224
obras->medicao->391958567-filtros,15345,12493
obras->medicao->391958567-pi pi-ellipsis-v,15351,13031
obras->medicao->391958567-ver mais,15275,13347
termo de referencia->secoes->2718408923-novo->171684078-voltar,18450,14151
termo de referencia->secoes->2718408923-novo->171684078-salvar,17149,13638
termo de referencia->secoes->2718408923-pi pi-pencil->556775477-voltar,16769,12957
termo de referencia->secoes->2718408923-pi pi-pencil->556775477-salvar,16871,12881
termo de referencia->gerenciamento de termos->1834015054-novo->942852187-exportar,19190,14945
termo de referencia->gerenciamento de termos->1834015054-novo->942852187-voltar,17255,13176
termo de referencia->gerenciamento de termos->1834015054-exportar dados->1834015054-csv,16701,14178
termo de referencia->gerenciamento de termos->1834015054-exportar dados->1834015054-xls,16775,13898
termo de referencia->gerenciamento de termos->1834015054-exportar dados->1834015054-pdf,17137,14730
cadastros e consultas->licitacao->1555221225-nova licitacao->98475936-voltar,19939,12259
cadastros e consultas->licitacao->1555221225-nova licitacao->98475936-pi pi-search,19827,13156
cadastros e consultas->licitacao->1555221225-nova licitacao->98475936-salvar,19562,13413
cadastros e consultas->licitacao->1555221225-pi pi-angle-right->1555221225-pi pi-angle-down,20030,18071
cadastros e consultas->licitacao->1555221225-pi pi-sort-alt->1555221225-aplicar,19758,17909
cadastros e consultas->comissao->1752699694-novo->3756309115-voltar,17145,12565
cadastros e consultas->comissao->1752699694-novo->3756309115-salvar,17181,13028
cadastros e consultas->requisicoes de modificacao->1906747741-pi pi-user-edit->alertas dafo,17124,13344
cadastros e consultas->requisicoes de modificacao->1906747741-pi pi-user-edit->analisar processos,17446,12856
cadastros e consultas->requisicoes de modificacao->1906747741-pi pi-user-edit->secoes checklist,17406,13067
cadastros e consultas->requisicoes de modificacao->1906747741-pi pi-user-edit->checklist de verificacao,17261,13081
cadastros e consultas->requisicoes de modificacao->1906747741-pi pi-user-edit->analise automatica,17745,12467
cadastros e consultas->requisicoes de modificacao->1906747741-pi pi-user-edit->historico processos,17406,13295
cadastros e consultas->requisicoes de modificacao->1906747741-pi pi-user-edit->analise de editais,17404,13028
cadastros e consultas->requisicoes de modificacao->1906747741-pi pi-user-edit->monitoramento atos diario oficial,17292,12939
cadastros e consultas->requisicoes de modificacao->1906747741-pi pi-user-edit->mapeamento de atos com licitacoes,17707,12748
auditoria->alertas dafo->775637628-pi pi-eye->775637628-cancelar,17423,14959
auditoria->alertas dafo->775637628-pi pi-eye->775637628-rejeitar alerta,16766,14396
auditoria->alertas dafo->775637628-pi pi-eye->775637628-enviar para jurisdicionado,17704,14828
auditoria->analisar processos->3240378834-pi pi-sort-alt->3240378834-aplicar,17174,14625
auditoria->secoes checklist->3479445712-novo->803856921-voltar,21522,17644
auditoria->secoes checklist->3479445712-novo->803856921-salvar,23095,17137
auditoria->secoes checklist->3479445712-pi pi-pencil->3227589920-voltar,17172,13308
auditoria->secoes checklist->3479445712-pi pi-pencil->3227589920-salvar,16970,13343
auditoria->analise automatica->74772744-pi pi-pencil->3330963944-voltar,17119,13591
auditoria->analise automatica->74772744-pi pi-pencil->3330963944-salvar,17388,12481
auditoria->historico processos->1628962350-pi pi-eye->1628962350-fechar,16969,14150
auditoria->analise de editais->4100354799-novo edital->4100354799-voltar,17447,14512
auditoria->analise de editais->4100354799-novo edital->4100354799-analisar,17620,13969
alertas->1537469311-visualizar alerta->3585023761-arquivar->3585023761-cancelar,17394,14593
administracao->falhas->1380608115-pi pi-pencil->3165962653-voltar,17071,13063
administracao->falhas->1380608115-pi pi-pencil->3165962653-salvar,17335,13200
administracao->feriados->4034562079-pi pi-pencil->249978481-voltar,17242,13078
administracao->feriados->4034562079-pi pi-pencil->249978481-salvar,17288,13076
administracao->fontes de recurso->2906815771-pi pi-pencil->1144828917-voltar,16428,12998
administracao->fontes de recurso->2906815771-pi pi-pencil->1144828917-salvar,16935,13327
administracao->formas de licitacao->2830712122-novo->1615329263-voltar,21780,17743
administracao->formas de licitacao->2830712122-novo->1615329263-salvar,23826,17247
administracao->formas de licitacao->2830712122-exportar dados->2830712122-csv,17636,15030
administracao->formas de licitacao->2830712122-exportar dados->2830712122-xls,17039,14850
administracao->formas de licitacao->2830712122-exportar dados->2830712122-pdf,17012,14114
administracao->formas de publicacao->1458627872-novo->2117816265-voltar,22909,18901
administracao->formas de publicacao->1458627872-novo->2117816265-salvar,23570,17518
administracao->formas de publicacao->1458627872-exportar dados->1458627872-csv,17227,14340
administracao->formas de publicacao->1458627872-exportar dados->1458627872-xls,16745,13380
administracao->formas de publicacao->1458627872-exportar dados->1458627872-pdf,16720,14334
administracao->formas de publicacao->1458627872-pi pi-pencil->3010823888-voltar,16645,13667
administracao->formas de publicacao->1458627872-pi pi-pencil->3010823888-salvar,16903,12916
administracao->licitantes->3164945720-pi pi-pencil->1052880824-voltar,16676,12052
administracao->licitantes->3164945720-pi pi-pencil->1052880824-salvar,17335,12725
administracao->modalidades da licitacao->2428299973-pi pi-pencil->266598411-voltar,16106,13144
administracao->modalidades da licitacao->2428299973-pi pi-pencil->266598411-salvar,17107,12941
administracao->criterios de julgamento->3946733471-pi pi-pencil->3606632177-voltar,16821,13017
administracao->criterios de julgamento->3946733471-pi pi-pencil->3606632177-salvar,16858,13228
administracao->gerador de links->1437041263-novo->2968366042-voltar,16615,13262
administracao->gerador de links->1437041263-novo->2968366042-salvar,16688,12403
administracao->parametrizacao dos arquivos->3706103062-pi pi-pencil->1098338586-voltar,16671,12781
administracao->entidade externa->3919870791-novo->3705829890-voltar,17280,13258
administracao->entidade externa->3919870791-novo->3705829890-salvar,17771,13074
administracao->entidade externa->3919870791-exportar dados->3919870791-csv,17989,14969
administracao->entidade externa->3919870791-exportar dados->3919870791-xls,17798,15509
administracao->entidade externa->3919870791-exportar dados->3919870791-pdf,17341,14819
administracao->entidade externa->3919870791-pi pi-pencil->3319292489-voltar,17458,13410
administracao->entidade externa->3919870791-pi pi-pencil->3319292489-salvar,17752,12860
administracao->responsavel ente->1130073086-pi pi-pencil->2652145970-voltar,17378,13257
administracao->responsavel ente->1130073086-pi pi-pencil->2652145970-salvar,17653,13519
seguranca->grupos->1745718313-pi pi-pencil->1090080807-voltar,17860,13517
seguranca->grupos->1745718313-pi pi-pencil->1090080807-salvar,18141,13603
seguranca->usuarios->4277602509-pi pi-pencil->1750615299-voltar,17354,13409
seguranca->usuarios->4277602509-pi pi-pencil->1750615299-salvar,17750,13301
seguranca->auditores atribuidores->2252475832-novo->2252475832-cancelar,17911,14949
seguranca->funcoes de risco->3861932206-novo->461755643-voltar,17482,13337
seguranca->funcoes de risco->3861932206-novo->461755643-salvar,17662,13057
seguranca->funcoes de risco->3861932206-pi pi-pencil->2734677634-novo,17581,13156
seguranca->funcoes de risco->3861932206-pi pi-pencil->2734677634-voltar,17667,13283
seguranca->funcoes de risco->3861932206-pi pi-pencil->2734677634-salvar,17540,13261
seguranca->configuracoes->2791227887-novo->2791227887-pi pi-trash,18003,14835
obras->medicao->391958567-ver mais->391958567-ver menos,17756,15519
