STATE,IDS-OCCURRENCE,IDUBS-OCCURRENCE
root,207,29
index-navbar-toggle,2,2
index-navbar-brand,2,2
index-index,2,2
index-about,60,32
index-services,27,27
index-gallery,40,40
index-pricing,31,31
index-contact,30,29
index-img-1,2,2
index-img-2,2,2
index-img-3,2,2
index-events,2,2
index-terms,2,2
index-privacy,2,2
index-career,2,2
index-contact-us,2,2
index-text-1,2,2
index-text-2,2,2
index-text-3,2,2
index-text-4,2,2
index-text-5,2,2
index-text-6,2,2
index-facebook,2,2
index-twitter,2,2
index-linkedin,2,2
index-pinterest,2,2
index-google,2,2
index-angle-up,2,2
about-navbar-collapse,1,1
about-navbar-brand,1,1
about-home,29,29
about-about,1,1
about-service,1,1
about-gallery,1,1
about-pricing,1,1
about-contact,1,1
about-read-more,1,1
about-collapse-1,1,1
about-contact-2,1,1
about-contact-3,1,1
about-contact-4,1,1
about-text-1,1,1
about-text-2,1,1
about-text-3,1,1
about-text-4,1,1
about-text-5,1,1
about-text-6,1,1
about-events,1,1
about-terms,1,1
about-privacy,1,1
about-career,1,1
about-contact-us,1,1
about-facebook,1,1
about-twitter,1,1
about-linkedin,1,1
about-pinterest,1,1
about-google,1,1
about-angle-up,1,1
services-navbar-toggle,1,1
services-navbar-brand,1,1
services-index,1,1
services-about,1,1
services-services,1,1
services-gallery,1,1
services-pricing,1,1
services-contact,1,1
services-events,1,1
services-terms,1,1
services-privacy,1,1
services-career,1,1
services-contact-us,1,1
services-text-1,1,1
services-text-2,1,1
services-text-3,1,1
services-text-4,1,1
services-text-5,1,1
services-text-6,1,1
services-facebook,1,1
services-twitter,1,1
services-linkedin,1,1
services-pinterest,1,1
services-google,1,1
services-angle-up,1,1
gallery-navbar-collapse,1,1
gallery-navbar-brand,1,1
gallery-home,1,1
gallery-about,1,1
gallery-service,1,1
gallery-gallery,1,1
gallery-pricing,1,1
gallery-contact,1,1
gallery-all,1,1
gallery-continental,1,1
gallery-asian-food,1,1
gallery-italian-food,1,1
gallery-works-1,1,1
gallery-works-2,1,1
gallery-works-3,1,1
gallery-works-4,1,1
gallery-works-5,1,1
gallery-works-6,1,1
gallery-works-7,1,1
gallery-works-8,1,1
gallery-events,1,1
gallery-terms,1,1
gallery-privacy,1,1
gallery-career,1,1
gallery-contact-us,1,1
gallery-text-1,1,1
gallery-text-2,1,1
gallery-text-3,1,1
gallery-text-4,1,1
gallery-text-5,1,1
gallery-text-6,1,1
gallery-WebThemez,1,1
gallery-facebook,1,1
gallery-twitter,1,1
gallery-linkedin,1,1
gallery-pinterest,1,1
gallery-google,1,1
gallery-angle-up,1,1
pricing-navbar-collapse,1,1
pricing-navbar-brand,1,1
pricing-home,1,1
pricing-about,1,1
pricing-service,1,1
pricing-gallery,1,1
pricing-pricing,1,1
pricing-contact,1,1
pricing-get-now-1,1,1
pricing-get-now-2,1,1
pricing-get-now-3,1,1
pricing-get-now-4,1,1
pricing-events,1,1
pricing-terms,1,1
pricing-privacy,1,1
pricing-career,1,1
pricing-contact-us,1,1
pricing-text-1,1,1
pricing-text-2,1,1
pricing-text-3,1,1
pricing-text-4,1,1
pricing-text-5,1,1
pricing-text-6,1,1
pricing-facebook,1,1
pricing-twitter,1,1
pricing-linkedin,1,1
pricing-pinterest,1,1
pricing-google,1,1
pricing-angle-up,1,1
contact-navbar-collapse,1,1
contact-navbar-brand,1,1
contact-home,1,1
contact-about,1,1
contact-services,1,1
contact-gallery,1,1
contact-pricing,1,1
contact-contact,1,1
close-button,1,1
contact-events,1,1
contact-terms,1,1
contact-privacy,1,1
contact-career,1,1
contact-contact-us,1,1
contact-text-1,1,1
contact-text-2,1,1
contact-text-3,1,1
contact-text-4,1,1
contact-text-5,1,1
contact-text-6,1,1
contact-WebThemez,1,1
contact-facebook,1,1
contact-twitter,1,1
contact-linkedin,1,1
contact-pinterest,1,1
contact-google,1,1
contact-angle-up,1,1
name-input-email-input-message-textarea-submit-input,0,1
