TEST-NAME,IDS-TIME(MS),IDUBS-TIME(MS)
,14210,9205
home,11056,10578
parametros-gerais,6726,6366
lancamentos,6585,6252
operacoes,6519,6370
obrigacoes,6848,6412
relatorios,6546,6359
processos,6504,6366
processos-customizados,7759,7587
downloads,7860,7577
collapse-menu,6606,6431
modules-menu,7641,7389
parametros-gerais->parametros-gerais/codigos-receita-agenda-recolhimento,14203,11464
lancamentos->lancamentos/lancamento-debitos-analiticos,9880,8234
lancamentos->lancamentos/lancamento-debitos-consolidados,8451,7923
lancamentos->lancamentos/lancamento-creditos,9650,7871
operacoes->operacoes/conciliacao-pagamento-darf,8352,7844
operacoes->operacoes/importacao-debitos-creditos,8893,7912
obrigacoes->obrigacoes/configuracao,12154,12059
obrigacoes->obrigacoes/solicitacoes,12232,12154
obrigacoes->obrigacoes/obrigacoes-executadas,12327,12130
obrigacoes->obrigacoes/periodicidade,12253,11956
obrigacoes->obrigacoes/configuracao-estabelecimento,12256,12149
relatorios->relatorios/agenda-recolhimento,13376,12236
relatorios->relatorios/pagamento-multa-juros,12388,12178
relatorios->relatorios/lancamentos-de-debitos-analiticos-por-sistema-de-origem,12476,12133
relatorios->relatorios/lancamentos-de-debitos-consolidados,12218,11783
relatorios->relatorios/lancamentos-de-creditos,12288,11778
relatorios->relatorios/lancamentos-de-creditos-do-tipo-pagamento-em-atraso,12417,12014
processos->processos/consolidacao-lancamentos-de-debitos,12216,12239
downloads->421757132-power-search-button,10773,6264
downloads->421757132-download,11019,8441
downloads->421757132-detalhes,8973,6382
downloads->421757132-excluir,9010,6391
lancamentos->lancamentos/lancamento-debitos-analiticos->741543100-novo,14841,10507
lancamentos->lancamentos/lancamento-debitos-analiticos->741543100-power-search-button,10437,6795
lancamentos->lancamentos/lancamento-debitos-consolidados->144024936-agenda,9406,5818
lancamentos->lancamentos/lancamento-debitos-consolidados->144024936-power-search-button,9308,6752
lancamentos->lancamentos/lancamento-creditos->3993712770-novo,9498,7011
lancamentos->lancamentos/lancamento-creditos->3993712770-power-search-button,10329,6356
operacoes->operacoes/conciliacao-pagamento-darf->92414607-power-search-button,10264,6828
operacoes->operacoes/importacao-debitos-creditos->1315386227-pesquisar,12652,8906
eracoes->operacoes/importacao-debitos-creditos->1315386227-powerselect-estCodigo-1315386227-powerselect-origDebCred-1315386227-powerselect-codReceita-1315386227-powerselect-grisEstab-1315386227-powerselect-indManAuto and submit,16431,15229
obrigacoes->obrigacoes/configuracao->678895530-power-search-button,15048,4885
obrigacoes->obrigacoes/configuracao->678895530-gerenciar labels,14603,6562
obrigacoes->obrigacoes/configuracao->678895530-visualizar parâmetros,17993,6660
obrigacoes->obrigacoes/configuracao->678895530-visualizar/editar,18040,6663
obrigacoes->obrigacoes/solicitacoes->3223976761-ir para todas as obrigações,14662,6319
obrigacoes->obrigacoes/solicitacoes->3223976761-ajuda,13641,5393
obrigacoes->obrigacoes/solicitacoes->3223976761-nova solicitação,14683,4982
obrigacoes->obrigacoes/solicitacoes->3223976761-agendamentos,18084,4865
obrigacoes->obrigacoes/solicitacoes->3223976761-atualizar,13668,5084
obrigacoes->obrigacoes/solicitacoes->3223976761-gerar obrigação,14779,5010
obrigacoes->obrigacoes/solicitacoes->3223976761-ajustar parâmetros da geração,17985,5057
obrigacoes->obrigacoes/solicitacoes->3223976761-visualizar resultado da geração,14604,4799
obrigacoes->obrigacoes/solicitacoes->3223976761-protocolo transmissão,18091,4975
obrigacoes->obrigacoes/solicitacoes->3223976761-excluir geração,14554,5081
obrigacoes->obrigacoes/obrigacoes-executadas->3371290466-power-search-button,13934,6081
obrigacoes->obrigacoes/obrigacoes-executadas->3371290466-visualização,14848,6451
obrigacoes->obrigacoes/obrigacoes-executadas->3371290466-abrir visualização,14625,6371
obrigacoes->obrigacoes/obrigacoes-executadas->3371290466-visualizar,15914,6381
obrigacoes->obrigacoes/periodicidade->2148651226-novo,14611,6175
obrigacoes->obrigacoes/periodicidade->2148651226-power-search-button,13636,6523
obrigacoes->obrigacoes/periodicidade->2148651226-editar,14614,6702
obrigacoes->obrigacoes/periodicidade->2148651226-excluir,14754,6305
obrigacoes->obrigacoes/configuracao-estabelecimento->829132674-novo,14665,6469
obrigacoes->obrigacoes/configuracao-estabelecimento->829132674-power-search-button,14681,6486
obrigacoes->obrigacoes/configuracao-estabelecimento->829132674-excluir,14711,6424
relatorios->relatorios/agenda-recolhimento->4010788594-executar,14627,6433
relatorios->relatorios/agenda-recolhimento->4010788594-agendamentos,18070,6603
relatorios->relatorios/agenda-recolhimento->4010788594-power-search-button,14727,6362
relatorios->relatorios/agenda-recolhimento->4010788594-visualização,14804,6292
relatorios->relatorios/pagamento-multa-juros->1436609750-executar,14711,7005
relatorios->relatorios/pagamento-multa-juros->1436609750-agendamentos,13514,6582
relatorios->relatorios/pagamento-multa-juros->1436609750-power-search-button,13586,6333
relatorios->relatorios/pagamento-multa-juros->1436609750-visualização,14791,6228
relatorios->relatorios/lancamentos-de-debitos-analiticos-por-sistema-de-origem->2549579271-executar,14893,6406
relatorios->relatorios/lancamentos-de-debitos-analiticos-por-sistema-de-origem->2549579271-agendamentos,18126,6539
relatorios->relatorios/lancamentos-de-debitos-analiticos-por-sistema-de-origem->2549579271-power-search-button,14806,6346
relatorios->relatorios/lancamentos-de-debitos-analiticos-por-sistema-de-origem->2549579271-visualização,14947,6480
relatorios->relatorios/lancamentos-de-debitos-consolidados->772074419-executar,14644,6489
relatorios->relatorios/lancamentos-de-debitos-consolidados->772074419-agendamentos,17867,6648
relatorios->relatorios/lancamentos-de-debitos-consolidados->772074419-power-search-button,14966,5229
relatorios->relatorios/lancamentos-de-debitos-consolidados->772074419-visualização,14638,6432
relatorios->relatorios/lancamentos-de-debitos-consolidados->772074419-regerar,14472,11494
relatorios->relatorios/lancamentos-de-debitos-consolidados->772074419-detalhes,14622,6417
relatorios->relatorios/lancamentos-de-debitos-consolidados->772074419-excluir,15030,6363
relatorios->relatorios/lancamentos-de-debitos-consolidados->772074419-abrir visualização,14711,6344
relatorios->relatorios/lancamentos-de-creditos->2580041027-executar,14892,6255
relatorios->relatorios/lancamentos-de-creditos->2580041027-agendamentos,18012,6654
relatorios->relatorios/lancamentos-de-creditos->2580041027-power-search-button,14699,6332
relatorios->relatorios/lancamentos-de-creditos->2580041027-visualização,14768,6475
relatorios->relatorios/lancamentos-de-creditos-do-tipo-pagamento-em-atraso->3415243707-executar,14760,6381
relatorios->relatorios/lancamentos-de-creditos-do-tipo-pagamento-em-atraso->3415243707-agendamentos,18077,6552
relatorios->relatorios/lancamentos-de-creditos-do-tipo-pagamento-em-atraso->3415243707-power-search-button,14952,6357
relatorios->relatorios/lancamentos-de-creditos-do-tipo-pagamento-em-atraso->3415243707-visualização,14812,6402
processos->processos/consolidacao-lancamentos-de-debitos->4238912785-executar,14781,6237
processos->processos/consolidacao-lancamentos-de-debitos->4238912785-agendamentos,17932,6599
processos->processos/consolidacao-lancamentos-de-debitos->4238912785-power-search-button,13568,6381
processos->processos/consolidacao-lancamentos-de-debitos->4238912785-visualização,14734,6405
lancamentos->lancamentos/lancamento-debitos-analiticos->741543100-novo->963479981-salvar,19435,12162
lancamentos->lancamentos/lancamento-debitos-analiticos->741543100-novo->963479981-voltar,11357,5709
ncamentos->lancamentos/lancamento-debitos-analiticos->741543100-novo->963479981-powerselect-estCodigo-963479981-powerselect-ccriCodigo-963479981-input-tributo-963479981-input-descricao-963479981-input-monetary-vlDebito and submit,13674,9916
lancamentos->lancamentos/lancamento-debitos-consolidados->144024936-agenda->144024936-pesquisar,12421,7285
ncamentos->lancamentos/lancamento-debitos-consolidados->144024936-agenda->144024936-powerselect-estCodigo and submit,9375,5390
lancamentos->lancamentos/lancamento-creditos->3993712770-novo->3993712770-item-,10858,7391
obrigacoes->obrigacoes/configuracao->678895530-gerenciar labels->678895530-fechar,15839,6321
obrigacoes->obrigacoes/configuracao->678895530-visualizar/editar->1585736775-salvar,22574,8381
obrigacoes->obrigacoes/configuracao->678895530-visualizar/editar->1585736775-voltar,23711,6581
obrigacoes->obrigacoes/solicitacoes->3223976761-ir para todas as obrigações->3223976761-voltar às obrigações do módulo,16094,5065
obrigacoes->obrigacoes/solicitacoes->3223976761-nova solicitação->3223976761-salvar,17961,
obrigacoes->obrigacoes/solicitacoes->3223976761-nova solicitação->3223976761-cancelar,15928,
obrigacoes->obrigacoes/solicitacoes->3223976761-agendamentos->3371290466-power-search-button,20428,
obrigacoes->obrigacoes/solicitacoes->3223976761-agendamentos->3371290466-visualização,20409,
obrigacoes->obrigacoes/solicitacoes->3223976761-agendamentos->3371290466-abrir visualização,20316,
obrigacoes->obrigacoes/solicitacoes->3223976761-agendamentos->3371290466-visualizar,21231,
obrigacoes->obrigacoes/solicitacoes->3223976761-ajustar parâmetros da geração->3230782574-rightoutlined,19210,
obrigacoes->obrigacoes/solicitacoes->3223976761-ajustar parâmetros da geração->3230782574-habilitar edição,20180,
obrigacoes->obrigacoes/solicitacoes->3223976761-ajustar parâmetros da geração->3230782574-abrir janela de edição,20968,
obrigacoes->obrigacoes/solicitacoes->3223976761-visualizar resultado da geração->3223976761-aumentar o zoom,15905,
obrigacoes->obrigacoes/solicitacoes->3223976761-visualizar resultado da geração->3223976761-diminuir o zoom,15809,
obrigacoes->obrigacoes/solicitacoes->3223976761-visualizar resultado da geração->3223976761-expandir,15823,
obrigacoes->obrigacoes/solicitacoes->3223976761-visualizar resultado da geração->3223976761-download,15864,
obrigacoes->obrigacoes/solicitacoes->3223976761-protocolo transmissão->569283666-editar,20941,
rigacoes->obrigacoes/obrigacoes-executadas->3371290466-visualização->3371290466-item- and submit,14685,6505
obrigacoes->obrigacoes/obrigacoes-executadas->3371290466-abrir visualização->3371290466-aumentar o zoom,16057,8520
obrigacoes->obrigacoes/obrigacoes-executadas->3371290466-abrir visualização->3371290466-diminuir o zoom,16134,7745
obrigacoes->obrigacoes/obrigacoes-executadas->3371290466-abrir visualização->3371290466-expandir,16045,7705
obrigacoes->obrigacoes/obrigacoes-executadas->3371290466-abrir visualização->3371290466-download,15995,7734
obrigacoes->obrigacoes/obrigacoes-executadas->3371290466-visualizar->3371290466-dados disponíveis para impressão,15030,7198
obrigacoes->obrigacoes/periodicidade->2148651226-novo->2148651226-criar,18254,9724
obrigacoes->obrigacoes/periodicidade->2148651226-novo->2148651226-cancelar,15113,6790
rigacoes->obrigacoes/periodicidade->2148651226-novo->2148651226-input-number-ano and submit,14700,6429
obrigacoes->obrigacoes/periodicidade->2148651226-editar->2148651226-remover item,16034,7707
obrigacoes->obrigacoes/periodicidade->2148651226-editar->2148651226-salvar,15178,6813
obrigacoes->obrigacoes/configuracao-estabelecimento->829132674-novo->829132674-cancelar,15955,7762
relatorios->relatorios/agenda-recolhimento->4010788594-executar->4010788594-múltipla seleção,14946,6762
relatorios->relatorios/agenda-recolhimento->4010788594-executar->4010788594-agendar,17979,9735
relatorios->relatorios/agenda-recolhimento->4010788594-agendamentos->4010788594-voltar,23735,
latorios->relatorios/agenda-recolhimento->4010788594-visualização->4010788594-item- and submit,14713,6512
relatorios->relatorios/pagamento-multa-juros->1436609750-executar->1436609750-múltipla seleção,15143,6740
relatorios->relatorios/pagamento-multa-juros->1436609750-executar->1436609750-agendar,17983,9701
relatorios->relatorios/pagamento-multa-juros->1436609750-agendamentos->1436609750-voltar,23721,
latorios->relatorios/pagamento-multa-juros->1436609750-visualização->1436609750-item- and submit,14726,7042
relatorios->relatorios/lancamentos-de-debitos-analiticos-por-sistema-de-origem->2549579271-executar->2549579271-múltipla seleção,15003,6812
relatorios->relatorios/lancamentos-de-debitos-analiticos-por-sistema-de-origem->2549579271-executar->2549579271-agendar,18072,9731
relatorios->relatorios/lancamentos-de-debitos-analiticos-por-sistema-de-origem->2549579271-agendamentos->2549579271-voltar,23788,
latorios->relatorios/lancamentos-de-debitos-analiticos-por-sistema-de-origem->2549579271-visualização->2549579271-item- and submit,14788,6584
relatorios->relatorios/lancamentos-de-debitos-consolidados->772074419-executar->772074419-múltipla seleção,15187,6774
relatorios->relatorios/lancamentos-de-debitos-consolidados->772074419-executar->772074419-agendar,17996,9776
relatorios->relatorios/lancamentos-de-debitos-consolidados->772074419-agendamentos->772074419-voltar,12487,
latorios->relatorios/lancamentos-de-debitos-consolidados->772074419-visualização->772074419-item- and submit,14794,6300
relatorios->relatorios/lancamentos-de-debitos-consolidados->772074419-detalhes->772074419-não há dados disponíveis para impressão,14975,6730
relatorios->relatorios/lancamentos-de-debitos-consolidados->772074419-abrir visualização->772074419-aumentar o zoom,16240,7845
relatorios->relatorios/lancamentos-de-debitos-consolidados->772074419-abrir visualização->772074419-diminuir o zoom,16053,7742
relatorios->relatorios/lancamentos-de-debitos-consolidados->772074419-abrir visualização->772074419-expandir,15917,7748
relatorios->relatorios/lancamentos-de-debitos-consolidados->772074419-abrir visualização->772074419-download,15958,7768
relatorios->relatorios/lancamentos-de-creditos->2580041027-executar->2580041027-múltipla seleção,15143,6846
relatorios->relatorios/lancamentos-de-creditos->2580041027-executar->2580041027-agendar,17962,9809
relatorios->relatorios/lancamentos-de-creditos->2580041027-agendamentos->2580041027-voltar,23716,
latorios->relatorios/lancamentos-de-creditos->2580041027-visualização->2580041027-item- and submit,14895,6508
relatorios->relatorios/lancamentos-de-creditos-do-tipo-pagamento-em-atraso->3415243707-executar->3415243707-múltipla seleção,15042,6794
relatorios->relatorios/lancamentos-de-creditos-do-tipo-pagamento-em-atraso->3415243707-executar->3415243707-agendar,18093,9779
relatorios->relatorios/lancamentos-de-creditos-do-tipo-pagamento-em-atraso->3415243707-agendamentos->3415243707-voltar,18028,
latorios->relatorios/lancamentos-de-creditos-do-tipo-pagamento-em-atraso->3415243707-visualização->3415243707-item- and submit,14762,14844
processos->processos/consolidacao-lancamentos-de-debitos->4238912785-executar->4238912785-múltipla seleção,15007,6838
processos->processos/consolidacao-lancamentos-de-debitos->4238912785-executar->4238912785-agendar,17997,9721
processos->processos/consolidacao-lancamentos-de-debitos->4238912785-agendamentos->4238912785-voltar,18037,
ocessos->processos/consolidacao-lancamentos-de-debitos->4238912785-visualização->4238912785-item- and submit,14761,7521
rigacoes->obrigacoes/solicitacoes->3223976761-agendamentos->3371290466-visualização->3371290466-item- and submit,22849,
obrigacoes->obrigacoes/solicitacoes->3223976761-agendamentos->3371290466-abrir visualização->3371290466-aumentar o zoom,22054,
obrigacoes->obrigacoes/solicitacoes->3223976761-agendamentos->3371290466-abrir visualização->3371290466-diminuir o zoom,21955,
obrigacoes->obrigacoes/solicitacoes->3223976761-agendamentos->3371290466-abrir visualização->3371290466-expandir,21983,
obrigacoes->obrigacoes/solicitacoes->3223976761-agendamentos->3371290466-abrir visualização->3371290466-download,21746,
obrigacoes->obrigacoes/solicitacoes->3223976761-agendamentos->3371290466-visualizar->3371290466-dados disponíveis para impressão,21981,
obrigacoes->obrigacoes/solicitacoes->3223976761-ajustar parâmetros da geração->3230782574-rightoutlined->3230782574-downoutlined,20644,
obrigacoes->obrigacoes/solicitacoes->3223976761-ajustar parâmetros da geração->3230782574-habilitar edição->3230782574-confirmar  edição,21881,
obrigacoes->obrigacoes/solicitacoes->3223976761-ajustar parâmetros da geração->3230782574-abrir janela de edição->3230782574-power-search-button,21964,
obrigacoes->obrigacoes/solicitacoes->3223976761-visualizar resultado da geração->3223976761-expandir->3223976761-diminuir,17479,
obrigacoes->obrigacoes/solicitacoes->3223976761-protocolo transmissão->569283666-editar->569283666-salvar,20673,
obrigacoes->obrigacoes/solicitacoes->3223976761-protocolo transmissão->569283666-editar->569283666-cancelar,20845,
obrigacoes->obrigacoes/obrigacoes-executadas->3371290466-abrir visualização->3371290466-expandir->3371290466-diminuir,17402,9045
relatorios->relatorios/agenda-recolhimento->4010788594-executar->4010788594-múltipla seleção->4010788594-cancelar,16313,7848
relatorios->relatorios/pagamento-multa-juros->1436609750-executar->1436609750-múltipla seleção->1436609750-cancelar,16552,8011
relatorios->relatorios/lancamentos-de-debitos-analiticos-por-sistema-de-origem->2549579271-executar->2549579271-múltipla seleção->2549579271-cancelar,16470,7999
relatorios->relatorios/lancamentos-de-debitos-consolidados->772074419-executar->772074419-múltipla seleção->772074419-cancelar,16518,8074
relatorios->relatorios/lancamentos-de-debitos-consolidados->772074419-abrir visualização->772074419-expandir->772074419-diminuir,17749,9053
relatorios->relatorios/lancamentos-de-creditos->2580041027-executar->2580041027-múltipla seleção->2580041027-cancelar,16334,7837
relatorios->relatorios/lancamentos-de-creditos-do-tipo-pagamento-em-atraso->3415243707-executar->3415243707-múltipla seleção->3415243707-cancelar,16596,8066
processos->processos/consolidacao-lancamentos-de-debitos->4238912785-executar->4238912785-múltipla seleção->4238912785-cancelar,16534,8102
obrigacoes->obrigacoes/solicitacoes->3223976761-agendamentos->3371290466-abrir visualização->3371290466-expandir->3371290466-diminuir,23767,
