{
  "http://localhost:9997": [
    {
      "selector": "[data-cy=\"index-navbar-toggle\"]",
      "tag": "<button type=\"button\" class=\"navbar-toggle\" data-toggle=\"collapse\" data-target=\".navbar-collapse\" data-cy=\"index-navbar-toggle\">\n                        <span class=\"icon-bar\"></span>\n                        <span class=\"icon-bar\"></span>\n                        <span class=\"icon-bar\"></span>\n                    </button>"
    },
    {
      "selector": "[data-cy=\"index-navbar-brand\"]",
      "tag": "<img src=\"img/logo.png\" alt=\"logo\" data-cy=\"index-navbar-brand\">"
    },
    {
      "selector": "[data-cy=\"index-index\"]",
      "tag": "<a href=\"index.html\" data-cy=\"index-index\">Home</a>"
    },
    {
      "selector": "[data-cy=\"index-about\"]",
      "tag": "<a href=\"about.html\" data-cy=\"index-about\">About Us</a>"
    },
    {
      "selector": "[data-cy=\"index-services\"]",
      "tag": "<a href=\"services.html\" data-cy=\"index-services\">Services</a>"
    },
    {
      "selector": "[data-cy=\"index-courses\"]",
      "tag": "<a href=\"courses.html\" data-cy=\"index-courses\">Courses</a>"
    },
    {
      "selector": "[data-cy=\"index-pricing\"]",
      "tag": "<a href=\"pricing.html\" data-cy=\"index-pricing\">Pricing</a>"
    },
    {
      "selector": "[data-cy=\"index-contact\"]",
      "tag": "<a href=\"contact.html\" data-cy=\"index-contact\">Contact</a>"
    },
    {
      "selector": "[data-cy=\"index-read-more-1\"]",
      "tag": "<a href=\"index.html\" class=\"btn btn-theme\" data-cy=\"index-read-more-1\">Read More</a>"
    },
    {
      "selector": "[data-cy=\"index-read-more-2\"]",
      "tag": "<a href=\"index.html\" class=\"btn btn-theme\" data-cy=\"index-read-more-2\">Read More</a>"
    },
    {
      "selector": "[data-cy=\"index-img-1\"]",
      "tag": "<a href=\"index.html\" data-cy=\"index-img-1\">\n                            <time datetime=\"2015-03-01\">\n                                <span class=\"year\">2015</span>\n                                <span class=\"month\">Feb</span>\n                            </time>\n                            <p>Lorem ipsum dolor sit amet, consectetur adipis.</p>\n                        </a>"
    },
    {
      "selector": "[data-cy=\"index-img-2\"]",
      "tag": "<a href=\"index.html\" data-cy=\"index-img-2\">\n                            <time datetime=\"2015-03-01\">\n                                <span class=\"year\">2015</span>\n                                <span class=\"month\">March</span>\n                            </time>\n                            <p>Apsum dolor sit amet, consectetur adipisdslif.</p>\n                        </a>"
    },
    {
      "selector": "[data-cy=\"index-img-3\"]",
      "tag": "<a href=\"index.html\" data-cy=\"index-img-3\">\n                            <time datetime=\"2015-03-01\">\n                                <span class=\"year\">2015</span>\n                                <span class=\"month\">April</span>\n                            </time>\n                            <p>Dolor sit amet, consectetur adipisic indfeft</p>\n                        </a>"
    },
    {
      "selector": "[data-cy=\"index-events\"]",
      "tag": "<a data-cy=\"index-events\" href=\"index.html\">Latest Events</a>"
    },
    {
      "selector": "[data-cy=\"index-terms\"]",
      "tag": "<a data-cy=\"index-terms\" href=\"index.html\">Terms and conditions</a>"
    },
    {
      "selector": "[data-cy=\"index-privacy\"]",
      "tag": "<a data-cy=\"index-privacy\" href=\"index.html\">Privacy policy</a>"
    },
    {
      "selector": "[data-cy=\"index-career\"]",
      "tag": "<a data-cy=\"index-career\" href=\"index.html\">Career</a>"
    },
    {
      "selector": "[data-cy=\"index-contact-us\"]",
      "tag": "<a data-cy=\"index-contact-us\" href=\"index.html\">Contact us</a>"
    },
    {
      "selector": "[data-cy=\"index-text-1\"]",
      "tag": "<a data-cy=\"index-text-1\" href=\"index.html\">Lorem ipsum dolor sit amet, consectetur adipiscing elit.</a>"
    },
    {
      "selector": "[data-cy=\"index-text-2\"]",
      "tag": "<a data-cy=\"index-text-2\" href=\"index.html\">Pellentesque et pulvinar enim. Quisque at tempor ligula</a>"
    },
    {
      "selector": "[data-cy=\"index-text-3\"]",
      "tag": "<a data-cy=\"index-text-3\" href=\"index.html\">Natus sit voluptatem accusantium doloremque</a>"
    },
    {
      "selector": "[data-cy=\"index-text-4\"]",
      "tag": "<a data-cy=\"index-text-4\" href=\"index.html\">Lorem ipsum dolor sit amet, consectetur adipiscing elit.</a>"
    },
    {
      "selector": "[data-cy=\"index-text-5\"]",
      "tag": "<a data-cy=\"index-text-5\" href=\"index.html\">Pellentesque et pulvinar enim. Quisque at tempor ligula</a>"
    },
    {
      "selector": "[data-cy=\"index-text-6\"]",
      "tag": "<a data-cy=\"index-text-6\" href=\"index.html\">Natus sit voluptatem accusantium doloremque</a>"
    },
    {
      "selector": "[data-cy=\"index-WebThemez\"]",
      "tag": "<a data-cy=\"index-WebThemez\" href=\"http://webthemez.com\" target=\"_blank\">WebThemez</a>"
    },
    {
      "selector": "[data-cy=\"index-facebook\"]",
      "tag": "<a data-cy=\"index-facebook\" href=\"index.html\" data-placement=\"top\" title=\"\" data-original-title=\"Facebook\"><i class=\"fa fa-facebook\"></i></a>"
    },
    {
      "selector": "[data-cy=\"index-twitter\"]",
      "tag": "<a data-cy=\"index-twitter\" href=\"index.html\" data-placement=\"top\" title=\"\" data-original-title=\"Twitter\"><i class=\"fa fa-twitter\"></i></a>"
    },
    {
      "selector": "[data-cy=\"index-linkedin\"]",
      "tag": "<a data-cy=\"index-linkedin\" href=\"index.html\" data-placement=\"top\" title=\"\" data-original-title=\"Linkedin\"><i class=\"fa fa-linkedin\"></i></a>"
    },
    {
      "selector": "[data-cy=\"index-pinterest\"]",
      "tag": "<a data-cy=\"index-pinterest\" href=\"index.html\" data-placement=\"top\" title=\"\" data-original-title=\"Pinterest\"><i class=\"fa fa-pinterest\"></i></a>"
    },
    {
      "selector": "[data-cy=\"index-google\"]",
      "tag": "<a data-cy=\"index-google\" href=\"index.html\" data-placement=\"top\" title=\"\" data-original-title=\"Google plus\"><i class=\"fa fa-google-plus\"></i></a>"
    },
    {
      "selector": "[data-cy=\"index-angle-up\"]",
      "tag": "<a href=\"index.html\" data-cy=\"index-angle-up\" class=\"scrollup\"><i class=\"fa fa-angle-up active\"></i></a>"
    }
  ],
  "http://localhost:9997/about.html": [
    {
      "selector": "[data-cy=\"about-navbar-collapse\"]",
      "tag": "<button type=\"button\" class=\"navbar-toggle\" data-toggle=\"collapse\" data-target=\".navbar-collapse\" data-cy=\"about-navbar-collapse\">\n                        <span class=\"icon-bar\"></span>\n                        <span class=\"icon-bar\"></span>\n                        <span class=\"icon-bar\"></span>\n                    </button>"
    },
    {
      "selector": "[data-cy=\"about-navbar-brand\"]",
      "tag": "<a class=\"navbar-brand\" data-cy=\"about-navbar-brand\" href=\"index.html\"><img src=\"img/logo.png\" alt=\"logo\"></a>"
    },
    {
      "selector": "[data-cy=\"about-home\"]",
      "tag": "<a data-cy=\"about-home\" href=\"index.html\">Home</a>"
    },
    {
      "selector": "[data-cy=\"about-about\"]",
      "tag": "<a data-cy=\"about-about\" href=\"about.html\">About Us</a>"
    },
    {
      "selector": "[data-cy=\"about-service\"]",
      "tag": "<a data-cy=\"about-service\" href=\"services.html\">Services</a>"
    },
    {
      "selector": "[data-cy=\"about-courses\"]",
      "tag": "<a href=\"courses.html\" data-cy=\"about-courses\">Courses</a>"
    },
    {
      "selector": "[data-cy=\"about-pricing\"]",
      "tag": "<a href=\"pricing.html\" data-cy=\"about-pricing\">Pricing</a>"
    },
    {
      "selector": "[data-cy=\"about-contact\"]",
      "tag": "<a href=\"contact.html\" data-cy=\"about-contact\">Contact</a>"
    },
    {
      "selector": "[data-cy=\"about-read-more\"]",
      "tag": "<a href=\"about.html\" data-cy=\"about-read-more\" class=\"btn btn-color\">Read more</a>"
    },
    {
      "selector": "[data-cy=\"about-collapse-1\"]",
      "tag": "<a data-toggle=\"collapse\" data-parent=\"#accordion-alt3\" href=\"#collapseOne-alt3\" data-cy=\"about-collapse-1\">\n\t\t\t\t\t\t\t\t\t\t\t<i class=\"fa fa-angle-right\"></i> Accordion Heading Text Item # 1\n\t\t\t\t\t\t\t\t\t\t  </a>"
    },
    {
      "selector": "[data-cy=\"about-contact-2\"]",
      "tag": "<a data-toggle=\"collapse\" data-parent=\"#accordion-alt3\" href=\"#collapseTwo-alt3\" data-cy=\"about-contact-2\">\n\t\t\t\t\t\t\t\t\t\t\t<i class=\"fa fa-angle-right\"></i> Accordion Heading Text Item # 2\n\t\t\t\t\t\t\t\t\t\t  </a>"
    },
    {
      "selector": "[data-cy=\"about-contact-3\"]",
      "tag": "<a data-toggle=\"collapse\" data-parent=\"#accordion-alt3\" href=\"#collapseThree-alt3\" data-cy=\"about-contact-3\">\n\t\t\t\t\t\t\t\t\t\t\t<i class=\"fa fa-angle-right\"></i> Accordion Heading Text Item # 3\n\t\t\t\t\t\t\t\t\t\t  </a>"
    },
    {
      "selector": "[data-cy=\"about-contact-4\"]",
      "tag": "<a data-toggle=\"collapse\" data-parent=\"#accordion-alt3\" href=\"#collapseFour-alt3\" data-cy=\"about-contact-4\">\n\t\t\t\t\t\t\t\t\t\t\t<i class=\"fa fa-angle-right\"></i> Accordion Heading Text Item # 4\n\t\t\t\t\t\t\t\t\t\t  </a>"
    },
    {
      "selector": "[data-cy=\"about-text-1\"]",
      "tag": "<a href=\"about.html\" data-cy=\"about-text-1\">Eriure dolor in hendrerit in vulpu</a>"
    },
    {
      "selector": "[data-cy=\"about-text-2\"]",
      "tag": "<a href=\"about.html\" data-cy=\"about-text-2\">Otate velit esse molestie con</a>"
    },
    {
      "selector": "[data-cy=\"about-text-3\"]",
      "tag": "<a href=\"about.html\" data-cy=\"about-text-3\">Bequat, vel illum dolore eu feugiat</a>"
    },
    {
      "selector": "[data-cy=\"about-text-4\"]",
      "tag": "<a href=\"about.html\" data-cy=\"about-text-4\">Nulla facilisis at vero eros et</a>"
    },
    {
      "selector": "[data-cy=\"about-text-5\"]",
      "tag": "<a href=\"about.html\" data-cy=\"about-text-5\">Bumsan et iusto odio dignissim</a>"
    },
    {
      "selector": "[data-cy=\"about-text-6\"]",
      "tag": "<a href=\"about.html\" data-cy=\"about-text-6\">Equi blandit praesent lup</a>"
    },
    {
      "selector": "[data-cy=\"about-events\"]",
      "tag": "<a data-cy=\"about-events\" href=\"about.html\">Latest Events</a>"
    },
    {
      "selector": "[data-cy=\"about-terms\"]",
      "tag": "<a data-cy=\"about-terms\" href=\"about.html\">Terms and conditions</a>"
    },
    {
      "selector": "[data-cy=\"about-privacy\"]",
      "tag": "<a data-cy=\"about-privacy\" href=\"about.html\">Privacy policy</a>"
    },
    {
      "selector": "[data-cy=\"about-career\"]",
      "tag": "<a data-cy=\"about-career\" href=\"about.html\">Career</a>"
    },
    {
      "selector": "[data-cy=\"about-contact-us\"]",
      "tag": "<a data-cy=\"about-contact-us\" href=\"about.html\">Contact us</a>"
    },
    {
      "selector": "[data-cy=\"about-WebThemez\"]",
      "tag": "<a href=\"http://webthemez.com\" data-cy=\"about-WebThemez\" target=\"_blank\">WebThemez</a>"
    },
    {
      "selector": "[data-cy=\"about-facebook\"]",
      "tag": "<a data-cy=\"about-facebook\" href=\"about.html\" data-placement=\"top\" title=\"\" data-original-title=\"Facebook\"><i class=\"fa fa-facebook\"></i></a>"
    },
    {
      "selector": "[data-cy=\"about-twitter\"]",
      "tag": "<a data-cy=\"about-twitter\" href=\"about.html\" data-placement=\"top\" title=\"\" data-original-title=\"Twitter\"><i class=\"fa fa-twitter\"></i></a>"
    },
    {
      "selector": "[data-cy=\"about-linkedin\"]",
      "tag": "<a data-cy=\"about-linkedin\" href=\"about.html\" data-placement=\"top\" title=\"\" data-original-title=\"Linkedin\"><i class=\"fa fa-linkedin\"></i></a>"
    },
    {
      "selector": "[data-cy=\"about-pinterest\"]",
      "tag": "<a data-cy=\"about-pinterest\" href=\"about.html\" data-placement=\"top\" title=\"\" data-original-title=\"Pinterest\"><i class=\"fa fa-pinterest\"></i></a>"
    },
    {
      "selector": "[data-cy=\"about-google\"]",
      "tag": "<a data-cy=\"about-google\" href=\"about.html\" data-placement=\"top\" title=\"\" data-original-title=\"Google plus\"><i class=\"fa fa-google-plus\"></i></a>"
    },
    {
      "selector": "[data-cy=\"about-angle-up\"]",
      "tag": "<a href=\"about.html\" data-cy=\"about-angle-up\" class=\"scrollup\"><i class=\"fa fa-angle-up active\"></i></a>"
    }
  ],
  "http://localhost:9997/services.html": [
    {
      "selector": "[data-cy=\"services-navbar-toggle\"]",
      "tag": "<button type=\"button\" class=\"navbar-toggle\" data-toggle=\"collapse\" data-target=\".navbar-collapse\" data-cy=\"services-navbar-toggle\">\n                        <span class=\"icon-bar\"></span>\n                        <span class=\"icon-bar\"></span>\n                        <span class=\"icon-bar\"></span>\n                    </button>"
    },
    {
      "selector": "[data-cy=\"services-navbar-brand\"]",
      "tag": "<a class=\"navbar-brand\" href=\"index.html\" data-cy=\"services-navbar-brand\"><img src=\"img/logo.png\" alt=\"logo\"></a>"
    },
    {
      "selector": "[data-cy=\"services-index\"]",
      "tag": "<a href=\"index.html\" data-cy=\"services-index\">Home</a>"
    },
    {
      "selector": "[data-cy=\"services-about\"]",
      "tag": "<a href=\"about.html\" data-cy=\"services-about\">About Us</a>"
    },
    {
      "selector": "[data-cy=\"services-services\"]",
      "tag": "<a href=\"services.html\" data-cy=\"services-services\">Services</a>"
    },
    {
      "selector": "[data-cy=\"services-courses\"]",
      "tag": "<a href=\"courses.html\" data-cy=\"services-courses\">Courses</a>"
    },
    {
      "selector": "[data-cy=\"services-pricing\"]",
      "tag": "<a href=\"pricing.html\" data-cy=\"services-pricing\">Pricing</a>"
    },
    {
      "selector": "[data-cy=\"services-contact\"]",
      "tag": "<a href=\"contact.html\" data-cy=\"services-contact\">Contact</a>"
    },
    {
      "selector": "[data-cy=\"services-events\"]",
      "tag": "<a data-cy=\"services-events\" href=\"services.html\">Latest Events</a>"
    },
    {
      "selector": "[data-cy=\"services-terms\"]",
      "tag": "<a data-cy=\"services-terms\" href=\"services.html\">Terms and conditions</a>"
    },
    {
      "selector": "[data-cy=\"services-privacy\"]",
      "tag": "<a data-cy=\"services-privacy\" href=\"services.html\">Privacy policy</a>"
    },
    {
      "selector": "[data-cy=\"services-career\"]",
      "tag": "<a data-cy=\"services-career\" href=\"services.html\">Career</a>"
    },
    {
      "selector": "[data-cy=\"services-contact-us\"]",
      "tag": "<a data-cy=\"services-contact-us\" href=\"services.html\">Contact us</a>"
    },
    {
      "selector": "[data-cy=\"services-text-1\"]",
      "tag": "<a data-cy=\"services-text-1\" href=\"services.html\">Lorem ipsum dolor sit amet, consectetur adipiscing elit.</a>"
    },
    {
      "selector": "[data-cy=\"services-text-2\"]",
      "tag": "<a data-cy=\"services-text-2\" href=\"services.html\">Pellentesque et pulvinar enim. Quisque at tempor ligula</a>"
    },
    {
      "selector": "[data-cy=\"services-text-3\"]",
      "tag": "<a data-cy=\"services-text-3\" href=\"services.html\">Natus sit voluptatem accusantium doloremque</a>"
    },
    {
      "selector": "[data-cy=\"services-text-4\"]",
      "tag": "<a data-cy=\"services-text-4\" href=\"services.html\">Lorem ipsum dolor sit amet, consectetur adipiscing elit.</a>"
    },
    {
      "selector": "[data-cy=\"services-text-5\"]",
      "tag": "<a data-cy=\"services-text-5\" href=\"services.html\">Pellentesque et pulvinar enim. Quisque at tempor ligula</a>"
    },
    {
      "selector": "[data-cy=\"services-text-6\"]",
      "tag": "<a data-cy=\"services-text-6\" href=\"services.html\">Natus sit voluptatem accusantium doloremque</a>"
    },
    {
      "selector": "[data-cy=\"services-WebThemez\"]",
      "tag": "<a href=\"http://webthemez.com\" data-cy=\"services-WebThemez\" target=\"_blank\">WebThemez</a>"
    },
    {
      "selector": "[data-cy=\"services-facebook\"]",
      "tag": "<a data-cy=\"services-facebook\" href=\"services.html\" data-placement=\"top\" title=\"\" data-original-title=\"Facebook\"><i class=\"fa fa-facebook\"></i></a>"
    },
    {
      "selector": "[data-cy=\"services-twitter\"]",
      "tag": "<a data-cy=\"services-twitter\" href=\"services.html\" data-placement=\"top\" title=\"\" data-original-title=\"Twitter\"><i class=\"fa fa-twitter\"></i></a>"
    },
    {
      "selector": "[data-cy=\"services-linkedin\"]",
      "tag": "<a data-cy=\"services-linkedin\" href=\"services.html\" data-placement=\"top\" title=\"\" data-original-title=\"Linkedin\"><i class=\"fa fa-linkedin\"></i></a>"
    },
    {
      "selector": "[data-cy=\"services-pinterest\"]",
      "tag": "<a data-cy=\"services-pinterest\" href=\"services.html\" data-placement=\"top\" title=\"\" data-original-title=\"Pinterest\"><i class=\"fa fa-pinterest\"></i></a>"
    },
    {
      "selector": "[data-cy=\"services-google\"]",
      "tag": "<a data-cy=\"services-google\" href=\"services.html\" data-placement=\"top\" title=\"\" data-original-title=\"Google plus\"><i class=\"fa fa-google-plus\"></i></a>"
    },
    {
      "selector": "[data-cy=\"services-angle-up\"]",
      "tag": "<a href=\"services.html\" data-cy=\"services-angle-up\" class=\"scrollup\"><i class=\"fa fa-angle-up active\"></i></a>"
    }
  ],
  "http://localhost:9997/courses.html": [
    {
      "selector": "[data-cy=\"courses-navbar-toggle\"]",
      "tag": "<button type=\"button\" class=\"navbar-toggle\" data-toggle=\"collapse\" data-target=\".navbar-collapse\" data-cy=\"courses-navbar-toggle\">\n                        <span class=\"icon-bar\"></span>\n                        <span class=\"icon-bar\"></span>\n                        <span class=\"icon-bar\"></span>\n                    </button>"
    },
    {
      "selector": "[data-cy=\"courses-navbar-brand\"]",
      "tag": "<img src=\"img/logo.png\" alt=\"logo\" data-cy=\"courses-navbar-brand\">"
    },
    {
      "selector": "[data-cy=\"courses-home\"]",
      "tag": "<a data-cy=\"courses-home\" href=\"index.html\">Home</a>"
    },
    {
      "selector": "[data-cy=\"courses-about\"]",
      "tag": "<a data-cy=\"courses-about\" href=\"about.html\">About Us</a>"
    },
    {
      "selector": "[data-cy=\"about-service\"]",
      "tag": "<a data-cy=\"about-service\" href=\"services.html\">Services</a>"
    },
    {
      "selector": "[data-cy=\"courses-courses\"]",
      "tag": "<a href=\"courses.html\" data-cy=\"courses-courses\">Courses</a>"
    },
    {
      "selector": "[data-cy=\"courses-pricing\"]",
      "tag": "<a href=\"pricing.html\" data-cy=\"courses-pricing\">Pricing</a>"
    },
    {
      "selector": "[data-cy=\"courses-contact\"]",
      "tag": "<a href=\"contact.html\" data-cy=\"courses-contact\">Contact</a>"
    },
    {
      "selector": "[data-cy=\"courses-web-design\"]",
      "tag": "<a href=\"courses.html\" data-cy=\"courses-web-design\" title=\"\">Web design</a>"
    },
    {
      "selector": "[data-cy=\"courses-mobile-app\"]",
      "tag": "<a href=\"courses.html\" data-cy=\"courses-mobile-app\" title=\"\">Mobile App</a>"
    },
    {
      "selector": "[data-cy=\"courses-ui-design\"]",
      "tag": "<a href=\"courses.html\" data-cy=\"courses-ui-design\" title=\"\">UI design</a>"
    },
    {
      "selector": "[data-cy=\"courses-work-1\"]",
      "tag": "<a class=\"hover-wrap fancybox\" data-fancybox-group=\"gallery\" title=\"Portfolio name\" href=\"img/works/1.jpg\" data-cy=\"courses-work-1\">\n\t\t\t\t\t\t<span class=\"overlay-img\"></span>\n\t\t\t\t\t\t<span class=\"overlay-img-thumb\"><i class=\"icon-info-blocks fa fa-search\"></i></span>\n\t\t\t\t\t\t</a>"
    },
    {
      "selector": "[data-cy=\"courses-course-title-1\"]",
      "tag": "<a href=\"courses.html\" data-cy=\"courses-course-title-1\">Course Title</a>"
    },
    {
      "selector": "[data-cy=\"courses-learn-more-1\"]",
      "tag": "<a href=\"courses.html\" class=\"btn btn-primary\" data-cy=\"courses-learn-more-1\"><div><i>Learn More</i></div></a>"
    },
    {
      "selector": "[data-cy=\"courses-work-2\"]",
      "tag": "<a class=\"hover-wrap fancybox\" data-fancybox-group=\"gallery\" title=\"Portfolio name\" href=\"img/works/2.jpg\" data-cy=\"courses-work-2\">\n\t\t\t\t\t\t<span class=\"overlay-img\"></span>\n\t\t\t\t\t\t<span class=\"overlay-img-thumb\"><i class=\"icon-info-blocks fa fa-search\"></i></span>\n\t\t\t\t\t\t</a>"
    },
    {
      "selector": "[data-cy=\"courses-course-title-2\"]",
      "tag": "<a href=\"courses.html\" data-cy=\"courses-course-title-2\">Course Title</a>"
    },
    {
      "selector": "[data-cy=\"courses-learn-more-2\"]",
      "tag": "<a href=\"courses.html\" class=\"btn btn-primary\" data-cy=\"courses-learn-more-2\"><div><i>Learn More</i></div></a>"
    },
    {
      "selector": "[data-cy=\"courses-work-3\"]",
      "tag": "<a class=\"hover-wrap fancybox\" data-fancybox-group=\"gallery\" title=\"Portfolio name\" href=\"img/works/3.jpg\" data-cy=\"courses-work-3\">\n\t\t\t\t\t\t<span class=\"overlay-img\"></span>\n\t\t\t\t\t\t<span class=\"overlay-img-thumb\"><i class=\"icon-info-blocks fa fa-search\"></i></span>\n\t\t\t\t\t\t</a>"
    },
    {
      "selector": "[data-cy=\"courses-course-title-3\"]",
      "tag": "<a href=\"courses.html\" data-cy=\"courses-course-title-3\">Course Title</a>"
    },
    {
      "selector": "[data-cy=\"courses-learn-more-3\"]",
      "tag": "<a href=\"courses.html\" class=\"btn btn-primary\" data-cy=\"courses-learn-more-3\"><div><i>Learn More</i></div></a>"
    },
    {
      "selector": "[data-cy=\"courses-work-4\"]",
      "tag": "<a class=\"hover-wrap fancybox\" data-fancybox-group=\"gallery\" title=\"Portfolio name\" href=\"img/works/4.jpg\" data-cy=\"courses-work-4\">\n\t\t\t\t\t\t<span class=\"overlay-img\"></span>\n\t\t\t\t\t\t<span class=\"overlay-img-thumb\"><i class=\"icon-info-blocks fa fa-search\"></i></span>\n\t\t\t\t\t\t</a>"
    },
    {
      "selector": "[data-cy=\"courses-course-title-4\"]",
      "tag": "<a href=\"courses.html\" data-cy=\"courses-course-title-4\">Course Title</a>"
    },
    {
      "selector": "[data-cy=\"courses-learn-more-4\"]",
      "tag": "<a href=\"courses.html\" class=\"btn btn-primary\" data-cy=\"courses-learn-more-4\"><div><i>Learn More</i></div></a>"
    },
    {
      "selector": "[data-cy=\"courses-work-5\"]",
      "tag": "<a class=\"hover-wrap fancybox\" data-fancybox-group=\"gallery\" title=\"Portfolio name\" href=\"img/works/5.jpg\" data-cy=\"courses-work-5\">\n\t\t\t\t\t\t<span class=\"overlay-img\"></span>\n\t\t\t\t\t\t<span class=\"overlay-img-thumb\"><i class=\"icon-info-blocks fa fa-search\"></i></span>\n\t\t\t\t\t\t</a>"
    },
    {
      "selector": "[data-cy=\"courses-course-title-5\"]",
      "tag": "<a href=\"courses.html\" data-cy=\"courses-course-title-5\">Course Title</a>"
    },
    {
      "selector": "[data-cy=\"courses-learn-more-5\"]",
      "tag": "<a href=\"courses.html\" class=\"btn btn-primary\" data-cy=\"courses-learn-more-5\"><div><i>Learn More</i></div></a>"
    },
    {
      "selector": "[data-cy=\"courses-work-6\"]",
      "tag": "<a class=\"hover-wrap fancybox\" data-fancybox-group=\"gallery\" title=\"Portfolio name\" href=\"img/works/6.jpg\" data-cy=\"courses-work-6\">\n\t\t\t\t\t\t<span class=\"overlay-img\"></span>\n\t\t\t\t\t\t<span class=\"overlay-img-thumb\"><i class=\"icon-info-blocks fa fa-search\"></i></span>\n\t\t\t\t\t\t</a>"
    },
    {
      "selector": "[data-cy=\"courses-course-title-6\"]",
      "tag": "<a href=\"courses.html\" data-cy=\"courses-course-title-6\">Course Title</a>"
    },
    {
      "selector": "[data-cy=\"courses-learn-more-6\"]",
      "tag": "<a href=\"courses.html\" class=\"btn btn-primary\" data-cy=\"courses-learn-more-6\"><div><i>Learn More</i></div></a>"
    },
    {
      "selector": "[data-cy=\"courses-work-7\"]",
      "tag": "<a class=\"hover-wrap fancybox\" data-fancybox-group=\"gallery\" title=\"Portfolio name\" href=\"img/works/7.jpg\" data-cy=\"courses-work-7\">\n\t\t\t\t\t\t<span class=\"overlay-img\"></span>\n\t\t\t\t\t\t<span class=\"overlay-img-thumb\"><i class=\"icon-info-blocks fa fa-search\"></i></span>\n\t\t\t\t\t\t</a>"
    },
    {
      "selector": "[data-cy=\"courses-course-title-7\"]",
      "tag": "<a href=\"courses.html\" data-cy=\"courses-course-title-7\">Course Title</a>"
    },
    {
      "selector": "[data-cy=\"courses-learn-more-7\"]",
      "tag": "<a href=\"courses.html\" class=\"btn btn-primary\" data-cy=\"courses-learn-more-7\"><div><i>Learn More</i></div></a>"
    },
    {
      "selector": "[data-cy=\"courses-work-8\"]",
      "tag": "<a class=\"hover-wrap fancybox\" data-fancybox-group=\"gallery\" title=\"Portfolio name\" href=\"img/works/8.jpg\" data-cy=\"courses-work-8\">\n\t\t\t\t\t\t<span class=\"overlay-img\"></span>\n\t\t\t\t\t\t<span class=\"overlay-img-thumb\"><i class=\"icon-info-blocks fa fa-search\"></i></span>\n\t\t\t\t\t\t</a>"
    },
    {
      "selector": "[data-cy=\"courses-course-title-8\"]",
      "tag": "<a href=\"courses.html\" data-cy=\"courses-course-title-8\">Course Title</a>"
    },
    {
      "selector": "[data-cy=\"courses-learn-more-8\"]",
      "tag": "<a href=\"courses.html\" class=\"btn btn-primary\" data-cy=\"courses-learn-more-8\"><div><i>Learn More</i></div></a>"
    },
    {
      "selector": "[data-cy=\"courses-events\"]",
      "tag": "<a data-cy=\"courses-events\" href=\"courses.html\">Latest Events</a>"
    },
    {
      "selector": "[data-cy=\"courses-terms\"]",
      "tag": "<a data-cy=\"courses-terms\" href=\"courses.html\">Terms and conditions</a>"
    },
    {
      "selector": "[data-cy=\"courses-privacy\"]",
      "tag": "<a data-cy=\"courses-privacy\" href=\"courses.html\">Privacy policy</a>"
    },
    {
      "selector": "[data-cy=\"courses-career\"]",
      "tag": "<a data-cy=\"courses-career\" href=\"courses.html\">Career</a>"
    },
    {
      "selector": "[data-cy=\"courses-contact-us\"]",
      "tag": "<a data-cy=\"courses-contact-us\" href=\"courses.html\">Contact us</a>"
    },
    {
      "selector": "[data-cy=\"courses-text-1\"]",
      "tag": "<a data-cy=\"courses-text-1\" href=\"courses.html\">Lorem ipsum dolor sit amet, consectetur adipiscing elit.</a>"
    },
    {
      "selector": "[data-cy=\"courses-text-2\"]",
      "tag": "<a data-cy=\"courses-text-2\" href=\"courses.html\">Pellentesque et pulvinar enim. Quisque at tempor ligula</a>"
    },
    {
      "selector": "[data-cy=\"courses-text-3\"]",
      "tag": "<a data-cy=\"courses-text-3\" href=\"courses.html\">Natus sit voluptatem accusantium doloremque</a>"
    },
    {
      "selector": "[data-cy=\"courses-text-4\"]",
      "tag": "<a data-cy=\"courses-text-4\" href=\"courses.html\">Lorem ipsum dolor sit amet, consectetur adipiscing elit.</a>"
    },
    {
      "selector": "[data-cy=\"courses-text-5\"]",
      "tag": "<a data-cy=\"courses-text-5\" href=\"courses.html\">Pellentesque et pulvinar enim. Quisque at tempor ligula</a>"
    },
    {
      "selector": "[data-cy=\"courses-text-6\"]",
      "tag": "<a data-cy=\"courses-text-6\" href=\"courses.html\">Natus sit voluptatem accusantium doloremque</a>"
    },
    {
      "selector": "[data-cy=\"courses-WebThemez\"]",
      "tag": "<a href=\"http://webthemez.com\" data-cy=\"courses-WebThemez\" target=\"_blank\">WebThemez</a>"
    },
    {
      "selector": "[data-cy=\"courses-facebook\"]",
      "tag": "<a data-cy=\"courses-facebook\" href=\"courses.html\" data-placement=\"top\" title=\"\" data-original-title=\"Facebook\"><i class=\"fa fa-facebook\"></i></a>"
    },
    {
      "selector": "[data-cy=\"courses-twitter\"]",
      "tag": "<a data-cy=\"courses-twitter\" href=\"courses.html\" data-placement=\"top\" title=\"\" data-original-title=\"Twitter\"><i class=\"fa fa-twitter\"></i></a>"
    },
    {
      "selector": "[data-cy=\"courses-linkedin\"]",
      "tag": "<a data-cy=\"courses-linkedin\" href=\"courses.html\" data-placement=\"top\" title=\"\" data-original-title=\"Linkedin\"><i class=\"fa fa-linkedin\"></i></a>"
    },
    {
      "selector": "[data-cy=\"courses-pinterest\"]",
      "tag": "<a data-cy=\"courses-pinterest\" href=\"courses.html\" data-placement=\"top\" title=\"\" data-original-title=\"Pinterest\"><i class=\"fa fa-pinterest\"></i></a>"
    },
    {
      "selector": "[data-cy=\"courses-google\"]",
      "tag": "<a data-cy=\"courses-google\" href=\"courses.html\" data-placement=\"top\" title=\"\" data-original-title=\"Google plus\"><i class=\"fa fa-google-plus\"></i></a>"
    },
    {
      "selector": "[data-cy=\"courses-angle-up\"]",
      "tag": "<a href=\"courses.html\" data-cy=\"courses-angle-up\" class=\"scrollup\"><i class=\"fa fa-angle-up active\"></i></a>"
    }
  ],
  "http://localhost:9997/pricing.html": [
    {
      "selector": "[data-cy=\"pricing-navbar-collapse\"]",
      "tag": "<button type=\"button\" class=\"navbar-toggle\" data-toggle=\"collapse\" data-target=\".navbar-collapse\" data-cy=\"pricing-navbar-collapse\">\n                        <span class=\"icon-bar\"></span>\n                        <span class=\"icon-bar\"></span>\n                        <span class=\"icon-bar\"></span>\n                    </button>"
    },
    {
      "selector": "[data-cy=\"pricing-navbar-brand\"]",
      "tag": "<a class=\"navbar-brand\" data-cy=\"pricing-navbar-brand\" href=\"index.html\"><img src=\"img/logo.png\" alt=\"logo\"></a>"
    },
    {
      "selector": "[data-cy=\"pricing-home\"]",
      "tag": "<a data-cy=\"pricing-home\" href=\"index.html\">Home</a>"
    },
    {
      "selector": "[data-cy=\"pricing-about\"]",
      "tag": "<a data-cy=\"pricing-about\" href=\"about.html\">About Us</a>"
    },
    {
      "selector": "[data-cy=\"pricing-service\"]",
      "tag": "<a data-cy=\"pricing-service\" href=\"services.html\">Services</a>"
    },
    {
      "selector": "[data-cy=\"pricing-courses\"]",
      "tag": "<a href=\"courses.html\" data-cy=\"pricing-courses\">Courses</a>"
    },
    {
      "selector": "[data-cy=\"pricing-pricing\"]",
      "tag": "<a href=\"pricing.html\" data-cy=\"pricing-pricing\">Pricing</a>"
    },
    {
      "selector": "[data-cy=\"pricing-contact\"]",
      "tag": "<a href=\"contact.html\" data-cy=\"pricing-contact\">Contact</a>"
    },
    {
      "selector": "[data-cy=\"pricing-get-now-1\"]",
      "tag": "<a href=\"pricing.html\" class=\"btn btn-medium\" data-cy=\"pricing-get-now-1\"><i class=\"icon-bolt\"></i> Get Now</a>"
    },
    {
      "selector": "[data-cy=\"pricing-get-now-2\"]",
      "tag": "<a href=\"pricing.html\" class=\"btn btn-medium\" data-cy=\"pricing-get-now-2\"><i class=\"icon-bolt\"></i> Get Now</a>"
    },
    {
      "selector": "[data-cy=\"pricing-get-now-3\"]",
      "tag": "<a href=\"pricing.html\" class=\"btn btn-medium\" data-cy=\"pricing-get-now-3\"><i class=\"icon-bolt\"></i> Get Now</a>"
    },
    {
      "selector": "[data-cy=\"pricing-get-now-4\"]",
      "tag": "<a href=\"pricing.html\" class=\"btn btn-medium\" data-cy=\"pricing-get-now-4\"><i class=\"icon-bolt\"></i> Get Now</a>"
    },
    {
      "selector": "[data-cy=\"pricing-events\"]",
      "tag": "<a data-cy=\"pricing-events\" href=\"pricing.html\">Latest Events</a>"
    },
    {
      "selector": "[data-cy=\"pricing-terms\"]",
      "tag": "<a data-cy=\"pricing-terms\" href=\"pricing.html\">Terms and conditions</a>"
    },
    {
      "selector": "[data-cy=\"pricing-privacy\"]",
      "tag": "<a data-cy=\"pricing-privacy\" href=\"pricing.html\">Privacy policy</a>"
    },
    {
      "selector": "[data-cy=\"pricing-career\"]",
      "tag": "<a data-cy=\"pricing-career\" href=\"pricing.html\">Career</a>"
    },
    {
      "selector": "[data-cy=\"pricing-contact-us\"]",
      "tag": "<a data-cy=\"pricing-contact-us\" href=\"pricing.html\">Contact us</a>"
    },
    {
      "selector": "[data-cy=\"pricing-text-1\"]",
      "tag": "<a data-cy=\"pricing-text-1\" href=\"pricing.html\">Lorem ipsum dolor sit amet, consectetur adipiscing elit.</a>"
    },
    {
      "selector": "[data-cy=\"pricing-text-2\"]",
      "tag": "<a data-cy=\"pricing-text-2\" href=\"pricing.html\">Pellentesque et pulvinar enim. Quisque at tempor ligula</a>"
    },
    {
      "selector": "[data-cy=\"pricing-text-3\"]",
      "tag": "<a data-cy=\"pricing-text-3\" href=\"pricing.html\">Natus sit voluptatem accusantium doloremque</a>"
    },
    {
      "selector": "[data-cy=\"pricing-text-4\"]",
      "tag": "<a data-cy=\"pricing-text-4\" href=\"pricing.html\">Lorem ipsum dolor sit amet, consectetur adipiscing elit.</a>"
    },
    {
      "selector": "[data-cy=\"pricing-text-5\"]",
      "tag": "<a data-cy=\"pricing-text-5\" href=\"pricing.html\">Pellentesque et pulvinar enim. Quisque at tempor ligula</a>"
    },
    {
      "selector": "[data-cy=\"pricing-text-6\"]",
      "tag": "<a data-cy=\"pricing-text-6\" href=\"pricing.html\">Natus sit voluptatem accusantium doloremque</a>"
    },
    {
      "selector": "[data-cy=\"pricing-WebThemez\"]",
      "tag": "<a href=\"http://webthemez.com\" data-cy=\"pricing-WebThemez\" target=\"_blank\">WebThemez</a>"
    },
    {
      "selector": "[data-cy=\"pricing-facebook\"]",
      "tag": "<a data-cy=\"pricing-facebook\" href=\"pricing.html\" data-placement=\"top\" title=\"\" data-original-title=\"Facebook\"><i class=\"fa fa-facebook\"></i></a>"
    },
    {
      "selector": "[data-cy=\"pricing-twitter\"]",
      "tag": "<a data-cy=\"pricing-twitter\" href=\"pricing.html\" data-placement=\"top\" title=\"\" data-original-title=\"Twitter\"><i class=\"fa fa-twitter\"></i></a>"
    },
    {
      "selector": "[data-cy=\"pricing-linkedin\"]",
      "tag": "<a data-cy=\"pricing-linkedin\" href=\"pricing.html\" data-placement=\"top\" title=\"\" data-original-title=\"Linkedin\"><i class=\"fa fa-linkedin\"></i></a>"
    },
    {
      "selector": "[data-cy=\"pricing-pinterest\"]",
      "tag": "<a data-cy=\"pricing-pinterest\" href=\"pricing.html\" data-placement=\"top\" title=\"\" data-original-title=\"Pinterest\"><i class=\"fa fa-pinterest\"></i></a>"
    },
    {
      "selector": "[data-cy=\"pricing-google\"]",
      "tag": "<a data-cy=\"pricing-google\" href=\"pricing.html\" data-placement=\"top\" title=\"\" data-original-title=\"Google plus\"><i class=\"fa fa-google-plus\"></i></a>"
    },
    {
      "selector": "[data-cy=\"pricing-angle-up\"]",
      "tag": "<a href=\"pricing.html\" data-cy=\"pricing-angle-up\" class=\"scrollup\"><i class=\"fa fa-angle-up active\"></i></a>"
    }
  ],
  "http://localhost:9997/contact.html": [
    {
      "selector": "[data-cy=\"contact-navbar-collapse\"]",
      "tag": "<button type=\"button\" class=\"navbar-toggle\" data-toggle=\"collapse\" data-target=\".navbar-collapse\" data-cy=\"contact-navbar-collapse\">\n                        <span class=\"icon-bar\"></span>\n                        <span class=\"icon-bar\"></span>\n                        <span class=\"icon-bar\"></span>\n                    </button>"
    },
    {
      "selector": "[data-cy=\"contact-navbar-brand\"]",
      "tag": "<img src=\"img/logo.png\" alt=\"logo\" data-cy=\"contact-navbar-brand\">"
    },
    {
      "selector": "[data-cy=\"contact-home\"]",
      "tag": "<a href=\"index.html\" data-cy=\"contact-home\">Home</a>"
    },
    {
      "selector": "[data-cy=\"contact-about\"]",
      "tag": "<a data-cy=\"contact-about\" href=\"about.html\">About Us</a>"
    },
    {
      "selector": "[data-cy=\"contact-services\"]",
      "tag": "<a data-cy=\"contact-services\" href=\"services.html\">Services</a>"
    },
    {
      "selector": "[data-cy=\"contact-courses\"]",
      "tag": "<a href=\"courses.html\" data-cy=\"contact-courses\">Courses</a>"
    },
    {
      "selector": "[data-cy=\"contact-pricing\"]",
      "tag": "<a href=\"pricing.html\" data-cy=\"contact-pricing\">Pricing</a>"
    },
    {
      "selector": "[data-cy=\"contact-contact\"]",
      "tag": "<a href=\"contact.html\" data-cy=\"contact-contact\">Contact</a>"
    },
    {
      "selector": "[data-cy=\"close-button\"]",
      "tag": "<button type=\"button\" class=\"close\" data-dismiss=\"alert\" data-cy=\"close-button\">×</button>"
    },
    {
      "selector": "[data-cy=\"contact-events\"]",
      "tag": "<a data-cy=\"contact-events\" href=\"contact.html\">Latest Events</a>"
    },
    {
      "selector": "[data-cy=\"contact-terms\"]",
      "tag": "<a data-cy=\"contact-terms\" href=\"contact.html\">Terms and conditions</a>"
    },
    {
      "selector": "[data-cy=\"contact-privacy\"]",
      "tag": "<a data-cy=\"contact-privacy\" href=\"contact.html\">Privacy policy</a>"
    },
    {
      "selector": "[data-cy=\"contact-career\"]",
      "tag": "<a data-cy=\"contact-career\" href=\"contact.html\">Career</a>"
    },
    {
      "selector": "[data-cy=\"contact-contact-us\"]",
      "tag": "<a data-cy=\"contact-contact-us\" href=\"contact.html\">Contact us</a>"
    },
    {
      "selector": "[data-cy=\"contact-text-1\"]",
      "tag": "<a data-cy=\"contact-text-1\" href=\"contact.html\">Lorem ipsum dolor sit amet, consectetur adipiscing elit.</a>"
    },
    {
      "selector": "[data-cy=\"contact-text-2\"]",
      "tag": "<a data-cy=\"contact-text-2\" href=\"contact.html\">Pellentesque et pulvinar enim. Quisque at tempor ligula</a>"
    },
    {
      "selector": "[data-cy=\"contact-text-3\"]",
      "tag": "<a data-cy=\"contact-text-3\" href=\"contact.html\">Natus sit voluptatem accusantium doloremque</a>"
    },
    {
      "selector": "[data-cy=\"contact-text-4\"]",
      "tag": "<a data-cy=\"contact-text-4\" href=\"contact.html\">Lorem ipsum dolor sit amet, consectetur adipiscing elit.</a>"
    },
    {
      "selector": "[data-cy=\"contact-text-5\"]",
      "tag": "<a data-cy=\"contact-text-5\" href=\"contact.html\">Pellentesque et pulvinar enim. Quisque at tempor ligula</a>"
    },
    {
      "selector": "[data-cy=\"contact-text-6\"]",
      "tag": "<a data-cy=\"contact-text-6\" href=\"contact.html\">Natus sit voluptatem accusantium doloremque</a>"
    },
    {
      "selector": "[data-cy=\"contact-WebThemez\"]",
      "tag": "<a href=\"http://webthemez.com\" data-cy=\"contact-WebThemez\" target=\"_blank\">WebThemez</a>"
    },
    {
      "selector": "[data-cy=\"contact-facebook\"]",
      "tag": "<a data-cy=\"contact-facebook\" href=\"contact.html\" data-placement=\"top\" title=\"\" data-original-title=\"Facebook\"><i class=\"fa fa-facebook\"></i></a>"
    },
    {
      "selector": "[data-cy=\"contact-twitter\"]",
      "tag": "<a data-cy=\"contact-twitter\" href=\"contact.html\" data-placement=\"top\" title=\"\" data-original-title=\"Twitter\"><i class=\"fa fa-twitter\"></i></a>"
    },
    {
      "selector": "[data-cy=\"contact-linkedin\"]",
      "tag": "<a data-cy=\"contact-linkedin\" href=\"contact.html\" data-placement=\"top\" title=\"\" data-original-title=\"Linkedin\"><i class=\"fa fa-linkedin\"></i></a>"
    },
    {
      "selector": "[data-cy=\"contact-pinterest\"]",
      "tag": "<a data-cy=\"contact-pinterest\" href=\"contact.html\" data-placement=\"top\" title=\"\" data-original-title=\"Pinterest\"><i class=\"fa fa-pinterest\"></i></a>"
    },
    {
      "selector": "[data-cy=\"contact-google\"]",
      "tag": "<a data-cy=\"contact-google\" href=\"contact.html\" data-placement=\"top\" title=\"\" data-original-title=\"Google plus\"><i class=\"fa fa-google-plus\"></i></a>"
    },
    {
      "selector": "[data-cy=\"contact-angle-up\"]",
      "tag": "<a data-cy=\"contact-angle-up\" href=\"contact.html\" class=\"scrollup\"><i class=\"fa fa-angle-up active\"></i></a>"
    },
    {
      "selector": "[data-cy=\"name-input\"]",
      "tag": "<input type=\"text\" class=\"form-control\" name=\"name\" placeholder=\"\" data-cy=\"name-input\">"
    },
    {
      "selector": "[data-cy=\"email-input\"]",
      "tag": "<input type=\"email\" class=\"form-control\" name=\"email\" placeholder=\"\" data-cy=\"email-input\">"
    },
    {
      "selector": "[data-cy=\"message-textarea\"]",
      "tag": "<textarea class=\"form-control\" rows=\"6\" name=\"comment\" placeholder=\"\" data-cy=\"message-textarea\"></textarea>"
    },
    {
      "selector": "[data-cy=\"submit-input\"]",
      "tag": "<input data-cy=\"submit-input\" value=\"Submit\" id=\"submit\" class=\"submit btn btn-default\">"
    }
  ],
  "http://localhost:9997/index.html": [
    {
      "selector": "[data-cy=\"index-navbar-toggle\"]",
      "tag": "<button type=\"button\" class=\"navbar-toggle\" data-toggle=\"collapse\" data-target=\".navbar-collapse\" data-cy=\"index-navbar-toggle\">\n                        <span class=\"icon-bar\"></span>\n                        <span class=\"icon-bar\"></span>\n                        <span class=\"icon-bar\"></span>\n                    </button>"
    },
    {
      "selector": "[data-cy=\"index-navbar-brand\"]",
      "tag": "<img src=\"img/logo.png\" alt=\"logo\" data-cy=\"index-navbar-brand\">"
    },
    {
      "selector": "[data-cy=\"index-index\"]",
      "tag": "<a href=\"index.html\" data-cy=\"index-index\">Home</a>"
    },
    {
      "selector": "[data-cy=\"index-about\"]",
      "tag": "<a href=\"about.html\" data-cy=\"index-about\">About Us</a>"
    },
    {
      "selector": "[data-cy=\"index-services\"]",
      "tag": "<a href=\"services.html\" data-cy=\"index-services\">Services</a>"
    },
    {
      "selector": "[data-cy=\"index-courses\"]",
      "tag": "<a href=\"courses.html\" data-cy=\"index-courses\">Courses</a>"
    },
    {
      "selector": "[data-cy=\"index-pricing\"]",
      "tag": "<a href=\"pricing.html\" data-cy=\"index-pricing\">Pricing</a>"
    },
    {
      "selector": "[data-cy=\"index-contact\"]",
      "tag": "<a href=\"contact.html\" data-cy=\"index-contact\">Contact</a>"
    },
    {
      "selector": "[data-cy=\"index-read-more-1\"]",
      "tag": "<a href=\"index.html\" class=\"btn btn-theme\" data-cy=\"index-read-more-1\">Read More</a>"
    },
    {
      "selector": "[data-cy=\"index-read-more-2\"]",
      "tag": "<a href=\"index.html\" class=\"btn btn-theme\" data-cy=\"index-read-more-2\">Read More</a>"
    },
    {
      "selector": "[data-cy=\"index-img-1\"]",
      "tag": "<a href=\"index.html\" data-cy=\"index-img-1\">\n                            <time datetime=\"2015-03-01\">\n                                <span class=\"year\">2015</span>\n                                <span class=\"month\">Feb</span>\n                            </time>\n                            <p>Lorem ipsum dolor sit amet, consectetur adipis.</p>\n                        </a>"
    },
    {
      "selector": "[data-cy=\"index-img-2\"]",
      "tag": "<a href=\"index.html\" data-cy=\"index-img-2\">\n                            <time datetime=\"2015-03-01\">\n                                <span class=\"year\">2015</span>\n                                <span class=\"month\">March</span>\n                            </time>\n                            <p>Apsum dolor sit amet, consectetur adipisdslif.</p>\n                        </a>"
    },
    {
      "selector": "[data-cy=\"index-img-3\"]",
      "tag": "<a href=\"index.html\" data-cy=\"index-img-3\">\n                            <time datetime=\"2015-03-01\">\n                                <span class=\"year\">2015</span>\n                                <span class=\"month\">April</span>\n                            </time>\n                            <p>Dolor sit amet, consectetur adipisic indfeft</p>\n                        </a>"
    },
    {
      "selector": "[data-cy=\"index-events\"]",
      "tag": "<a data-cy=\"index-events\" href=\"index.html\">Latest Events</a>"
    },
    {
      "selector": "[data-cy=\"index-terms\"]",
      "tag": "<a data-cy=\"index-terms\" href=\"index.html\">Terms and conditions</a>"
    },
    {
      "selector": "[data-cy=\"index-privacy\"]",
      "tag": "<a data-cy=\"index-privacy\" href=\"index.html\">Privacy policy</a>"
    },
    {
      "selector": "[data-cy=\"index-career\"]",
      "tag": "<a data-cy=\"index-career\" href=\"index.html\">Career</a>"
    },
    {
      "selector": "[data-cy=\"index-contact-us\"]",
      "tag": "<a data-cy=\"index-contact-us\" href=\"index.html\">Contact us</a>"
    },
    {
      "selector": "[data-cy=\"index-text-1\"]",
      "tag": "<a data-cy=\"index-text-1\" href=\"index.html\">Lorem ipsum dolor sit amet, consectetur adipiscing elit.</a>"
    },
    {
      "selector": "[data-cy=\"index-text-2\"]",
      "tag": "<a data-cy=\"index-text-2\" href=\"index.html\">Pellentesque et pulvinar enim. Quisque at tempor ligula</a>"
    },
    {
      "selector": "[data-cy=\"index-text-3\"]",
      "tag": "<a data-cy=\"index-text-3\" href=\"index.html\">Natus sit voluptatem accusantium doloremque</a>"
    },
    {
      "selector": "[data-cy=\"index-text-4\"]",
      "tag": "<a data-cy=\"index-text-4\" href=\"index.html\">Lorem ipsum dolor sit amet, consectetur adipiscing elit.</a>"
    },
    {
      "selector": "[data-cy=\"index-text-5\"]",
      "tag": "<a data-cy=\"index-text-5\" href=\"index.html\">Pellentesque et pulvinar enim. Quisque at tempor ligula</a>"
    },
    {
      "selector": "[data-cy=\"index-text-6\"]",
      "tag": "<a data-cy=\"index-text-6\" href=\"index.html\">Natus sit voluptatem accusantium doloremque</a>"
    },
    {
      "selector": "[data-cy=\"index-WebThemez\"]",
      "tag": "<a data-cy=\"index-WebThemez\" href=\"http://webthemez.com\" target=\"_blank\">WebThemez</a>"
    },
    {
      "selector": "[data-cy=\"index-facebook\"]",
      "tag": "<a data-cy=\"index-facebook\" href=\"index.html\" data-placement=\"top\" title=\"\" data-original-title=\"Facebook\"><i class=\"fa fa-facebook\"></i></a>"
    },
    {
      "selector": "[data-cy=\"index-twitter\"]",
      "tag": "<a data-cy=\"index-twitter\" href=\"index.html\" data-placement=\"top\" title=\"\" data-original-title=\"Twitter\"><i class=\"fa fa-twitter\"></i></a>"
    },
    {
      "selector": "[data-cy=\"index-linkedin\"]",
      "tag": "<a data-cy=\"index-linkedin\" href=\"index.html\" data-placement=\"top\" title=\"\" data-original-title=\"Linkedin\"><i class=\"fa fa-linkedin\"></i></a>"
    },
    {
      "selector": "[data-cy=\"index-pinterest\"]",
      "tag": "<a data-cy=\"index-pinterest\" href=\"index.html\" data-placement=\"top\" title=\"\" data-original-title=\"Pinterest\"><i class=\"fa fa-pinterest\"></i></a>"
    },
    {
      "selector": "[data-cy=\"index-google\"]",
      "tag": "<a data-cy=\"index-google\" href=\"index.html\" data-placement=\"top\" title=\"\" data-original-title=\"Google plus\"><i class=\"fa fa-google-plus\"></i></a>"
    },
    {
      "selector": "[data-cy=\"index-angle-up\"]",
      "tag": "<a href=\"index.html\" data-cy=\"index-angle-up\" class=\"scrollup\"><i class=\"fa fa-angle-up active\"></i></a>"
    }
  ]
}