{
  "site_name": "lrn",
  "title": "lrn: open source software",
  "description": "for pedagogically superior education",
  "url": "https://www.lrn.software",
  "locale": "en",
  "author": "Anonymous"
}
