^D:\ZTU - WARNING! DONT OPEN!\2 - ООП\SHEVCHENKO-OOP\LAB 2\LAB 2-1\LAB 2-1\DEBUG\LAB 2-1.OBJ|D:\ZTU - WARNING! DONT OPEN!\2 - ООП\SHEVCHENKO-OOP\LAB 2\LAB 2-1\LAB 2-1\DEBUG\STDAFX.OBJ
D:\ZTU - WARNING! DONT OPEN!\2 - ООП\SHEVCHENKO-OOP\LAB 2\LAB 2-1\DEBUG\LAB 2-1.ILK
D:\ZTU - WARNING! DONT OPEN!\2 - ООП\SHEVCHENKO-OOP\LAB 2\LAB 2-1\DEBUG\LAB 2-1.EXE
D:\ZTU - WARNING! DONT OPEN!\2 - ООП\SHEVCHENKO-OOP\LAB 2\LAB 2-1\DEBUG\LAB 2-1.PDB
